axis-java-dev mailing list archives

Site index · List index
Message view « Date » · « Thread »
Top « Date » · « Thread »
From "Katherine Sanders (JIRA)" <j...@apache.org>
Subject [jira] Commented: (AXIS2-4696) Axis2 build broken on JDK 1.6 by r937604
Date Fri, 30 Apr 2010 12:48:55 GMT

    [ https://issues.apache.org/jira/browse/AXIS2-4696?page=com.atlassian.jira.plugin.system.issuetabpanels:comment-tabpanel&focusedCommentId=12862654#action_12862654
] 

Katherine Sanders commented on AXIS2-4696:
------------------------------------------

Ah I see.  Yes you're right, I can build the latest level without errors with JDK 1.6.0_16
now.

> Axis2 build broken on JDK 1.6 by r937604
> ----------------------------------------
>
>                 Key: AXIS2-4696
>                 URL: https://issues.apache.org/jira/browse/AXIS2-4696
>             Project: Axis2
>          Issue Type: Bug
>         Environment: Apache Maven 2.0.11 (r909250; 2010-02-12 05:55:50+0000)
> Java version: 1.6.0_16
> Java home: C:\Program Files\Java\jdk1.6.0_16\jre
> Default locale: en_GB, platform encoding: Cp1252
> OS name: "windows xp" version: "5.1" arch: "x86" Family: "windows"
>            Reporter: Katherine Sanders
>            Priority: Minor
>
> If you build the latest revision of axis2 using JDK 1.6, there are 2 test failures in
the jaxws-integration module:
> -------------------------------------------------------------------------------
> Test set: org.apache.axis2.jaxws.provider.AddressingProviderTests
> -------------------------------------------------------------------------------
> Tests run: 3, Failures: 0, Errors: 2, Skipped: 0, Time elapsed: 5.796 sec <<<
FAILURE!
> testInjectAddressingHeaders(org.apache.axis2.jaxws.provider.AddressingProviderTests)
 Time elapsed: 0.672 sec  <<< ERROR!
> javax.xml.ws.soap.SOAPFaultException: The [action] cannot be processed at the receiver.
> 	at org.apache.axis2.jaxws.marshaller.impl.alt.MethodMarshallerUtils.createSystemException(MethodMarshallerUtils.java:1326)
> 	at org.apache.axis2.jaxws.client.dispatch.BaseDispatch.getFaultResponse(BaseDispatch.java:618)
> 	at org.apache.axis2.jaxws.client.dispatch.BaseDispatch.invoke(BaseDispatch.java:186)
> 	at org.apache.axis2.jaxws.provider.AddressingProviderTests.testInjectAddressingHeaders(AddressingProviderTests.java:90)
> 	at sun.reflect.NativeMethodAccessorImpl.invoke0(Native Method)
> 	at sun.reflect.NativeMethodAccessorImpl.invoke(NativeMethodAccessorImpl.java:39)
> 	at sun.reflect.DelegatingMethodAccessorImpl.invoke(DelegatingMethodAccessorImpl.java:25)
> 	at java.lang.reflect.Method.invoke(Method.java:597)
> 	at junit.framework.TestCase.runTest(TestCase.java:168)
> 	at junit.framework.TestCase.runBare(TestCase.java:134)
> 	at junit.framework.TestResult$1.protect(TestResult.java:110)
> 	at junit.framework.TestResult.runProtected(TestResult.java:128)
> 	at junit.framework.TestResult.run(TestResult.java:113)
> 	at junit.framework.TestCase.run(TestCase.java:124)
> 	at junit.framework.TestSuite.runTest(TestSuite.java:232)
> 	at junit.framework.TestSuite.run(TestSuite.java:227)
> 	at junit.extensions.TestDecorator.basicRun(TestDecorator.java:24)
> 	at junit.extensions.TestSetup$1.protect(TestSetup.java:23)
> 	at junit.framework.TestResult.runProtected(TestResult.java:128)
> 	at junit.extensions.TestSetup.run(TestSetup.java:27)
> 	at org.junit.internal.runners.JUnit38ClassRunner.run(JUnit38ClassRunner.java:81)
> 	at org.apache.maven.surefire.junit4.JUnit4TestSet.execute(JUnit4TestSet.java:62)
> 	at org.apache.maven.surefire.suite.AbstractDirectoryTestSuite.executeTestSet(AbstractDirectoryTestSuite.java:140)
> 	at org.apache.maven.surefire.suite.AbstractDirectoryTestSuite.execute(AbstractDirectoryTestSuite.java:165)
> 	at org.apache.maven.surefire.Surefire.run(Surefire.java:107)
> 	at sun.reflect.NativeMethodAccessorImpl.invoke0(Native Method)
> 	at sun.reflect.NativeMethodAccessorImpl.invoke(NativeMethodAccessorImpl.java:39)
> 	at sun.reflect.DelegatingMethodAccessorImpl.invoke(DelegatingMethodAccessorImpl.java:25)
> 	at java.lang.reflect.Method.invoke(Method.java:597)
> 	at org.apache.maven.surefire.booter.SurefireBooter.runSuitesInProcess(SurefireBooter.java:289)
> 	at org.apache.maven.surefire.booter.SurefireBooter.main(SurefireBooter.java:993)
> testWithAddressingHeaders(org.apache.axis2.jaxws.provider.AddressingProviderTests)  Time
elapsed: 0.047 sec  <<< ERROR!
> javax.xml.ws.soap.SOAPFaultException: The [action] cannot be processed at the receiver.
> 	at org.apache.axis2.jaxws.marshaller.impl.alt.MethodMarshallerUtils.createSystemException(MethodMarshallerUtils.java:1326)
> 	at org.apache.axis2.jaxws.client.dispatch.BaseDispatch.getFaultResponse(BaseDispatch.java:618)
> 	at org.apache.axis2.jaxws.client.dispatch.BaseDispatch.invoke(BaseDispatch.java:186)
> 	at org.apache.axis2.jaxws.provider.AddressingProviderTests.testWithAddressingHeaders(AddressingProviderTests.java:122)
> 	at sun.reflect.NativeMethodAccessorImpl.invoke0(Native Method)
> 	at sun.reflect.NativeMethodAccessorImpl.invoke(NativeMethodAccessorImpl.java:39)
> 	at sun.reflect.DelegatingMethodAccessorImpl.invoke(DelegatingMethodAccessorImpl.java:25)
> 	at java.lang.reflect.Method.invoke(Method.java:597)
> 	at junit.framework.TestCase.runTest(TestCase.java:168)
> 	at junit.framework.TestCase.runBare(TestCase.java:134)
> 	at junit.framework.TestResult$1.protect(TestResult.java:110)
> 	at junit.framework.TestResult.runProtected(TestResult.java:128)
> 	at junit.framework.TestResult.run(TestResult.java:113)
> 	at junit.framework.TestCase.run(TestCase.java:124)
> 	at junit.framework.TestSuite.runTest(TestSuite.java:232)
> 	at junit.framework.TestSuite.run(TestSuite.java:227)
> 	at junit.extensions.TestDecorator.basicRun(TestDecorator.java:24)
> 	at junit.extensions.TestSetup$1.protect(TestSetup.java:23)
> 	at junit.framework.TestResult.runProtected(TestResult.java:128)
> 	at junit.extensions.TestSetup.run(TestSetup.java:27)
> 	at org.junit.internal.runners.JUnit38ClassRunner.run(JUnit38ClassRunner.java:81)
> 	at org.apache.maven.surefire.junit4.JUnit4TestSet.execute(JUnit4TestSet.java:62)
> 	at org.apache.maven.surefire.suite.AbstractDirectoryTestSuite.executeTestSet(AbstractDirectoryTestSuite.java:140)
> 	at org.apache.maven.surefire.suite.AbstractDirectoryTestSuite.execute(AbstractDirectoryTestSuite.java:165)
> 	at org.apache.maven.surefire.Surefire.run(Surefire.java:107)
> 	at sun.reflect.NativeMethodAccessorImpl.invoke0(Native Method)
> 	at sun.reflect.NativeMethodAccessorImpl.invoke(NativeMethodAccessorImpl.java:39)
> 	at sun.reflect.DelegatingMethodAccessorImpl.invoke(DelegatingMethodAccessorImpl.java:25)
> 	at java.lang.reflect.Method.invoke(Method.java:597)
> 	at org.apache.maven.surefire.booter.SurefireBooter.runSuitesInProcess(SurefireBooter.java:289)
> 	at org.apache.maven.surefire.booter.SurefireBooter.main(SurefireBooter.java:993)
> These failures were introduced by r937604 which fixed the build on JDK 1.5, so any fix
for this issue should test on both JDKs.  The build succeeds with JDK 1.5.0_16 and maven 2.0.11.

-- 
This message is automatically generated by JIRA.
-
You can reply to this email to add a comment to the issue online.


---------------------------------------------------------------------
To unsubscribe, e-mail: java-dev-unsubscribe@axis.apache.org
For additional commands, e-mail: java-dev-help@axis.apache.org


Mime
View raw message