axis-java-dev mailing list archives

Site index · List index
Message view « Date » · « Thread »
Top « Date » · « Thread »
From José Ricardo da Silva <dasilva.jo...@gmail.com>
Subject Axis2 1.5 beta 2 fails during the building of the Scripting module
Date Mon, 30 Mar 2009 14:01:40 GMT
Hi, I tried to build the Axis2 1.5 beta 2 again, but now it fails
during the building of the scripting module:

-----------------------------------------------------------------------------------------------------------------------------------

[INFO] Building Apache Axis2 - Scripting
[INFO]    task-segment: [install]
[INFO] ------------------------------------------------------------------------
[INFO] [resources:resources]
[INFO] Using default encoding to copy filtered resources.
[INFO] [compiler:compile]
[INFO] Nothing to compile - all classes are up to date
[INFO] [resources:testResources]
[INFO] Using default encoding to copy filtered resources.
[INFO] [compiler:testCompile]
[INFO] Nothing to compile - all classes are up to date
[INFO] [surefire:test]
[INFO] Surefire report directory:
/home/researcher/Sources/axis2-1.5-beta-2/modules/scripting/target/surefire-reports

-------------------------------------------------------
 T E S T S
-------------------------------------------------------
Running org.apache.axis2.scripting.convertors.JSOMElementConvertorTest
Tests run: 2, Failures: 0, Errors: 2, Skipped: 0, Time elapsed: 0.65
sec <<< FAILURE!
Running org.apache.axis2.scripting.ScriptReceiverTest
Tests run: 2, Failures: 0, Errors: 2, Skipped: 0, Time elapsed: 0.044
sec <<< FAILURE!

Results :

Tests in error:
  testToAndFromScript(org.apache.axis2.scripting.convertors.JSOMElementConvertorTest)
  testFromScript(org.apache.axis2.scripting.convertors.JSOMElementConvertorTest)
  testInvokeBusinessLogic(org.apache.axis2.scripting.ScriptReceiverTest)
  testAxisService(org.apache.axis2.scripting.ScriptReceiverTest)

Tests run: 4, Failures: 0, Errors: 4, Skipped: 0

[INFO] ------------------------------------------------------------------------
[ERROR] BUILD FAILURE
[INFO] ------------------------------------------------------------------------
[INFO] There are test failures.

Please refer to
/home/researcher/Sources/axis2-1.5-beta-2/modules/scripting/target/surefire-reports
for the individual test results.
[INFO] ------------------------------------------------------------------------
[INFO] Trace
org.apache.maven.BuildFailureException: There are test failures.

Please refer to
/home/researcher/Sources/axis2-1.5-beta-2/modules/scripting/target/surefire-reports
for the individual test results.
	at org.apache.maven.lifecycle.DefaultLifecycleExecutor.executeGoals(DefaultLifecycleExecutor.java:579)
	at org.apache.maven.lifecycle.DefaultLifecycleExecutor.executeGoalWithLifecycle(DefaultLifecycleExecutor.java:499)
	at org.apache.maven.lifecycle.DefaultLifecycleExecutor.executeGoal(DefaultLifecycleExecutor.java:478)
	at org.apache.maven.lifecycle.DefaultLifecycleExecutor.executeGoalAndHandleFailures(DefaultLifecycleExecutor.java:330)
	at org.apache.maven.lifecycle.DefaultLifecycleExecutor.executeTaskSegments(DefaultLifecycleExecutor.java:291)
	at org.apache.maven.lifecycle.DefaultLifecycleExecutor.execute(DefaultLifecycleExecutor.java:142)
	at org.apache.maven.DefaultMaven.doExecute(DefaultMaven.java:336)
	at org.apache.maven.DefaultMaven.execute(DefaultMaven.java:129)
	at org.apache.maven.cli.MavenCli.main(MavenCli.java:287)
	at sun.reflect.NativeMethodAccessorImpl.invoke0(Native Method)
	at sun.reflect.NativeMethodAccessorImpl.invoke(NativeMethodAccessorImpl.java:57)
	at sun.reflect.DelegatingMethodAccessorImpl.invoke(DelegatingMethodAccessorImpl.java:43)
	at java.lang.reflect.Method.invoke(Method.java:616)
	at org.codehaus.classworlds.Launcher.launchEnhanced(Launcher.java:315)
	at org.codehaus.classworlds.Launcher.launch(Launcher.java:255)
	at org.codehaus.classworlds.Launcher.mainWithExitCode(Launcher.java:430)
	at org.codehaus.classworlds.Launcher.main(Launcher.java:375)
Caused by: org.apache.maven.plugin.MojoFailureException: There are
test failures.

Please refer to
/home/researcher/Sources/axis2-1.5-beta-2/modules/scripting/target/surefire-reports
for the individual test results.
	at org.apache.maven.plugin.surefire.SurefirePlugin.execute(SurefirePlugin.java:530)
	at org.apache.maven.plugin.DefaultPluginManager.executeMojo(DefaultPluginManager.java:451)
	at org.apache.maven.lifecycle.DefaultLifecycleExecutor.executeGoals(DefaultLifecycleExecutor.java:558)
	... 16 more
[INFO] ------------------------------------------------------------------------
[INFO] Total time: 3 minutes 38 seconds
[INFO] Finished at: Mon Mar 30 09:40:35 AMT 2009
[INFO] Final Memory: 35M/93M
[INFO] ------------------------------------------------------------------------


-----------------------------------------------------------------------------------------------------------------------------------

I first built the mar and aar modules and then typed "mvn install" in
the main directory. Am I doing something wrong?

Best Regards,

José Ricardo.

Mime
View raw message