axis-java-dev mailing list archives

Site index · List index
Message view « Date » · « Thread »
Top « Date » · « Thread »
From "Davanum Srinivas (JIRA)" <j...@apache.org>
Subject [jira] Reopened: (AXIS2-3479) [Break] MtomSampleTests - The org.apache.axis2.jaxws.sample.MtomSampleTests suite is failing
Date Tue, 18 Mar 2008 16:15:24 GMT

     [ https://issues.apache.org/jira/browse/AXIS2-3479?page=com.atlassian.jira.plugin.system.issuetabpanels:all-tabpanel
]

Davanum Srinivas reopened AXIS2-3479:
-------------------------------------


Rich,

https://svn.apache.org/viewvc?view=rev&revision=638383 causes a build break.

org.apache.axis2.jaxws.dispatch.SOAP12DispatchTest.txt:Tests run: 4, Failures: 0, Errors:
4, Skipped: 0, Time elapsed: 8.89 sec <<< FAILURE!
org.apache.axis2.jaxws.dispatch.SOAPMessageDispatchTests.txt:Tests run: 3, Failures: 1, Errors:
2, Skipped: 0, Time elapsed: 11.687 sec <<< FAILURE!
org.apache.axis2.jaxws.provider.JAXBProviderTests.txt:Tests run: 2, Failures: 0, Errors: 2,
Skipped: 0, Time elapsed: 8.937 sec <<< FAILURE!
org.apache.axis2.jaxws.provider.SourceProviderTests.txt:Tests run: 10, Failures: 1, Errors:
9, Skipped: 0, Time elapsed: 9.328 sec <<< FAILURE!
org.apache.axis2.jaxws.provider.StringMessageProviderTests.txt:Tests run: 1, Failures: 0,
Errors: 1, Skipped: 0, Time elapsed: 8.718 sec <<< FAILURE!
org.apache.axis2.jaxws.provider.StringProviderTests.txt:Tests run: 8, Failures: 0, Errors:
8, Skipped: 0, Time elapsed: 9.11 sec <<< FAILURE!
org.apache.axis2.jaxws.proxy.ProxyNonWrappedTests.txt:Tests run: 4, Failures: 0, Errors: 2,
Skipped: 0, Time elapsed: 10.703 sec <<< FAILURE!
org.apache.axis2.jaxws.security.BasicAuthSecurityTests.txt:Tests run: 4, Failures: 0, Errors:
3, Skipped: 0, Time elapsed: 16.719 sec <<< FAILURE!
org.apache.axis2.jaxws.dispatch.SOAPMessageDispatchTests.txt:Tests run: 3, Failures: 1, Errors:
2, Skipped: 0, Time elapsed: 11.687 sec <<< FAILURE!
org.apache.axis2.jaxws.provider.SOAPFaultProviderTests.txt:Tests run: 1, Failures: 1, Errors:
0, Skipped: 0, Time elapsed: 10.765 sec <<< FAILURE!
org.apache.axis2.jaxws.provider.SourceMessageProviderTests.txt:Tests run: 1, Failures: 1,
Errors: 0, Skipped: 0, Time elapsed: 8.546 sec <<< FAILURE!
org.apache.axis2.jaxws.provider.SourceProviderTests.txt:Tests run: 10, Failures: 1, Errors:
9, Skipped: 0, Time elapsed: 9.328 sec <<< FAILURE!
org.apache.axis2.jaxws.proxy.ProxyTests.txt:Tests run: 11, Failures: 4, Errors: 0, Skipped:
0, Time elapsed: 15.312 sec <<< FAILURE!

Reverting it for now..

thanks,
dims

> [Break] MtomSampleTests - The org.apache.axis2.jaxws.sample.MtomSampleTests suite is
failing
> --------------------------------------------------------------------------------------------
>
>                 Key: AXIS2-3479
>                 URL: https://issues.apache.org/jira/browse/AXIS2-3479
>             Project: Axis 2.0 (Axis2)
>          Issue Type: Bug
>          Components: jaxws
>            Reporter: Brian DePradine
>            Assignee: Rich Scheuerle
>            Priority: Critical
>             Fix For: 1.4
>
>
> It keeps failing whenever I run a maven build, but when I run it on it's own, inside
Eclipse, it passes every time! To get around this issue I have commented out that test for
now. The failure I get is captured below.
> testSendImageAttachmentProperty12(org.apache.axis2.jaxws.sample.MtomSampleTests)  Time
elapsed: 0.219 sec  <<< FAILURE!
> junit.framework.AssertionFailedError: Was expecting an exception due to sending SOAP12
message to SOAP11 endpoint.
> 	at junit.framework.Assert.fail(Assert.java:47)
> 	at org.apache.axis2.jaxws.sample.MtomSampleTests.testSendImageAttachmentProperty12(MtomSampleTests.java:224)
> 	at sun.reflect.NativeMethodAccessorImpl.invoke0(Native Method)
> 	at sun.reflect.NativeMethodAccessorImpl.invoke(NativeMethodAccessorImpl.java:39)
> 	at sun.reflect.DelegatingMethodAccessorImpl.invoke(DelegatingMethodAccessorImpl.java:25)
> 	at java.lang.reflect.Method.invoke(Method.java:585)
> 	at junit.framework.TestCase.runTest(TestCase.java:168)
> 	at junit.framework.TestCase.runBare(TestCase.java:134)
> 	at junit.framework.TestResult$1.protect(TestResult.java:110)
> 	at junit.framework.TestResult.runProtected(TestResult.java:128)
> 	at junit.framework.TestResult.run(TestResult.java:113)
> 	at junit.framework.TestCase.run(TestCase.java:124)
> 	at junit.framework.TestSuite.runTest(TestSuite.java:232)
> 	at junit.framework.TestSuite.run(TestSuite.java:227)
> 	at junit.framework.TestSuite.runTest(TestSuite.java:232)
> 	at junit.framework.TestSuite.run(TestSuite.java:227)
> 	at junit.extensions.TestDecorator.basicRun(TestDecorator.java:24)
> 	at junit.extensions.TestSetup$1.protect(TestSetup.java:23)
> 	at junit.framework.TestResult.runProtected(TestResult.java:128)
> 	at junit.extensions.TestSetup.run(TestSetup.java:27)
> 	at org.junit.internal.runners.OldTestClassRunner.run(OldTestClassRunner.java:76)
> 	at org.apache.maven.surefire.junit4.JUnit4TestSet.execute(JUnit4TestSet.java:62)
> 	at org.apache.maven.surefire.suite.AbstractDirectoryTestSuite.executeTestSet(AbstractDirectoryTestSuite.java:138)
> 	at org.apache.maven.surefire.suite.AbstractDirectoryTestSuite.execute(AbstractDirectoryTestSuite.java:125)
> 	at org.apache.maven.surefire.Surefire.run(Surefire.java:132)
> 	at sun.reflect.NativeMethodAccessorImpl.invoke0(Native Method)
> 	at sun.reflect.NativeMethodAccessorImpl.invoke(NativeMethodAccessorImpl.java:39)
> 	at sun.reflect.DelegatingMethodAccessorImpl.invoke(DelegatingMethodAccessorImpl.java:25)
> 	at java.lang.reflect.Method.invoke(Method.java:585)
> 	at org.apache.maven.surefire.booter.SurefireBooter.runSuitesInProcess(SurefireBooter.java:290)
> 	at org.apache.maven.surefire.booter.SurefireBooter.main(SurefireBooter.java:818)
> Now that I think about it the test is probably passing in Eclipse because it does not
check what exception gets thrown, so I am not sure that the exception that is being thrown
is the 'expected' one.

-- 
This message is automatically generated by JIRA.
-
You can reply to this email to add a comment to the issue online.


---------------------------------------------------------------------
To unsubscribe, e-mail: axis-dev-unsubscribe@ws.apache.org
For additional commands, e-mail: axis-dev-help@ws.apache.org


Mime
View raw message