axis-java-dev mailing list archives

Site index · List index
Message view « Date » · « Thread »
Top « Date » · « Thread »
From "davidillsley (Continuum)" <davidills...@apache.org>
Subject [Axis2][continuum] BUILD FAILURE
Date Sun, 01 Jul 2007 08:07:54 GMT
Online report : http://ws.zones.apache.org:10000/continuum/servlet/continuum/target/ProjectBuild.vm/view/ProjectBuild/id/1/buildId/2605
Build statistics:
  State: Failed
  Previous State: Ok
  Started at: Sun, 1 Jul 2007 08:01:58 +0000
  Finished at: Sun, 1 Jul 2007 08:07:33 +0000
  Total time: 5m 35s
  Build Trigger: Schedule
  Exit code: 70
  Building machine hostname: ws.zones.apache.org
  Operating system : SunOS(unknown)
  Java version : 1.5.0_09(Sun Microsystems Inc.)

Changes
         amilas          test case to test the decimal types

             /webservices/axis2/trunk/java/modules/adb-codegen/sub-build.xml
            /webservices/axis2/trunk/java/modules/adb-codegen/test/org/apache/axis2/schema/decimal
            /webservices/axis2/trunk/java/modules/adb-codegen/test/org/apache/axis2/schema/decimal/DecimalTest.java
           amilas          fixed some issue with multi service code gen

             /webservices/axis2/trunk/java/modules/codegen/src/org/apache/axis2/wsdl/codegen/emitter/AxisServiceBasedMultiLanguageEmitter.java
            /webservices/axis2/trunk/java/modules/kernel/src/org/apache/axis2/description/WSDL11ToAllAxisServicesBuilder.java
        
****************************************************************************
Output:
****************************************************************************
Snipped Output:
NAPSHOT.jar.
Skipping download as local copy is up to date!
build:start:

multiproject:install-callback:
    [echo] Running jar:install for Apache Axis 2.0 - ADB Codegen
java:prepare-filesystem:
    [mkdir] Created dir: /export/home/illsleyd/continuum/continuum-1.0.3/apps/continuum/working-directory/1/modules/adb-codegen/target/classes
Running post goal: java:prepare-filesystem

java:compile:
    [echo] Compiling to /export/home/illsleyd/continuum/continuum-1.0.3/apps/continuum/working-directory/1/modules/adb-codegen/target/classes
    [javac] Compiling 17 source files to /export/home/illsleyd/continuum/continuum-1.0.3/apps/continuum/working-directory/1/modules/adb-codegen/target/classes

java:jar-resources:
Copying 8 files to /export/home/illsleyd/continuum/continuum-1.0.3/apps/continuum/working-directory/1/modules/adb-codegen/target/classes
Copying 2 files to /export/home/illsleyd/continuum/continuum-1.0.3/apps/continuum/working-directory/1/modules/adb-codegen/target/classes/META-INF

test:test:
java:prepare-filesystem:
Running post goal: java:prepare-filesystem

java:compile:
    [echo] Compiling to /export/home/illsleyd/continuum/continuum-1.0.3/apps/continuum/working-directory/1/modules/adb-codegen/target/classes

java:jar-resources:

test:prepare-filesystem:
    [mkdir] Created dir: /export/home/illsleyd/continuum/continuum-1.0.3/apps/continuum/working-directory/1/modules/adb-codegen/target/test-classes
    [mkdir] Created dir: /export/home/illsleyd/continuum/continuum-1.0.3/apps/continuum/working-directory/1/modules/adb-codegen/target/test-reports

test:test-resources:
Copying 45 files to /export/home/illsleyd/continuum/continuum-1.0.3/apps/continuum/working-directory/1/modules/adb-codegen/target/test-classes
Copying 8 files to /export/home/illsleyd/continuum/continuum-1.0.3/apps/continuum/working-directory/1/modules/adb-codegen/target/test-classes

test:compile:
    [mkdir] Created dir: /export/home/illsleyd/continuum/continuum-1.0.3/apps/continuum/working-directory/1/modules/adb-codegen/target/schema
    [mkdir] Created dir: /export/home/illsleyd/continuum/continuum-1.0.3/apps/continuum/working-directory/1/modules/adb-codegen/target/schema/src
    [mkdir] Created dir: /export/home/illsleyd/continuum/continuum-1.0.3/apps/continuum/working-directory/1/modules/adb-codegen/target/schema/classes
    [echo] Compiling simple_maxOccurs2.xsd
    [echo] Compiling anonymous_complexType.xsd
    [echo] Compiling simple_choice.xsd
    [echo] Compiling simple_particle_all.xsd
    [echo] Compiling simple_maxOccurs.xsd
    [echo] Compiling simple_anytype.xsd
    [echo] Compiling simple-minoccurs0.xsd
    [echo] Compiling complex-minoccurs0.xsd
    [echo] Compiling simple-recursive-datatypes.xsd
    [echo] Compiling mixed_minoccus0.xsd
    [echo] Compiling complete.xsd
    [echo] Compiling simpleExtension.xsd
    [echo] Compiling union.xsd
    [echo] Compiling all.xsd
    [echo] Compiling enumeration.xsd
    [echo] Compiling restrictions.xsd
    [echo] Compiling choice.xsd
    [echo] Compiling list.xsd
    [echo] Compiling element_references.xsd
    [echo] Compiling innersequence_choice.xsd
    [echo] Compiling testattribute.xsd
    [echo] Compiling boolean.xsd
    [echo] Compiling particalMaxOccures.xsd
    [echo] Compiling innerParticles.xsd
    [echo] Compiling default_namespaces.xsd
    [echo] Compiling groups.xsd
    [echo] Compiling base64binary.xsd
    [echo] Compiling abstract.xsd
    [echo] Compiling decimal.xsd
    [java] Exception in thread "main" java.io.FileNotFoundException: /export/home/illsleyd/continuum/continuum-1.0.3/apps/continuum/working-directory/1/modules/adb-codegen/test-resources/testsuite/decimal.xsd
(No such file or directory)
    [java] 	at java.io.FileInputStream.open(Native Method)
    [java] 	at java.io.FileInputStream.<init>(FileInputStream.java:106)
    [java] 	at java.io.FileInputStream.<init>(FileInputStream.java:66)
    [java] 	at sun.net.www.protocol.file.FileURLConnection.connect(FileURLConnection.java:70)
    [java] 	at sun.net.www.protocol.file.FileURLConnection.getInputStream(FileURLConnection.java:161)
    [java] 	at com.sun.org.apache.xerces.internal.impl.XMLEntityManager.setupCurrentEntity(XMLEntityManager.java:973)
    [java] 	at com.sun.org.apache.xerces.internal.impl.XMLVersionDetector.determineDocVersion(XMLVersionDetector.java:184)
    [java] 	at com.sun.org.apache.xerces.internal.parsers.XML11Configuration.parse(XML11Configuration.java:798)
    [java] 	at com.sun.org.apache.xerces.internal.parsers.XML11Configuration.parse(XML11Configuration.java:764)
    [java] 	at com.sun.org.apache.xerces.internal.parsers.XMLParser.parse(XMLParser.java:148)
    [java] 	at com.sun.org.apache.xerces.internal.parsers.DOMParser.parse(DOMParser.java:250)
    [java] 	at com.sun.org.apache.xerces.internal.jaxp.DocumentBuilderImpl.parse(DocumentBuilderImpl.java:292)
    [java] 	at javax.xml.parsers.DocumentBuilder.parse(DocumentBuilder.java:172)
    [java] 	at org.apache.axis2.schema.XSD2Java.compile(XSD2Java.java:61)
    [java] 	at org.apache.axis2.schema.XSD2Java.main(XSD2Java.java:45)
    [java] [ERROR] Java Result: 1
    [javac] Compiling 295 source files to /export/home/illsleyd/continuum/continuum-1.0.3/apps/continuum/working-directory/1/modules/adb-codegen/target/schema/classes
    [javac] Note: Some input files use unchecked or unsafe operations.
    [javac] Note: Recompile with -Xlint:unchecked for details.
    [javac] Compiling 89 source files to /export/home/illsleyd/continuum/continuum-1.0.3/apps/continuum/working-directory/1/modules/adb-codegen/target/test-classes
    [javac] /export/home/illsleyd/continuum/continuum-1.0.3/apps/continuum/working-directory/1/modules/adb-codegen/test/org/apache/axis2/schema/decimal/DecimalTest.java:19:
cannot find symbol
    [javac] symbol  : class GetHistoricNavResponse
    [javac] location: package org.tempuri.boolean1
    [javac] import org.tempuri.boolean1.GetHistoricNavResponse;
    [javac]                             ^
    [javac] /export/home/illsleyd/continuum/continuum-1.0.3/apps/continuum/working-directory/1/modules/adb-codegen/test/org/apache/axis2/schema/decimal/DecimalTest.java:20:
cannot find symbol
    [javac] symbol  : class ArrayOfDecimal
    [javac] location: package org.tempuri.boolean1
    [javac] import org.tempuri.boolean1.ArrayOfDecimal;
    [javac]                             ^
    [javac] /export/home/illsleyd/continuum/continuum-1.0.3/apps/continuum/working-directory/1/modules/adb-codegen/test/org/apache/axis2/schema/decimal/DecimalTest.java:37:
cannot find symbol
    [javac] symbol  : class GetHistoricNavResponse
    [javac] location: class org.apache.axis2.schema.decimal.DecimalTest
    [javac]         GetHistoricNavResponse getHistoricNavResponse = new GetHistoricNavResponse();
    [javac]         ^
    [javac] /export/home/illsleyd/continuum/continuum-1.0.3/apps/continuum/working-directory/1/modules/adb-codegen/test/org/apache/axis2/schema/decimal/DecimalTest.java:37:
cannot find symbol
    [javac] symbol  : class GetHistoricNavResponse
    [javac] location: class org.apache.axis2.schema.decimal.DecimalTest
    [javac]         GetHistoricNavResponse getHistoricNavResponse = new GetHistoricNavResponse();
    [javac]                                                             ^
    [javac] /export/home/illsleyd/continuum/continuum-1.0.3/apps/continuum/working-directory/1/modules/adb-codegen/test/org/apache/axis2/schema/decimal/DecimalTest.java:38:
cannot find symbol
    [javac] symbol  : class ArrayOfDecimal
    [javac] location: class org.apache.axis2.schema.decimal.DecimalTest
    [javac]         ArrayOfDecimal arrayOfDecimal = new ArrayOfDecimal();
    [javac]         ^
    [javac] /export/home/illsleyd/continuum/continuum-1.0.3/apps/continuum/working-directory/1/modules/adb-codegen/test/org/apache/axis2/schema/decimal/DecimalTest.java:38:
cannot find symbol
    [javac] symbol  : class ArrayOfDecimal
    [javac] location: class org.apache.axis2.schema.decimal.DecimalTest
    [javac]         ArrayOfDecimal arrayOfDecimal = new ArrayOfDecimal();
    [javac]                                             ^
    [javac] /export/home/illsleyd/continuum/continuum-1.0.3/apps/continuum/working-directory/1/modules/adb-codegen/test/org/apache/axis2/schema/decimal/DecimalTest.java:48:
cannot find symbol
    [javac] symbol  : variable GetHistoricNavResponse
    [javac] location: class org.apache.axis2.schema.decimal.DecimalTest
    [javac]             OMElement omElement = getHistoricNavResponse.getOMElement(GetHistoricNavResponse.MY_QNAME,
    [javac]                                                                       ^
    [javac] /export/home/illsleyd/continuum/continuum-1.0.3/apps/continuum/working-directory/1/modules/adb-codegen/test/org/apache/axis2/schema/decimal/DecimalTest.java:54:
cannot find symbol
    [javac] symbol  : class GetHistoricNavResponse
    [javac] location: class org.apache.axis2.schema.decimal.DecimalTest
    [javac]             GetHistoricNavResponse result = GetHistoricNavResponse.Factory.parse(xmlReader);
    [javac]             ^
    [javac] /export/home/illsleyd/continuum/continuum-1.0.3/apps/continuum/working-directory/1/modules/adb-codegen/test/org/apache/axis2/schema/decimal/DecimalTest.java:54:
package GetHistoricNavResponse does not exist
    [javac]             GetHistoricNavResponse result = GetHistoricNavResponse.Factory.parse(xmlReader);
    [javac]                                                                   ^
    [javac] 9 errors

BUILD FAILED
File...... file:/export/home/illsleyd/.maven/cache/maven-multiproject-plugin-1.5/plugin.jelly
Element... maven:reactor
Line...... 227
Column.... 64
Unable to obtain goal [multiproject:install-callback] -- file:/export/home/illsleyd/.maven/cache/maven-test-plugin-1.8/plugin.jelly:55:46:
<javac> Compile failed; see the compiler error output for details.
Total time   : 5 minutes 34 seconds 
Finished at  : Sunday, July 1, 2007 8:07:33 AM GMT+00:00


****************************************************************************



---------------------------------------------------------------------
To unsubscribe, e-mail: axis-dev-unsubscribe@ws.apache.org
For additional commands, e-mail: axis-dev-help@ws.apache.org


Mime
View raw message