axis-java-dev mailing list archives

Site index · List index
Message view « Date » · « Thread »
Top « Date » · « Thread »
From "davidillsley (Continuum)" <davidills...@apache.org>
Subject [Axis2][continuum] BUILD FAILURE
Date Thu, 05 Jul 2007 09:46:06 GMT
Online report : http://ws.zones.apache.org:10000/continuum/servlet/continuum/target/ProjectBuild.vm/view/ProjectBuild/id/1/buildId/2684
Build statistics:
  State: Failed
  Previous State: Failed
  Started at: Thu, 5 Jul 2007 09:32:13 +0000
  Finished at: Thu, 5 Jul 2007 09:45:44 +0000
  Total time: 13m 30s
  Build Trigger: Schedule
  Exit code: 70
  Building machine hostname: ws.zones.apache.org
  Operating system : SunOS(unknown)
  Java version : 1.5.0_09(Sun Microsystems Inc.)

Changes
         thilina          removing commented code
             /webservices/axis2/trunk/java/modules/kernel/src/org/apache/axis2/builder/MIMEBuilder.java
           deepal          oops , I have done a mistake. Now we generate stub correctly 
             /webservices/axis2/trunk/java/modules/fastinfoset/maven.xml
           sumedha          Added several missing libraries required for war distribution
             /webservices/axis2/trunk/java/modules/distribution/pom.xml
            /webservices/axis2/trunk/java/modules/distribution/src/main/assembly/bin-assembly.xml
            /webservices/axis2/trunk/java/modules/distribution/src/main/assembly/src-assembly.xml
            /webservices/axis2/trunk/java/modules/distribution/src/main/assembly/war-assembly.xml
            /webservices/axis2/trunk/java/modules/parent/pom.xml
            /webservices/axis2/trunk/java/pom.xml
        
****************************************************************************
Output:
****************************************************************************
Snipped Output:
LUtils$ParserErrorHandler.fatalError(XMLUtils.java:390)
    [java] 	at com.sun.org.apache.xerces.internal.util.ErrorHandlerWrapper.fatalError(ErrorHandlerWrapper.java:218)
    [java] 	at com.sun.org.apache.xerces.internal.impl.XMLErrorReporter.reportError(XMLErrorReporter.java:386)
    [java] 	at com.sun.org.apache.xerces.internal.impl.XMLErrorReporter.reportError(XMLErrorReporter.java:316)
    [java] 	at com.sun.org.apache.xerces.internal.impl.XMLVersionDetector.determineDocVersion(XMLVersionDetector.java:230)
    [java] 	at com.sun.org.apache.xerces.internal.parsers.XML11Configuration.parse(XML11Configuration.java:798)
    [java] 	at com.sun.org.apache.xerces.internal.parsers.XML11Configuration.parse(XML11Configuration.java:764)
    [java] 	at com.sun.org.apache.xerces.internal.parsers.XMLParser.parse(XMLParser.java:148)
    [java] 	at com.sun.org.apache.xerces.internal.parsers.DOMParser.parse(DOMParser.java:250)
    [java] 	at com.sun.org.apache.xerces.internal.jaxp.DocumentBuilderImpl.parse(DocumentBuilderImpl.java:292)
    [java] 	at org.apache.axis2.util.XMLUtils.newDocument(XMLUtils.java:205)
    [java] 	at org.apache.axis2.util.XMLUtils.newDocument(XMLUtils.java:250)
    [java] 	at org.apache.axis2.util.XMLUtils.newDocument(XMLUtils.java:233)
    [java] 	at org.apache.axis2.wsdl.codegen.CodeGenerationEngine.readInTheWSDLFile(CodeGenerationEngine.java:285)
    [java] 	... 3 more
    [java] [ERROR] Java Result: 1
    [javac] Compiling 3 source files to /export/home/illsleyd/continuum/continuum-1.0.3/apps/continuum/working-directory/1/modules/fastinfoset/target/test-classes
    [javac] /export/home/illsleyd/continuum/continuum-1.0.3/apps/continuum/working-directory/1/modules/fastinfoset/test/org/apache/axis2/fastinfoset/SimpleAddServiceClient.java:31:
cannot find symbol
    [javac] symbol  : class SimpleAddServiceStub
    [javac] location: package org.apache.axis2.fastinfoset
    [javac] import org.apache.axis2.fastinfoset.SimpleAddServiceStub;
    [javac]                                     ^
    [javac] /export/home/illsleyd/continuum/continuum-1.0.3/apps/continuum/working-directory/1/modules/fastinfoset/test/org/apache/axis2/fastinfoset/SimpleAddServiceClient.java:32:
package org.apache.axis2.fastinfoset.SimpleAddServiceStub does not exist
    [javac] import org.apache.axis2.fastinfoset.SimpleAddServiceStub.AddFloats;
    [javac]                                                          ^
    [javac] /export/home/illsleyd/continuum/continuum-1.0.3/apps/continuum/working-directory/1/modules/fastinfoset/test/org/apache/axis2/fastinfoset/SimpleAddServiceClient.java:33:
package org.apache.axis2.fastinfoset.SimpleAddServiceStub does not exist
    [javac] import org.apache.axis2.fastinfoset.SimpleAddServiceStub.AddFloatsResponse;
    [javac]                                                          ^
    [javac] /export/home/illsleyd/continuum/continuum-1.0.3/apps/continuum/working-directory/1/modules/fastinfoset/test/org/apache/axis2/fastinfoset/SimpleAddServiceClient.java:34:
package org.apache.axis2.fastinfoset.SimpleAddServiceStub does not exist
    [javac] import org.apache.axis2.fastinfoset.SimpleAddServiceStub.AddInts;
    [javac]                                                          ^
    [javac] /export/home/illsleyd/continuum/continuum-1.0.3/apps/continuum/working-directory/1/modules/fastinfoset/test/org/apache/axis2/fastinfoset/SimpleAddServiceClient.java:35:
package org.apache.axis2.fastinfoset.SimpleAddServiceStub does not exist
    [javac] import org.apache.axis2.fastinfoset.SimpleAddServiceStub.AddIntsResponse;
    [javac]                                                          ^
    [javac] /export/home/illsleyd/continuum/continuum-1.0.3/apps/continuum/working-directory/1/modules/fastinfoset/test/org/apache/axis2/fastinfoset/SimpleAddServiceClient.java:36:
package org.apache.axis2.fastinfoset.SimpleAddServiceStub does not exist
    [javac] import org.apache.axis2.fastinfoset.SimpleAddServiceStub.AddStrings;
    [javac]                                                          ^
    [javac] /export/home/illsleyd/continuum/continuum-1.0.3/apps/continuum/working-directory/1/modules/fastinfoset/test/org/apache/axis2/fastinfoset/SimpleAddServiceClient.java:37:
package org.apache.axis2.fastinfoset.SimpleAddServiceStub does not exist
    [javac] import org.apache.axis2.fastinfoset.SimpleAddServiceStub.AddStringsResponse;
    [javac]                                                          ^
    [javac] /export/home/illsleyd/continuum/continuum-1.0.3/apps/continuum/working-directory/1/modules/fastinfoset/test/org/apache/axis2/fastinfoset/SimpleAddServiceClient.java:45:
cannot find symbol
    [javac] symbol  : class SimpleAddServiceStub
    [javac] location: class org.apache.axis2.fastinfoset.SimpleAddServiceClient
    [javac] 	private SimpleAddServiceStub serviceStub;
    [javac]                 ^
    [javac] /export/home/illsleyd/continuum/continuum-1.0.3/apps/continuum/working-directory/1/modules/fastinfoset/test/org/apache/axis2/fastinfoset/SimpleAddServiceClient.java:82:
cannot find symbol
    [javac] symbol  : class SimpleAddServiceStub
    [javac] location: class org.apache.axis2.fastinfoset.SimpleAddServiceClient
    [javac] 		serviceStub = new SimpleAddServiceStub(context, target.getAddress());
    [javac]                                   ^
    [javac] /export/home/illsleyd/continuum/continuum-1.0.3/apps/continuum/working-directory/1/modules/fastinfoset/test/org/apache/axis2/fastinfoset/SimpleAddServiceClient.java:98:
cannot find symbol
    [javac] symbol  : class SimpleAddServiceStub
    [javac] location: class org.apache.axis2.fastinfoset.SimpleAddServiceClient
    [javac] 		serviceStub = new SimpleAddServiceStub(context, target.getAddress());
    [javac]                                   ^
    [javac] /export/home/illsleyd/continuum/continuum-1.0.3/apps/continuum/working-directory/1/modules/fastinfoset/test/org/apache/axis2/fastinfoset/SimpleAddServiceClient.java:110:
cannot find symbol
    [javac] symbol  : class AddStrings
    [javac] location: class org.apache.axis2.fastinfoset.SimpleAddServiceClient
    [javac] 		AddStrings addStrings = new SimpleAddServiceStub.AddStrings();
    [javac]                 ^
    [javac] /export/home/illsleyd/continuum/continuum-1.0.3/apps/continuum/working-directory/1/modules/fastinfoset/test/org/apache/axis2/fastinfoset/SimpleAddServiceClient.java:110:
package SimpleAddServiceStub does not exist
    [javac] 		AddStrings addStrings = new SimpleAddServiceStub.AddStrings();
    [javac]                                                                 ^
    [javac] /export/home/illsleyd/continuum/continuum-1.0.3/apps/continuum/working-directory/1/modules/fastinfoset/test/org/apache/axis2/fastinfoset/SimpleAddServiceClient.java:113:
cannot find symbol
    [javac] symbol  : class AddStringsResponse
    [javac] location: class org.apache.axis2.fastinfoset.SimpleAddServiceClient
    [javac] 		AddStringsResponse response1 = serviceStub.addStrings(addStrings);
    [javac]                 ^
    [javac] /export/home/illsleyd/continuum/continuum-1.0.3/apps/continuum/working-directory/1/modules/fastinfoset/test/org/apache/axis2/fastinfoset/SimpleAddServiceClient.java:118:
cannot find symbol
    [javac] symbol  : class AddInts
    [javac] location: class org.apache.axis2.fastinfoset.SimpleAddServiceClient
    [javac] 		AddInts addInts = new SimpleAddServiceStub.AddInts();
    [javac]                 ^
    [javac] /export/home/illsleyd/continuum/continuum-1.0.3/apps/continuum/working-directory/1/modules/fastinfoset/test/org/apache/axis2/fastinfoset/SimpleAddServiceClient.java:118:
package SimpleAddServiceStub does not exist
    [javac] 		AddInts addInts = new SimpleAddServiceStub.AddInts();
    [javac]                                                           ^
    [javac] /export/home/illsleyd/continuum/continuum-1.0.3/apps/continuum/working-directory/1/modules/fastinfoset/test/org/apache/axis2/fastinfoset/SimpleAddServiceClient.java:121:
cannot find symbol
    [javac] symbol  : class AddIntsResponse
    [javac] location: class org.apache.axis2.fastinfoset.SimpleAddServiceClient
    [javac] 		AddIntsResponse response2 = serviceStub.addInts(addInts);
    [javac]                 ^
    [javac] /export/home/illsleyd/continuum/continuum-1.0.3/apps/continuum/working-directory/1/modules/fastinfoset/test/org/apache/axis2/fastinfoset/SimpleAddServiceClient.java:126:
cannot find symbol
    [javac] symbol  : class AddFloats
    [javac] location: class org.apache.axis2.fastinfoset.SimpleAddServiceClient
    [javac] 		AddFloats addFloats = new SimpleAddServiceStub.AddFloats();
    [javac]                 ^
    [javac] /export/home/illsleyd/continuum/continuum-1.0.3/apps/continuum/working-directory/1/modules/fastinfoset/test/org/apache/axis2/fastinfoset/SimpleAddServiceClient.java:126:
package SimpleAddServiceStub does not exist
    [javac] 		AddFloats addFloats = new SimpleAddServiceStub.AddFloats();
    [javac]                                                               ^
    [javac] /export/home/illsleyd/continuum/continuum-1.0.3/apps/continuum/working-directory/1/modules/fastinfoset/test/org/apache/axis2/fastinfoset/SimpleAddServiceClient.java:129:
cannot find symbol
    [javac] symbol  : class AddFloatsResponse
    [javac] location: class org.apache.axis2.fastinfoset.SimpleAddServiceClient
    [javac] 		AddFloatsResponse response3 = serviceStub.addFloats(addFloats);
    [javac]                 ^
    [javac] 19 errors

BUILD FAILED
File...... file:/export/home/illsleyd/.maven/cache/maven-multiproject-plugin-1.5/plugin.jelly
Element... maven:reactor
Line...... 227
Column.... 64
Unable to obtain goal [multiproject:install-callback] -- file:/export/home/illsleyd/.maven/cache/maven-test-plugin-1.8/plugin.jelly:55:46:
<javac> Compile failed; see the compiler error output for details.
Total time   : 13 minutes 21 seconds 
Finished at  : Thursday, July 5, 2007 9:45:43 AM GMT+00:00


****************************************************************************



---------------------------------------------------------------------
To unsubscribe, e-mail: axis-dev-unsubscribe@ws.apache.org
For additional commands, e-mail: axis-dev-help@ws.apache.org


Mime
View raw message