axis-java-dev mailing list archives

Site index · List index
Message view « Date » · « Thread »
Top « Date » · « Thread »
From "Umasankar Mukkara" <mumasan...@novell.com>
Subject Re: axis2 build failure in xmlbeans
Date Wed, 18 Apr 2007 10:49:56 GMT
I found the following errors in the corresponding log files. Can somebody help me fix this?

Regards,
Uma.


Testsuite: org.apache.axis2.xmlbeans.WSDL2Java11Test
Tests run: 1, Failures: 1, Errors: 0, Time elapsed: 0.726 sec

------------- Standard Error -----------------
org.apache.axis2.wsdl.codegen.CodeGenerationException: java.lang.RuntimeException: java.lang.reflect.InvocationTargetException
        at org.apache.axis2.wsdl.codegen.CodeGenerationEngine.generate(CodeGenerationEngine.java:224)
        at org.apache.axis2.xmlbeans.WSDL2JavaSuccessTestBase.codeGenerate(WSDL2JavaSuccessTestBase.java:167)
        at org.apache.axis2.xmlbeans.WSDL2JavaSuccessTestBase.generateAndCompile(WSDL2JavaSuccessTestBase.java:152)
        at org.apache.axis2.xmlbeans.WSDL2JavaSuccessTestBase.testWSDLFile(WSDL2JavaSuccessTestBase.java:96)
        at sun.reflect.NativeMethodAccessorImpl.invoke0(Native Method)
        at sun.reflect.NativeMethodAccessorImpl.invoke(NativeMethodAccessorImpl.java:39)
        at sun.reflect.DelegatingMethodAccessorImpl.invoke(DelegatingMethodAccessorImpl.java:25)
        at java.lang.reflect.Method.invoke(Method.java:597)
        at junit.framework.TestCase.runTest(TestCase.java:154)
        at junit.framework.TestCase.runBare(TestCase.java:127)
        at junit.framework.TestResult$1.protect(TestResult.java:106)
        at junit.framework.TestResult.runProtected(TestResult.java:124)
        at junit.framework.TestResult.run(TestResult.java:109)
        at junit.framework.TestCase.run(TestCase.java:118)
        at junit.framework.TestSuite.runTest(TestSuite.java:208)
        at junit.framework.TestSuite.run(TestSuite.java:203)
        at org.apache.tools.ant.taskdefs.optional.junit.JUnitTestRunner.run(JUnitTestRunner.java:325)
        at org.apache.tools.ant.taskdefs.optional.junit.JUnitTestRunner.main(JUnitTestRunner.java:536)
Caused by: java.lang.RuntimeException: java.lang.reflect.InvocationTargetException
        at org.apache.axis2.wsdl.codegen.extension.XMLBeansExtension.engage(XMLBeansExtension.java:92)
        at org.apache.axis2.wsdl.codegen.CodeGenerationEngine.generate(CodeGenerationEngine.java:177)
        ... 17 more


---------------------------------------------------------------------
To unsubscribe, e-mail: axis-dev-unsubscribe@ws.apache.org
For additional commands, e-mail: axis-dev-help@ws.apache.org


Mime
View raw message