axis-java-dev mailing list archives

Site index · List index
Message view « Date » · « Thread »
Top « Date » · « Thread »
From "Umasankar Mukkara" <mumasan...@novell.com>
Subject axis2 build failure in xmlbeans
Date Wed, 18 Apr 2007 08:27:54 GMT
Hi,

I just downloaded axis2 source and tried to build using maven 1.0.2 and following build failure
happens. What should I be looking at? junit does not tell what the failure is about. All other
directories seem to compile properly.

Regards,
Uma.


linux:~/axis2/axis2-1.1.1/src/modules/xmlbeans # maven
 __  __
|  \/  |__ _Apache__ ___
| |\/| / _` \ V / -_) ' \  ~ intelligent projects ~
|_|  |_\__,_|\_/\___|_||_|  v. 1.0.2

build:start:

java:prepare-filesystem:

java:compile:
    [echo] Compiling to /root/axis2/axis2-1.1.1/src/modules/xmlbeans/target/classes

java:jar-resources:

test:prepare-filesystem:

test:test-resources:

test:compile:

test:test:
    [junit] Running org.apache.axis2.xmlbeans.WSDL2Java7Test
    [junit] Tests run: 1, Failures: 1, Errors: 0, Time elapsed: 0.727 sec
    [junit] [ERROR] TEST org.apache.axis2.xmlbeans.WSDL2Java7Test FAILED
    [junit] Running org.apache.axis2.xmlbeans.WSDL2Java3Test
    [junit] Tests run: 1, Failures: 1, Errors: 0, Time elapsed: 0.731 sec
    [junit] [ERROR] TEST org.apache.axis2.xmlbeans.WSDL2Java3Test FAILED
    [junit] Running org.apache.axis2.xmlbeans.WSDL2Java13Test
    [junit] Tests run: 1, Failures: 0, Errors: 0, Time elapsed: 0.438 sec
    [junit] Running org.apache.axis2.xmlbeans.WSDL2Java8Test
    [junit] Tests run: 1, Failures: 1, Errors: 0, Time elapsed: 0.763 sec
    [junit] [ERROR] TEST org.apache.axis2.xmlbeans.WSDL2Java8Test FAILED
    [junit] Running org.apache.axis2.xmlbeans.WSDL2Java4Test
    [junit] Tests run: 1, Failures: 1, Errors: 0, Time elapsed: 0.735 sec
    [junit] [ERROR] TEST org.apache.axis2.xmlbeans.WSDL2Java4Test FAILED
    [junit] Running org.apache.axis2.xmlbeans.WSDL2Java9Test
    [junit] Tests run: 1, Failures: 1, Errors: 0, Time elapsed: 0.743 sec
    [junit] [ERROR] TEST org.apache.axis2.xmlbeans.WSDL2Java9Test FAILED
    [junit] Running org.apache.axis2.xmlbeans.WSDL2Java5Test
    [junit] Tests run: 1, Failures: 1, Errors: 0, Time elapsed: 0.714 sec
    [junit] [ERROR] TEST org.apache.axis2.xmlbeans.WSDL2Java5Test FAILED
    [junit] Running org.apache.axis2.xmlbeans.WSDL2Java1Test
    [junit] Tests run: 1, Failures: 1, Errors: 0, Time elapsed: 0.756 sec
    [junit] [ERROR] TEST org.apache.axis2.xmlbeans.WSDL2Java1Test FAILED
    [junit] Running org.apache.axis2.xmlbeans.WSDL2Java11Test
    [junit] Tests run: 1, Failures: 1, Errors: 0, Time elapsed: 0.709 sec
    [junit] [ERROR] TEST org.apache.axis2.xmlbeans.WSDL2Java11Test FAILED
    [junit] Running org.apache.axis2.xmlbeans.WSDL2Java6Test
    [junit] Tests run: 1, Failures: 1, Errors: 0, Time elapsed: 0.733 sec
    [junit] [ERROR] TEST org.apache.axis2.xmlbeans.WSDL2Java6Test FAILED
    [junit] Running org.apache.axis2.xmlbeans.WSDL2Java2Test
    [junit] Tests run: 1, Failures: 0, Errors: 0, Time elapsed: 0.98 sec
    [junit] Running org.apache.axis2.xmlbeans.WSDL2Java12Test
    [junit] Tests run: 1, Failures: 0, Errors: 0, Time elapsed: 0.74 sec

BUILD FAILED
File...... /root/.maven/cache/maven-test-plugin-1.6.2/plugin.jelly
Element... fail
Line...... 181
Column.... 54
There were test failures.
Total time: 13 seconds
Finished at: Wed Apr 18 13:51:36 IST 2007

 


---------------------------------------------------------------------
To unsubscribe, e-mail: axis-dev-unsubscribe@ws.apache.org
For additional commands, e-mail: axis-dev-help@ws.apache.org


Mime
View raw message