axis-java-dev mailing list archives

Site index · List index
Message view « Date » · « Thread »
Top « Date » · « Thread »
From Nicholas L Gallardo <nlgal...@us.ibm.com>
Subject Re: [Axis2][continuum] BUILD FAILURE
Date Wed, 21 Mar 2007 06:18:19 GMT
Looks like the new Woden snapshot has broken the WS20ToAxisServiceBuilder. 
 Can someone familiar with this code take a look?

Thanks,
-Nick





"davidillsley (Continuum)" <davidillsley@apache.org> 
03/21/2007 01:06 AM
Please respond to
axis-dev@ws.apache.org


To
axis-dev@ws.apache.org
cc

Subject
[Axis2][continuum] BUILD FAILURE






Online report : 
http://ws.zones.apache.org:10000/continuum/servlet/continuum/target/ProjectBuild.vm/view/ProjectBuild/id/1/buildId/1509

Build statistics:
  State: Failed
  Previous State: Failed
  Started at: Wed, 21 Mar 2007 06:03:33 +0000
  Finished at: Wed, 21 Mar 2007 06:06:35 +0000
  Total time: 3m 1s
  Build Trigger: Schedule
  Exit code: 70
  Building machine hostname: ws.zones.apache.org
  Operating system : SunOS(unknown)
  Java version : 1.5.0_09(Sun Microsystems Inc.)

Changes
         milinda          Fix for AXIS2C-551 issue.
 
/webservices/axis2/trunk/java/modules/adb-codegen/src/org/apache/axis2/schema/template/CADBBeanTemplateSource.xsl
 
****************************************************************************
Output:
****************************************************************************
Snipped Output:
to get missing/snapshot dependencies required by Apache Axis 2.0 - 
Java2WSDL:
Attempting to download axiom-api-SNAPSHOT.jar.
4/125K
8/125K
12/125K
16/125K
20/125K
24/125K
28/125K
32/125K
36/125K
40/125K
44/125K
48/125K
52/125K
56/125K
60/125K
64/125K
68/125K
72/125K
76/125K
80/125K
84/125K
88/125K
89/125K
93/125K
97/125K
101/125K
105/125K
109/125K
113/125K
117/125K
121/125K
125/125K
125/125K
125K downloaded
Error retrieving artifact from 
[http://people.apache.org/repo/m1-snapshot-repository/]: 
org.apache.maven.verifier.ChecksumVerificationException: Error retrieving 
checksum file for /org.apache.ws.commons.axiom/jars/axiom-api-SNAPSHOT.jar
Skipping download as local copy is up to date!
Attempting to download axiom-impl-SNAPSHOT.jar.
4/110K
8/110K
12/110K
16/110K
20/110K
24/110K
28/110K
32/110K
36/110K
40/110K
44/110K
48/110K
52/110K
56/110K
60/110K
64/110K
68/110K
72/110K
76/110K
80/110K
84/110K
88/110K
89/110K
93/110K
97/110K
101/110K
105/110K
109/110K
110/110K
110K downloaded
Error retrieving artifact from 
[http://people.apache.org/repo/m1-snapshot-repository/]: 
org.apache.maven.verifier.ChecksumVerificationException: Error retrieving 
checksum file for 
/org.apache.ws.commons.axiom/jars/axiom-impl-SNAPSHOT.jar
Skipping download as local copy is up to date!
Attempting to download XmlSchema-SNAPSHOT.jar.
4/128K
8/128K
12/128K
16/128K
20/128K
24/128K
28/128K
32/128K
36/128K
40/128K
44/128K
48/128K
52/128K
56/128K
60/128K
64/128K
68/128K
72/128K
76/128K
80/128K
84/128K
88/128K
89/128K
93/128K
97/128K
101/128K
105/128K
109/128K
113/128K
117/128K
121/128K
125/128K
128/128K
128K downloaded
*** CHECKSUM FAILED - Checksum failed on download: local = 
'4aad72ead491cf3d28fe3a7fd1bec2d2'; remote = 
'0bb5d882107a7e323eabd8319c7adc9a' - RETRYING
4/128K
8/128K
12/128K
16/128K
20/128K
24/128K
28/128K
32/128K
36/128K
40/128K
44/128K
48/128K
52/128K
56/128K
60/128K
64/128K
68/128K
72/128K
76/128K
80/128K
84/128K
88/128K
92/128K
96/128K
100/128K
104/128K
108/128K
112/128K
116/128K
120/128K
124/128K
128/128K
128/128K
128K downloaded
Error retrieving artifact from 
[http://people.apache.org/repo/m1-snapshot-repository/]: 
org.apache.maven.verifier.ChecksumVerificationException: Checksum failed 
on download: local = '4aad72ead491cf3d28fe3a7fd1bec2d2'; remote = 
'0bb5d882107a7e323eabd8319c7adc9a'
build:start:

multiproject:install-callback:
    [echo] Running jar:install for Apache Axis 2.0 - Java2WSDL
java:prepare-filesystem:
    [mkdir] Created dir: 
/export/home/illsleyd/continuum/continuum-1.0.3/apps/continuum/working-directory/1/modules/java2wsdl/target/classes
Running post goal: java:prepare-filesystem

java:compile:
    [echo] Compiling to 
/export/home/illsleyd/continuum/continuum-1.0.3/apps/continuum/working-directory/1/modules/java2wsdl/target/classes
    [javac] Compiling 23 source files to 
/export/home/illsleyd/continuum/continuum-1.0.3/apps/continuum/working-directory/1/modules/java2wsdl/target/classes

java:jar-resources:
Copying 2 files to 
/export/home/illsleyd/continuum/continuum-1.0.3/apps/continuum/working-directory/1/modules/java2wsdl/target/classes/META-INF

test:test:
    [echo] No tests to run.

jar:jar:
    [jar] Building jar: 
/export/home/illsleyd/continuum/continuum-1.0.3/apps/continuum/working-directory/1/modules/java2wsdl/target/axis2-java2wsdl-SNAPSHOT.jar

jar:install:
    [echo] Installing...
Uploading to org.apache.axis2/jars/axis2-java2wsdl-SNAPSHOT.jar: 
.................... (57K)
Uploading to org.apache.axis2/poms/axis2-java2wsdl-SNAPSHOT.pom: 
.................... (14K)

+----------------------------------------
| Executing multiproject:install-callback Apache Axis 2.0 - Kernel
| Memory: 21M/40M
+----------------------------------------
DEPRECATED: the default goal should be specified in the <build> section of 
project.xml instead of maven.xml
DEPRECATED: the default goal should be specified in the <build> section of 
project.xml instead of maven.xml

build:end:

Trying to get missing/snapshot dependencies required by Apache Axis 2.0 - 
Kernel:
Attempting to download axis2-java2wsdl-SNAPSHOT.jar.
Skipping download as local copy is up to date!
Attempting to download neethi-SNAPSHOT.jar.
4/28K
8/28K
12/28K
16/28K
20/28K
24/28K
28/28K
28/28K
28K downloaded
*** CHECKSUM FAILED - Checksum failed on download: local = 
'9dc9cc8ab6b5c62d50e630c7cc4fb2e7'; remote = 
'eb97c5022f592a6efdcdc19fb2f63663' - RETRYING
4/28K
5/28K
9/28K
13/28K
17/28K
21/28K
25/28K
28/28K
28K downloaded
Error retrieving artifact from 
[http://people.apache.org/repo/m1-snapshot-repository/]: 
org.apache.maven.verifier.ChecksumVerificationException: Checksum failed 
on download: local = '9dc9cc8ab6b5c62d50e630c7cc4fb2e7'; remote = 
'eb97c5022f592a6efdcdc19fb2f63663'
Attempting to download woden-1.0-incubating-SNAPSHOT.jar.
4/304K
8/304K
12/304K
16/304K
20/304K
24/304K
28/304K
32/304K
36/304K
40/304K
44/304K
48/304K
52/304K
56/304K
60/304K
64/304K
68/304K
72/304K
76/304K
80/304K
84/304K
88/304K
92/304K
96/304K
98/304K
102/304K
106/304K
110/304K
114/304K
118/304K
122/304K
126/304K
130/304K
134/304K
138/304K
142/304K
146/304K
150/304K
154/304K
158/304K
162/304K
166/304K
170/304K
174/304K
178/304K
182/304K
186/304K
190/304K
194/304K
198/304K
202/304K
206/304K
210/304K
214/304K
218/304K
222/304K
226/304K
230/304K
234/304K
238/304K
242/304K
246/304K
248/304K
252/304K
256/304K
260/304K
264/304K
268/304K
272/304K
276/304K
280/304K
284/304K
288/304K
292/304K
296/304K
300/304K
304/304K
304/304K
304K downloaded
*** CHECKSUM FAILED - Checksum failed on download: local = 
'6bc7fb95ef42a156461c3b5573e81b9e'; remote = 
'9830593489e8d8d03da2b509179bdee1' - RETRYING
4/304K
8/304K
12/304K
16/304K
20/304K
24/304K
28/304K
32/304K
36/304K
40/304K
44/304K
48/304K
52/304K
56/304K
60/304K
64/304K
68/304K
72/304K
76/304K
80/304K
84/304K
88/304K
92/304K
96/304K
100/304K
104/304K
108/304K
112/304K
116/304K
120/304K
124/304K
128/304K
132/304K
136/304K
140/304K
144/304K
148/304K
152/304K
156/304K
160/304K
164/304K
168/304K
172/304K
176/304K
180/304K
184/304K
188/304K
192/304K
196/304K
200/304K
204/304K
208/304K
212/304K
216/304K
220/304K
224/304K
228/304K
232/304K
236/304K
240/304K
244/304K
248/304K
252/304K
256/304K
260/304K
264/304K
268/304K
272/304K
276/304K
280/304K
284/304K
288/304K
292/304K
296/304K
300/304K
304/304K
304/304K
304K downloaded
Error retrieving artifact from 
[http://people.apache.org/repo/m1-snapshot-repository/]: 
org.apache.maven.verifier.ChecksumVerificationException: Checksum failed 
on download: local = '6bc7fb95ef42a156461c3b5573e81b9e'; remote = 
'9830593489e8d8d03da2b509179bdee1'
build:start:

multiproject:install-callback:
    [echo] Running jar:install for Apache Axis 2.0 - Kernel
java:prepare-filesystem:
    [mkdir] Created dir: 
/export/home/illsleyd/continuum/continuum-1.0.3/apps/continuum/working-directory/1/modules/kernel/target/classes
Running post goal: java:prepare-filesystem

java:compile:
    [echo] Compiling to 
/export/home/illsleyd/continuum/continuum-1.0.3/apps/continuum/working-directory/1/modules/kernel/target/classes
    [javac] Compiling 336 source files to 
/export/home/illsleyd/continuum/continuum-1.0.3/apps/continuum/working-directory/1/modules/kernel/target/classes
    [javac] 
/export/home/illsleyd/continuum/continuum-1.0.3/apps/continuum/working-directory/1/modules/kernel/src/org/apache/axis2/transport/http/MultipartFormDataFormatter.java:46:

warning: unmappable character for encoding ASCII
    [javac]  * <name>Fr??jus</name>
    [javac]            ^
    [javac] 
/export/home/illsleyd/continuum/continuum-1.0.3/apps/continuum/working-directory/1/modules/kernel/src/org/apache/axis2/transport/http/MultipartFormDataFormatter.java:46:

warning: unmappable character for encoding ASCII
    [javac]  * <name>Fr??jus</name>
    [javac]             ^
    [javac] 
/export/home/illsleyd/continuum/continuum-1.0.3/apps/continuum/working-directory/1/modules/kernel/src/org/apache/axis2/transport/http/MultipartFormDataFormatter.java:69:

warning: unmappable character for encoding ASCII
    [javac]  * <name>Fr??jus</name>
    [javac]            ^
    [javac] 
/export/home/illsleyd/continuum/continuum-1.0.3/apps/continuum/working-directory/1/modules/kernel/src/org/apache/axis2/transport/http/MultipartFormDataFormatter.java:69:

warning: unmappable character for encoding ASCII
    [javac]  * <name>Fr??jus</name>
    [javac]             ^
    [javac] 
/export/home/illsleyd/continuum/continuum-1.0.3/apps/continuum/working-directory/1/modules/kernel/src/org/apache/axis2/description/WSDL20ToAxisServiceBuilder.java:540:

cannot find symbol
    [javac] symbol  : method getLocationTemplate()
    [javac] location: class 
org.apache.woden.wsdl20.extensions.http.HTTPLocation
    [javac]                 String httpLocationTemplete = 
httpLocation.getLocationTemplate();
    [javac]                                                           ^
    [javac] 
/export/home/illsleyd/continuum/continuum-1.0.3/apps/continuum/working-directory/1/modules/kernel/src/org/apache/axis2/description/WSDL20ToAxisServiceBuilder.java:718:

cannot find symbol
    [javac] symbol  : method getLocationTemplate()
    [javac] location: class 
org.apache.woden.wsdl20.extensions.http.HTTPLocation
    [javac]                 String httpLocationTemplete = 
httpLocation.getLocationTemplate();
    [javac]                                                           ^
    [javac] Note: Some input files use or override a deprecated API.
    [javac] Note: Recompile with -Xlint:deprecation for details.
    [javac] 2 errors
    [javac] 4 warnings

BUILD FAILED
File...... 
file:/export/home/illsleyd/.maven/cache/maven-multiproject-plugin-1.5-SNAPSHOT/plugin.jelly
Element... maven:reactor
Line...... 227
Column.... 64
Unable to obtain goal [multiproject:install-callback] -- 
file:/export/home/illsleyd/.maven/cache/maven-java-plugin-1.6/plugin.jelly:92:48: 
<ant:javac> Compile failed; see the compiler error output for details.
Total time   : 2 minutes 54 seconds 
Finished at  : Wednesday, March 21, 2007 6:06:35 AM GMT+00:00


****************************************************************************



---------------------------------------------------------------------
To unsubscribe, e-mail: axis-dev-unsubscribe@ws.apache.org
For additional commands, e-mail: axis-dev-help@ws.apache.org



Mime
View raw message