axis-java-dev mailing list archives

Site index · List index
Message view « Date » · « Thread »
Top « Date » · « Thread »
From Nicholas L Gallardo <nlgal...@us.ibm.com>
Subject Re: [Axis2][continuum] BUILD FAILURE
Date Wed, 21 Mar 2007 13:45:55 GMT
Hi Dennis,

Please see the notes between Glen and I.  I'm investigating this, but it 
looks like a deployment change  broke JAX-WS.

Regards,
-Nick





Dennis Sosnoski <dms@sosnoski.com> 
03/21/2007 04:22 AM
Please respond to
axis-dev@ws.apache.org


To
axis-dev@ws.apache.org
cc

Subject
Re: [Axis2][continuum] BUILD FAILURE






What's going on with the JAXWS failures? They make it impossible to do a 
full test of the build, and as we approach the first "RC" of 1.2 it's 
important to do thorough test runs.

  - Dennis

davidillsley (Continuum) wrote:
> Online report : 
http://ws.zones.apache.org:10000/continuum/servlet/continuum/target/ProjectBuild.vm/view/ProjectBuild/id/1/buildId/1514

> Build statistics:
>   State: Failed
>   Previous State: Failed
>   Started at: Wed, 21 Mar 2007 08:19:04 +0000
>   Finished at: Wed, 21 Mar 2007 08:57:51 +0000
>   Total time: 38m 46s
>   Build Trigger: Schedule
>   Exit code: 70
>   Building machine hostname: ws.zones.apache.org
>   Operating system : SunOS(unknown)
>   Java version : 1.5.0_09(Sun Microsystems Inc.)
>
> Changes
>          asankha          revert fix for 2030 and 2277 for build 
failures
> 
/webservices/axis2/trunk/java/modules/kernel/src/org/apache/axis2/transport/jms/JMSConnectionFactory.java
> 
/webservices/axis2/trunk/java/modules/kernel/src/org/apache/axis2/transport/jms/JMSMessageReceiver.java
> 
/webservices/axis2/trunk/java/modules/kernel/src/org/apache/axis2/transport/jms/JMSSender.java
>            azeez          Added methods to communicate exceptions
>
>
> 
/webservices/axis2/trunk/java/modules/clustering/src/org/apache/axis2/cluster/tribes/ChannelListener.java
> 
/webservices/axis2/trunk/java/modules/clustering/src/org/apache/axis2/cluster/tribes/ChannelSender.java
> 
/webservices/axis2/trunk/java/modules/clustering/src/org/apache/axis2/cluster/tribes/CommandType.java
> 
/webservices/axis2/trunk/java/modules/clustering/src/org/apache/axis2/cluster/tribes/configuration/TribesConfigurationManager.java
> 
/webservices/axis2/trunk/java/modules/clustering/src/org/apache/axis2/cluster/tribes/context/ContextUpdateEntryCommandMessage.java
> 
/webservices/axis2/trunk/java/modules/clustering/src/org/apache/axis2/cluster/tribes/context/ContextUpdater.java
> 
/webservices/axis2/trunk/java/modules/clustering/src/org/apache/axis2/cluster/tribes/context/TribesContextManager.java
> 
/webservices/axis2/trunk/java/modules/clustering/src/org/apache/axis2/cluster/tribes/info/TransientTribesChannelInfo.java
> 
/webservices/axis2/trunk/java/modules/kernel/src/org/apache/axis2/cluster/CommandType.java

(from 
/webservices/axis2/trunk/java/modules/clustering/src/org/apache/axis2/cluster/tribes/CommandType.java:520779)
> 
/webservices/axis2/trunk/java/modules/kernel/src/org/apache/axis2/cluster/configuration/ConfigurationManager.java
> 
/webservices/axis2/trunk/java/modules/kernel/src/org/apache/axis2/cluster/configuration/ConfigurationManagerListener.java
> 
> 
****************************************************************************
> Output:
> 
****************************************************************************
> Snipped Output:
> 
d/continuum/continuum-1.0.3/apps/continuum/working-directory/1/modules/jaxws/target/test-classes
> Copying 37 files to 
/export/home/illsleyd/continuum/continuum-1.0.3/apps/continuum/working-directory/1/modules/jaxws/target/test-classes
>
> test:compile:
>     [mkdir] Created dir: 
/export/home/illsleyd/continuum/continuum-1.0.3/apps/continuum/working-directory/1/modules/jaxws/target/schema
>     [mkdir] Created dir: 
/export/home/illsleyd/continuum/continuum-1.0.3/apps/continuum/working-directory/1/modules/jaxws/target/schema/src
>     [mkdir] Created dir: 
/export/home/illsleyd/continuum/continuum-1.0.3/apps/continuum/working-directory/1/modules/jaxws/target/schema/classes
>     [echo] Generating JAX-B classes from XSDs
>     [echo] Generating java from soap 11
>     [echo] Generating java from echo.xsd
>     [echo] Generating java from stock1.xsd
>     [echo] Generating java from stock2.xsd
>     [echo] Generating java from samplemtom.xsd
>     [echo] Generating java from ProxyDocLitWrapped.wsdl
>     [echo] Generating java from ProxyDocLitnonWrapped.wsdl
>     [echo] Generating java from samplemtomjpeg.wsdl
>     [echo] Generating java from RPCLit.wsdl
>     [echo] Generating java from gorilla_dlw.wsdl
>     [echo] Generating java from SOAP12Echo.wsdl
>     [echo] Generating java from AddNumbers.wsdl
>     [echo] Generating java from async_doclitwr.wsdl
>     [echo] Generating java from FaultyWebService.wsdl
>     [echo] Generating java from FaultsService.wsdl
>     [echo] Generating java from jaxbsource
>     [echo] Generating java from doclit_nonwrap.wsdl for javabean 
endpoint support
>     [echo] Generating java from doclitwrap.wsdl for javabean endpoint 
support
>     [echo] Generating java from doclitbare.wsdl for javabean endpoint 
support
>     [echo] Generating java from greeterTypes.xsd
>     [echo] Generating java from EchoMessage.wsdl for javabean endpoint 
support
>     [echo] Generating java from resourceinjection.wsdl for javabean 
endpoint Resource Injection support
>     [echo] Generating java from AnyType.wsdl for javabean endpoint 
AnyType support
>     [echo] Generating java from WSDLMultiTests.wsdl
>     [echo] Generating java from Polymorphic shapes.wsdl for javabean 
endpoint support
>     [echo] Generating java from SOAPActionTest.wsdl
>     [echo] Compiling generated schema
>     [javac] Compiling 223 source files to 
/export/home/illsleyd/continuum/continuum-1.0.3/apps/continuum/working-directory/1/modules/jaxws/target/schema/classes
>     [javac] Note: Some input files use unchecked or unsafe operations.
>     [javac] Note: Recompile with -Xlint:unchecked for details.
>     [javac] Compiling 215 source files to 
/export/home/illsleyd/continuum/continuum-1.0.3/apps/continuum/working-directory/1/modules/jaxws/target/test-classes
>     [javac] Note: Some input files use or override a deprecated API.
>     [javac] Note: Recompile with -Xlint:deprecation for details.
>     [javac] Note: Some input files use unchecked or unsafe operations.
>     [javac] Note: Recompile with -Xlint:unchecked for details.
> Running post goal: test:compile
>     [copy] Copying 8 files to 
/export/home/illsleyd/continuum/continuum-1.0.3/apps/continuum/working-directory/1/modules/jaxws/target/test-classes/services/EchoService
>     [copy] Copying 26 files to 
/export/home/illsleyd/continuum/continuum-1.0.3/apps/continuum/working-directory/1/modules/jaxws/target/test-classes/services/BasicAuthSecurityService
>     [copy] Copying 27 files to 
/export/home/illsleyd/continuum/continuum-1.0.3/apps/continuum/working-directory/1/modules/jaxws/target/test-classes/services/StringProviderService
>     [copy] Copying 26 files to 
/export/home/illsleyd/continuum/continuum-1.0.3/apps/continuum/working-directory/1/modules/jaxws/target/test-classes/services/StringMessageProviderService
>     [copy] Copying 26 files to 
/export/home/illsleyd/continuum/continuum-1.0.3/apps/continuum/working-directory/1/modules/jaxws/target/test-classes/services/SourceProviderService
>     [copy] Copying 26 files to 
/export/home/illsleyd/continuum/continuum-1.0.3/apps/continuum/working-directory/1/modules/jaxws/target/test-classes/services/SourceMessageProviderService
>     [copy] Copying 26 files to 
/export/home/illsleyd/continuum/continuum-1.0.3/apps/continuum/working-directory/1/modules/jaxws/target/test-classes/services/SoapMessageProviderService
>     [copy] Copying 33 files to 
/export/home/illsleyd/continuum/continuum-1.0.3/apps/continuum/working-directory/1/modules/jaxws/target/test-classes/services/JAXBProviderService
>     [copy] Copying 31 files to 
/export/home/illsleyd/continuum/continuum-1.0.3/apps/continuum/working-directory/1/modules/jaxws/target/test-classes/services/SendImageService
>     [copy] Copying 4 files to 
/export/home/illsleyd/continuum/continuum-1.0.3/apps/continuum/working-directory/1/modules/jaxws/target/test-classes/services/SOAP12Service
>     [copy] Copying 29 files to 
/export/home/illsleyd/continuum/continuum-1.0.3/apps/continuum/working-directory/1/modules/jaxws/target/test-classes/services/ProxyDocLitWrapped
>     [copy] Copying 29 files to 
/export/home/illsleyd/continuum/continuum-1.0.3/apps/continuum/working-directory/1/modules/jaxws/target/test-classes/services/ProxyDocLitnonWrapped
>     [copy] Copying 30 files to 
/export/home/illsleyd/continuum/continuum-1.0.3/apps/continuum/working-directory/1/modules/jaxws/target/test-classes/services/RPCLit
>     [copy] Copying 6 files to 
/export/home/illsleyd/continuum/continuum-1.0.3/apps/continuum/working-directory/1/modules/jaxws/target/test-classes/services/SOAP12EchoService
>     [copy] Copying 6 files to 
/export/home/illsleyd/continuum/continuum-1.0.3/apps/continuum/working-directory/1/modules/jaxws/target/test-classes/services/BookStoreService
>     [copy] Copying 30 files to 
/export/home/illsleyd/continuum/continuum-1.0.3/apps/continuum/working-directory/1/modules/jaxws/target/test-classes/services/gorilla_dlw
>     [copy] Copying 3 files to 
/export/home/illsleyd/continuum/continuum-1.0.3/apps/continuum/working-directory/1/modules/jaxws/target/test-classes/services/XPayloadStringProvider
>     [copy] Copying 3 files to 
/export/home/illsleyd/continuum/continuum-1.0.3/apps/continuum/working-directory/1/modules/jaxws/target/test-classes/services/XMessageStringProvider
>     [copy] Copying 3 files to 
/export/home/illsleyd/continuum/continuum-1.0.3/apps/continuum/working-directory/1/modules/jaxws/target/test-classes/services/XPayloadSourceProvider
>     [copy] Copying 3 files to 
/export/home/illsleyd/continuum/continuum-1.0.3/apps/continuum/working-directory/1/modules/jaxws/target/test-classes/services/XMessageSourceProvider
>     [copy] Copying 3 files to 
/export/home/illsleyd/continuum/continuum-1.0.3/apps/continuum/working-directory/1/modules/jaxws/target/test-classes/services/XMessageDataSourceProvider
>     [copy] Copying 7 files to 
/export/home/illsleyd/continuum/continuum-1.0.3/apps/continuum/working-directory/1/modules/jaxws/target/test-classes/services/WSGenService
>     [copy] Copying 12 files to 
/export/home/illsleyd/continuum/continuum-1.0.3/apps/continuum/working-directory/1/modules/jaxws/target/test-classes/services/AddressBookService
>     [copy] Copying 5 files to 
/export/home/illsleyd/continuum/continuum-1.0.3/apps/continuum/working-directory/1/modules/jaxws/target/test-classes/services/MtomSampleService
>     [copy] Copying 28 files to 
/export/home/illsleyd/continuum/continuum-1.0.3/apps/continuum/working-directory/1/modules/jaxws/target/test-classes/services/DocLitNonWrapService
>     [copy] Copying 28 files to 
/export/home/illsleyd/continuum/continuum-1.0.3/apps/continuum/working-directory/1/modules/jaxws/target/test-classes/services/DocLitWrapService
>     [copy] Copying 29 files to 
/export/home/illsleyd/continuum/continuum-1.0.3/apps/continuum/working-directory/1/modules/jaxws/target/test-classes/services/AddNumbersService
>     [copy] Copying 31 files to 
/export/home/illsleyd/continuum/continuum-1.0.3/apps/continuum/working-directory/1/modules/jaxws/target/test-classes/services/GreeterService
>     [copy] Copying 33 files to 
/export/home/illsleyd/continuum/continuum-1.0.3/apps/continuum/working-directory/1/modules/jaxws/target/test-classes/services/AsyncService
>     [copy] Copying 29 files to 
/export/home/illsleyd/continuum/continuum-1.0.3/apps/continuum/working-directory/1/modules/jaxws/target/test-classes/services/FaultyWebServiceService
>     [copy] Copying 35 files to 
/export/home/illsleyd/continuum/continuum-1.0.3/apps/continuum/working-directory/1/modules/jaxws/target/test-classes/services/FaultsService
>     [copy] Copying 30 files to 
/export/home/illsleyd/continuum/continuum-1.0.3/apps/continuum/working-directory/1/modules/jaxws/target/test-classes/services/BareDocLitService
>     [copy] Copying 29 files to 
/export/home/illsleyd/continuum/continuum-1.0.3/apps/continuum/working-directory/1/modules/jaxws/target/test-classes/services/EchoMessageService
>     [copy] Copying 28 files to 
/export/home/illsleyd/continuum/continuum-1.0.3/apps/continuum/working-directory/1/modules/jaxws/target/test-classes/services/ResourceInjectionService
>     [copy] Copying 29 files to 
/export/home/illsleyd/continuum/continuum-1.0.3/apps/continuum/working-directory/1/modules/jaxws/target/test-classes/services/AnyTypeMessageService
>     [copy] Copying 32 files to 
/export/home/illsleyd/continuum/continuum-1.0.3/apps/continuum/working-directory/1/modules/jaxws/target/test-classes/services/PolymorphicShapeService
>
>     [junit] Running org.apache.axis2.jaxws.framework.JAXWSTest
>     [junit] Tests run: 38, Failures: 0, Errors: 1, Time elapsed: 25.743 
sec
>
> BUILD FAILED
> File...... 
file:/export/home/illsleyd/.maven/cache/maven-multiproject-plugin-1.5-SNAPSHOT/plugin.jelly
> Element... maven:reactor
> Line...... 227
> Column.... 64
> Unable to obtain goal [multiproject:install-callback] -- 
file:/export/home/illsleyd/.maven/cache/maven-test-plugin-1.8.1-SNAPSHOT/plugin.jelly:155:49:

<junit> Test org.apache.axis2.jaxws.framework.JAXWSTest failed
> Total time   : 38 minutes 43 seconds 
> Finished at  : Wednesday, March 21, 2007 8:57:50 AM GMT+00:00
>
>
> 
****************************************************************************
>
>
>
> ---------------------------------------------------------------------
> To unsubscribe, e-mail: axis-dev-unsubscribe@ws.apache.org
> For additional commands, e-mail: axis-dev-help@ws.apache.org
>
> 

---------------------------------------------------------------------
To unsubscribe, e-mail: axis-dev-unsubscribe@ws.apache.org
For additional commands, e-mail: axis-dev-help@ws.apache.org



Mime
View raw message