axis-java-dev mailing list archives

Site index · List index
Message view « Date » · « Thread »
Top « Date » · « Thread »
From "davidillsley (Continuum)" <davidills...@apache.org>
Subject [Apache Axis 2.0 - Root][continuum] BUILD FAILURE
Date Sun, 18 Mar 2007 03:48:08 GMT
Online report : http://ws.zones.apache.org:10000/continuum/servlet/continuum/target/ProjectBuild.vm/view/ProjectBuild/id/61/buildId/1456
Build statistics:
  State: Failed
  Previous State: Failed
  Started at: Sun, 18 Mar 2007 03:46:41 +0000
  Finished at: Sun, 18 Mar 2007 03:48:07 +0000
  Total time: 1m 26s
  Build Trigger: Schedule
  Exit code: 1
  Building machine hostname: ws.zones.apache.org
  Operating system : SunOS(unknown)
  Java version : 1.5.0_09(Sun Microsystems Inc.)

Changes
         dims          revert previous change to SOAPPart. strip any trailing information in charset
             /webservices/axis2/trunk/java/modules/saaj/src/org/apache/axis2/saaj/SOAPMessageImpl.java
            /webservices/axis2/trunk/java/modules/saaj/src/org/apache/axis2/saaj/SOAPPartImpl.java
        
****************************************************************************
Output:
****************************************************************************
Snipped Output:
5.143359-28.pom
[WARNING] Unable to get resource from repository apache-ws-snapshots2 (http://ws.zones.apache.org/repository2/)
Downloading: http://repo1.maven.org/maven2//org/apache/ws/commons/schema/XmlSchema/20070315.143359-28/XmlSchema-20070315.143359-28.pom
[WARNING] Unable to get resource from repository maven2 (http://repo1.maven.org/maven2/)
Downloading: http://repo1.maven.org/maven2/org/apache/ws/commons/schema/XmlSchema/20070315.143359-28/XmlSchema-20070315.143359-28.pom
[WARNING] Unable to get resource from repository central (http://repo1.maven.org/maven2)
[INFO] [compiler:testCompile]
[INFO] No sources to compile
[INFO] [surefire:test]
[INFO] Tests are skipped.
[INFO] [jar:jar]
[INFO] Building jar: /export/home/illsleyd/continuum/continuum-1.0.3/apps/continuum/working-directory/61/modules/java2wsdl/target/axis2-java2wsdl-SNAPSHOT.jar
[INFO] [install:install]
[INFO] Installing /export/home/illsleyd/continuum/continuum-1.0.3/apps/continuum/working-directory/61/modules/java2wsdl/target/axis2-java2wsdl-SNAPSHOT.jar to /export/home/illsleyd/.m2/repository/org/apache/axis2/axis2-java2wsdl/SNAPSHOT/axis2-java2wsdl-SNAPSHOT.jar
[INFO] ----------------------------------------------------------------------------
[INFO] Building Apache Axis 2.0 - Kernel
[INFO]    task-segment: [clean, install]
[INFO] ----------------------------------------------------------------------------
[INFO] [clean:clean]
[INFO] Deleting directory /export/home/illsleyd/continuum/continuum-1.0.3/apps/continuum/working-directory/61/modules/kernel/target
[INFO] Deleting directory /export/home/illsleyd/continuum/continuum-1.0.3/apps/continuum/working-directory/61/modules/kernel/target/classes
[INFO] Deleting directory /export/home/illsleyd/continuum/continuum-1.0.3/apps/continuum/working-directory/61/modules/kernel/target/test-classes
[INFO] [resources:resources]
[INFO] Using default encoding to copy filtered resources.
[INFO] snapshot org.apache.ws.commons.axiom:axiom-dom:SNAPSHOT: checking for updates from apache.snapshots
[WARNING] While downloading woodstox:wstx-asl:3.2.0
  This artifact has been relocated to org.codehaus.woodstox:wstx-asl:3.2.0.


[WARNING] 
	Artifact javax.servlet:servlet-api:jar:2.3:provided retains local scope 'provided' overriding broader scope 'compile'
	given by a dependency. If this is not intended, modify or remove the local scope.

[INFO] snapshot org.apache.woden:woden:1.0-incubating-SNAPSHOT: checking for updates from apache.snapshots
Downloading: http://ws.zones.apache.org/repository2//org/apache/neethi/neethi/2.0/neethi-2.0.pom
[WARNING] Unable to get resource from repository apache-ws-snapshots2 (http://ws.zones.apache.org/repository2/)
Downloading: http://repo1.maven.org/maven2//org/apache/neethi/neethi/2.0/neethi-2.0.pom
[WARNING] Unable to get resource from repository maven2 (http://repo1.maven.org/maven2/)
Downloading: http://repo1.maven.org/maven2/org/apache/neethi/neethi/2.0/neethi-2.0.pom
[WARNING] Unable to get resource from repository central (http://repo1.maven.org/maven2)
[INFO] [compiler:compile]
[INFO] Compiling 336 source files to /export/home/illsleyd/continuum/continuum-1.0.3/apps/continuum/working-directory/61/modules/kernel/target/classes
[INFO] [resources:testResources]
[INFO] Using default encoding to copy filtered resources.
Downloading: http://ws.zones.apache.org/repository2//org/apache/ws/commons/axiom/axiom-dom/20070316.200440-2/axiom-dom-20070316.200440-2.pom
[WARNING] Unable to get resource from repository apache-ws-snapshots2 (http://ws.zones.apache.org/repository2/)
Downloading: http://repo1.maven.org/maven2//org/apache/ws/commons/axiom/axiom-dom/20070316.200440-2/axiom-dom-20070316.200440-2.pom
[WARNING] Unable to get resource from repository maven2 (http://repo1.maven.org/maven2/)
Downloading: http://repo1.maven.org/maven2/org/apache/ws/commons/axiom/axiom-dom/20070316.200440-2/axiom-dom-20070316.200440-2.pom
[WARNING] Unable to get resource from repository central (http://repo1.maven.org/maven2)
[INFO] [antrun:run {execution: process-test-resources}]
[INFO] Executing tasks

init:
     [echo] the files are up to date = ${jars.uptodate}

compile:
    [mkdir] Created dir: /export/home/illsleyd/continuum/continuum-1.0.3/apps/continuum/working-directory/61/modules/kernel/test-resources/deployment/service2/build/classes
    [mkdir] Created dir: /export/home/illsleyd/continuum/continuum-1.0.3/apps/continuum/working-directory/61/modules/kernel/test-resources/deployment/service2/build/lib

jar:
     [copy] Copying 1 file to /export/home/illsleyd/continuum/continuum-1.0.3/apps/continuum/working-directory/61/modules/kernel/test-resources/deployment/service2/build/classes/META-INF
    [mkdir] Created dir: /export/home/illsleyd/continuum/continuum-1.0.3/apps/continuum/working-directory/61/modules/kernel/target/test-resources/deployment/services
      [jar] Building jar: /export/home/illsleyd/continuum/continuum-1.0.3/apps/continuum/working-directory/61/modules/kernel/target/test-resources/deployment/services/service2.jar
   [delete] Deleting directory /export/home/illsleyd/continuum/continuum-1.0.3/apps/continuum/working-directory/61/modules/kernel/test-resources/deployment/service2/build

init:
     [echo] the files are up to date = ${jars.uptodate}

compile:
    [mkdir] Created dir: /export/home/illsleyd/continuum/continuum-1.0.3/apps/continuum/working-directory/61/modules/kernel/test-resources/deployment/echo/build/classes
    [mkdir] Created dir: /export/home/illsleyd/continuum/continuum-1.0.3/apps/continuum/working-directory/61/modules/kernel/test-resources/deployment/echo/build/lib

jar:
     [copy] Copying 1 file to /export/home/illsleyd/continuum/continuum-1.0.3/apps/continuum/working-directory/61/modules/kernel/test-resources/deployment/echo/build/classes/META-INF
    [mkdir] Created dir: /export/home/illsleyd/continuum/continuum-1.0.3/apps/continuum/working-directory/61/modules/kernel/target/echo
      [jar] Building jar: /export/home/illsleyd/continuum/continuum-1.0.3/apps/continuum/working-directory/61/modules/kernel/target/echo/echo.aar
   [delete] Deleting directory /export/home/illsleyd/continuum/continuum-1.0.3/apps/continuum/working-directory/61/modules/kernel/test-resources/deployment/echo/build

init:
     [echo] the files are up to date = ${jars.uptodate}

compile:
    [mkdir] Created dir: /export/home/illsleyd/continuum/continuum-1.0.3/apps/continuum/working-directory/61/modules/kernel/test-resources/deployment/invalidservice/build/classes
    [mkdir] Created dir: /export/home/illsleyd/continuum/continuum-1.0.3/apps/continuum/working-directory/61/modules/kernel/test-resources/deployment/invalidservice/build/lib

jar:
     [copy] Copying 1 file to /export/home/illsleyd/continuum/continuum-1.0.3/apps/continuum/working-directory/61/modules/kernel/test-resources/deployment/invalidservice/build/classes/META-INF
    [mkdir] Created dir: /export/home/illsleyd/continuum/continuum-1.0.3/apps/continuum/working-directory/61/modules/kernel/target/test-resources/InvalidDeployment/services
      [jar] Building jar: /export/home/illsleyd/continuum/continuum-1.0.3/apps/continuum/working-directory/61/modules/kernel/target/test-resources/InvalidDeployment/services/invalidService.jar
   [delete] Deleting directory /export/home/illsleyd/continuum/continuum-1.0.3/apps/continuum/working-directory/61/modules/kernel/test-resources/deployment/invalidservice/build

init:
     [echo] the files are up to date = ${jars.uptodate}

compile:
    [mkdir] Created dir: /export/home/illsleyd/continuum/continuum-1.0.3/apps/continuum/working-directory/61/modules/kernel/test-resources/deployment/module1/build/classes
    [mkdir] Created dir: /export/home/illsleyd/continuum/continuum-1.0.3/apps/continuum/working-directory/61/modules/kernel/test-resources/deployment/module1/build/lib

jar:
     [copy] Copying 1 file to /export/home/illsleyd/continuum/continuum-1.0.3/apps/continuum/working-directory/61/modules/kernel/test-resources/deployment/module1/build/classes/META-INF
    [mkdir] Created dir: /export/home/illsleyd/continuum/continuum-1.0.3/apps/continuum/working-directory/61/modules/kernel/target/test-resources/deployment/modules
      [jar] Building jar: /export/home/illsleyd/continuum/continuum-1.0.3/apps/continuum/working-directory/61/modules/kernel/target/test-resources/deployment/modules/module1.mar
   [delete] Deleting directory /export/home/illsleyd/continuum/continuum-1.0.3/apps/continuum/working-directory/61/modules/kernel/test-resources/deployment/module1/build

init:
     [echo] the files are up to date = ${jars.uptodate}

compile:
    [mkdir] Created dir: /export/home/illsleyd/continuum/continuum-1.0.3/apps/continuum/working-directory/61/modules/kernel/test-resources/deployment/serviceModule/build/classes
    [mkdir] Created dir: /export/home/illsleyd/continuum/continuum-1.0.3/apps/continuum/working-directory/61/modules/kernel/test-resources/deployment/serviceModule/build/lib

jar:
     [copy] Copying 1 file to /export/home/illsleyd/continuum/continuum-1.0.3/apps/continuum/working-directory/61/modules/kernel/test-resources/deployment/serviceModule/build/classes/META-INF
    [mkdir] Created dir: /export/home/illsleyd/continuum/continuum-1.0.3/apps/continuum/working-directory/61/modules/kernel/target/test-resources/InvalidDeployment/modules
      [jar] Building jar: /export/home/illsleyd/continuum/continuum-1.0.3/apps/continuum/working-directory/61/modules/kernel/target/test-resources/InvalidDeployment/modules/serviceModule.jar
   [delete] Deleting directory /export/home/illsleyd/continuum/continuum-1.0.3/apps/continuum/working-directory/61/modules/kernel/test-resources/deployment/serviceModule/build
[INFO] Executed tasks
[INFO] [compiler:testCompile]
[INFO] Compiling 93 source files to /export/home/illsleyd/continuum/continuum-1.0.3/apps/continuum/working-directory/61/modules/kernel/target/test-classes
[INFO] [antrun:run {execution: test-compile}]
[INFO] Executing tasks

testsetup:
    [mkdir] Created dir: /export/home/illsleyd/continuum/continuum-1.0.3/apps/continuum/working-directory/61/modules/kernel/target/test-resources/java2sec/more
    [mkdir] Created dir: /export/home/illsleyd/continuum/continuum-1.0.3/apps/continuum/working-directory/61/modules/kernel/target/test-resources/java2sec/less
      [jar] Building jar: /export/home/illsleyd/continuum/continuum-1.0.3/apps/continuum/working-directory/61/modules/kernel/target/test-resources/java2sec/more/MorePermission.jar
   [delete] Deleting directory /export/home/illsleyd/continuum/continuum-1.0.3/apps/continuum/working-directory/61/modules/kernel/target/test-classes/org/apache/axis2/java/security/driver
   [delete] Deleting directory /export/home/illsleyd/continuum/continuum-1.0.3/apps/continuum/working-directory/61/modules/kernel/target/test-classes/org/apache/axis2/java/security/more
   [delete] Deleting directory /export/home/illsleyd/continuum/continuum-1.0.3/apps/continuum/working-directory/61/modules/kernel/target/test-classes/org/apache/axis2/java/security/action
   [delete] Deleting directory /export/home/illsleyd/continuum/continuum-1.0.3/apps/continuum/working-directory/61/modules/kernel/target/test-classes/org/apache/axis2/java/security/interf
      [jar] Building jar: /export/home/illsleyd/continuum/continuum-1.0.3/apps/continuum/working-directory/61/modules/kernel/target/test-resources/java2sec/less/LessPermission.jar
   [delete] Deleting directory /export/home/illsleyd/continuum/continuum-1.0.3/apps/continuum/working-directory/61/modules/kernel/target/test-classes/org/apache/axis2/java/security/less
[INFO] Executed tasks
[INFO] [surefire:test]
[INFO] Setting reports dir: /export/home/illsleyd/continuum/continuum-1.0.3/apps/continuum/working-directory/61/modules/kernel/target/surefire-reports

-------------------------------------------------------
 T E S T S
-------------------------------------------------------
log4j:WARN No appenders could be found for logger (org.apache.axis2.engine.Phase).
log4j:WARN Please initialize the log4j system properly.
[surefire] Running org.apache.axis2.phaserule.PhaseLastTest
[surefire] Tests run: 1, Failures: 0, Errors: 0, Time elapsed: 0.022 sec
[surefire] Running org.apache.axis2.phaserule.InvalidPhaseFirstTest
[surefire] Tests run: 1, Failures: 0, Errors: 0, Time elapsed: 0.003 sec
[surefire] Running org.apache.axis2.phaserule.BeforeWithNoFirstHandlerTest
[surefire] Tests run: 1, Failures: 0, Errors: 0, Time elapsed: 0.004 sec
[surefire] Running org.apache.axis2.phaserule.InvalidPhaseRuleTest
[surefire] Tests run: 2, Failures: 0, Errors: 0, Time elapsed: 0.042 sec
[surefire] Running org.apache.axis2.phaserule.AddingHandlerToEachPhaseTest
[surefire] Tests run: 3, Failures: 0, Errors: 0, Time elapsed: 0.004 sec
[surefire] Running org.apache.axis2.phaserule.SingleHandlerPhaseTest
[surefire] Tests run: 1, Failures: 0, Errors: 0, Time elapsed: 0.003 sec
[surefire] Running org.apache.axis2.phaserule.PreDispatchPhaseRuleTest
[surefire] Tests run: 1, Failures: 0, Errors: 0, Time elapsed: 0.003 sec
[surefire] Running org.apache.axis2.phaserule.PhaseFirstTest
[surefire] Tests run: 1, Failures: 0, Errors: 0, Time elapsed: 0.002 sec
[surefire] Running org.apache.axis2.phaserule.InvalidPhaselastTest
[surefire] Tests run: 1, Failures: 0, Errors: 0, Time elapsed: 0.002 sec
[surefire] Running org.apache.axis2.phaserule.BeforeAfterTest
[surefire] Tests run: 1, Failures: 0, Errors: 0, Time elapsed: 0.002 sec
[surefire] Running org.apache.axis2.phaserule.BeforeTest
[surefire] Tests run: 1, Failures: 0, Errors: 0, Time elapsed: 0.003 sec
[surefire] Running org.apache.axis2.phaserule.PhaseRuleTest
[surefire] Tests run: 1, Failures: 0, Errors: 0, Time elapsed: 0.002 sec
[surefire] Running org.apache.axis2.phaserule.InvalidPhaseFirstRulesTest
[surefire] Tests run: 1, Failures: 0, Errors: 0, Time elapsed: 0.003 sec
[surefire] Running org.apache.axis2.phaserule.InvalidPhaseLastRuleTest
[surefire] Tests run: 1, Failures: 0, Errors: 0, Time elapsed: 0.003 sec
[surefire] Running org.apache.axis2.deployment.SystemPhasesremovedTest
[surefire] Tests run: 1, Failures: 0, Errors: 0, Time elapsed: 0.014 sec
[surefire] Running org.apache.axis2.deployment.ModuleversionTest
[surefire] Tests run: 2, Failures: 0, Errors: 0, Time elapsed: 0.639 sec
[surefire] Running org.apache.axis2.deployment.DeploymentTotalTest
[surefire] Tests run: 1, Failures: 0, Errors: 0, Time elapsed: 0.542 sec
[surefire] Running org.apache.axis2.deployment.TransportDeploymentTest
[surefire] Tests run: 1, Failures: 0, Errors: 0, Time elapsed: 0.092 sec
[surefire] Running org.apache.axis2.deployment.BuildERWithDeploymentTest
[surefire] Tests run: 1, Failures: 0, Errors: 0, Time elapsed: 0.075 sec
[surefire] Running org.apache.axis2.deployment.ModuleDisengagementTest
[surefire] Tests run: 7, Failures: 0, Errors: 0, Time elapsed: 0.417 sec
[surefire] Running org.apache.axis2.deployment.ServiceGroupTest
[surefire] Tests run: 1, Failures: 0, Errors: 0, Time elapsed: 0.942 sec
[surefire] Running org.apache.axis2.deployment.BadModuleTest
[surefire] Tests run: 1, Failures: 0, Errors: 0, Time elapsed: 0.002 sec
[surefire] Running org.apache.axis2.deployment.MessageFormatterDeploymentTest
[surefire] Tests run: 2, Failures: 0, Errors: 0, Time elapsed: 0.049 sec
[surefire] Running org.apache.axis2.deployment.AxisMessageTest
[surefire] Tests run: 1, Failures: 0, Errors: 0, Time elapsed: 0.023 sec
[surefire] Running org.apache.axis2.deployment.ModifiedConfigFileTest
[surefire] Tests run: 1, Failures: 0, Errors: 0, Time elapsed: 0.004 sec
[surefire] Running org.apache.axis2.deployment.OperationExcludeTest
[surefire] Tests run: 1, Failures: 0, Errors: 0, Time elapsed: 0.029 sec
[surefire] Running org.apache.axis2.deployment.AddingObserverTest
[surefire] Tests run: 1, Failures: 0, Errors: 0, Time elapsed: 0.015 sec
[surefire] Running org.apache.axis2.deployment.SameServiceAddingTest
[surefire] Tests run: 1, Failures: 0, Errors: 0, Time elapsed: 0.014 sec
[surefire] Running org.apache.axis2.deployment.BuilderSelectorDeploymentTest
[surefire] Tests run: 2, Failures: 0, Errors: 0, Time elapsed: 0.017 sec
[surefire] Running org.apache.axis2.engine.MessageContextSaveCTest
MessageContextSaveCTest:testHierarchyNewContext(): *** Original OperationContext message context table ****
message context table entry:   label [Out]    message ID [urn:uuid:0A8D3BDD1E6E2697DE1174189668829]    
message context table entry:   label [In]    message ID [urn:uuid:0A8D3BDD1E6E2697DE1174189668824]    
MessageContextSaveCTest:testHierarchyNewContext(): - - - Save the message context from the engine - - - -
TempHandler[1]:invoke(): executedHandlers.add(1)
SaveHandler[2]:invoke(): msgContext.pause()
SaveHandler[2]:invoke(): Resetting the file to use.
SaveHandler[2]:invoke(): temp file = [mcObjTest24483.tmp]
SaveHandler[2]:invoke(): saving message context.....
SaveHandler[2]:invoke(): ....saved message context.....
SaveHandler[2]:invoke(): file size after save [15312]   temp file = [mcObjTest24483.tmp]
SaveHandler[2]:invoke(): executedHandlers.add(2)
MessageContextSaveCTest:testHierarchyNewContext(): *** Originial object graph ****
class[org.apache.axis2.context.MessageContext]  id[urn:uuid:0A8D3BDD1E6E2697DE1174189668829]  hashcode[16199433] 
class[org.apache.axis2.context.OperationContext]  id[TestOperationA1]  hashcode[7130942] 
class[org.apache.axis2.context.ServiceContext]  id[ServiceA]  hashcode[19287172] 
class[org.apache.axis2.context.ServiceGroupContext]  id[ABCServiceGroup]  hashcode[13705010] 
class[org.apache.axis2.context.ConfigurationContext]  id[null]  hashcode[21925223] 
class[org.apache.axis2.description.InOutAxisOperation]  id[TestOperationA1]  hashcode[26998677] 
class[org.apache.axis2.description.AxisService]  id[ServiceA]  hashcode[2460099] 
class[org.apache.axis2.description.AxisServiceGroup]  id[ServiceA]  hashcode[7839182] 
class[org.apache.axis2.engine.AxisConfiguration]  id[null]  hashcode[18435317] 
MessageContextSaveCTest:testHierarchyNewContext(): - - - Restore the message context on a separate engine  - - - - - - - - - - - - - - - -
restoreMessageContext(): temp file = [mcObjTest24483.tmp]
restoreMessageContext(): restoring a message context.....
restoreMessageContext(): ....restored message context.....
MessageContextSaveCTest:testHierarchyNewContext(): *** Restored object graph ****
class[org.apache.axis2.context.MessageContext]  id[urn:uuid:0A8D3BDD1E6E2697DE1174189668829]  hashcode[23802890] 
class[org.apache.axis2.context.OperationContext]  id[TestOperationA1]  hashcode[19250131] 
class[org.apache.axis2.context.ServiceContext]  id[ServiceA]  hashcode[5126139] 
class[org.apache.axis2.context.ServiceGroupContext]  id[ABCServiceGroup]  hashcode[20796783] 
class[org.apache.axis2.context.ConfigurationContext]  id[null]  hashcode[28583563] 
class[org.apache.axis2.description.InOutAxisOperation]  id[TestOperationA1]  hashcode[28110067] 
class[org.apache.axis2.description.AxisService]  id[ServiceA]  hashcode[5142196] 
class[org.apache.axis2.description.AxisServiceGroup]  id[ServiceA]  hashcode[22231852] 
class[org.apache.axis2.engine.AxisConfiguration]  id[null]  hashcode[22140619] 
MessageContextSaveCTest:testHierarchyNewContext(): *** Restored OperationContext message context table ****
message context table entry:   label [Out]    message ID [urn:uuid:0A8D3BDD1E6E2697DE1174189668829]    
message context table entry:   label [In]    message ID [urn:uuid:0A8D3BDD1E6E2697DE1174189668824]    
compareMCTable:  Return TRUE:  message context tables match
MessageContextSaveCTest:testHierarchyNewContext(): - - - Resume the restored message context - - - - - - - - - - - - - - - -
SaveHandler[2]:invoke(): Configured for no action to be performed.
TempHandler[3]:invoke(): executedHandlers.add(3)
MessageContextSaveCTest:testHierarchyNewContext(): *** Post Resumed object graph ****
class[org.apache.axis2.context.MessageContext]  id[urn:uuid:0A8D3BDD1E6E2697DE1174189668829]  hashcode[23802890] 
class[org.apache.axis2.context.OperationContext]  id[TestOperationA1]  hashcode[19250131] 
class[org.apache.axis2.context.ServiceContext]  id[ServiceA]  hashcode[5126139] 
class[org.apache.axis2.context.ServiceGroupContext]  id[ABCServiceGroup]  hashcode[20796783] 
class[org.apache.axis2.context.ConfigurationContext]  id[null]  hashcode[28583563] 
class[org.apache.axis2.description.InOutAxisOperation]  id[TestOperationA1]  hashcode[28110067] 
class[org.apache.axis2.description.AxisService]  id[ServiceA]  hashcode[5142196] 
class[org.apache.axis2.description.AxisServiceGroup]  id[ServiceA]  hashcode[22231852] 
class[org.apache.axis2.engine.AxisConfiguration]  id[null]  hashcode[22140619] 
MessageContextSaveCTest: compareObjectGraphInfo(): name [ServiceA]  code1 [[19287172]]  !=   code2 [[5126139]]
MessageContextSaveCTest:testHierarchyReuse(): - - - Save the message context from the engine - - - -
TempHandler[1]:invoke(): executedHandlers.add(1)
SaveHandler[2]:invoke(): msgContext.pause()
SaveHandler[2]:invoke(): Resetting the file to use.
SaveHandler[2]:invoke(): temp file = [mcObjTest24484.tmp]
SaveHandler[2]:invoke(): saving message context.....
SaveHandler[2]:invoke(): ....saved message context.....
SaveHandler[2]:invoke(): file size after save [15311]   temp file = [mcObjTest24484.tmp]
SaveHandler[2]:invoke(): executedHandlers.add(2)
MessageContextSaveCTest:testHierarchyReuse(): *** Originial object graph ****
class[org.apache.axis2.context.MessageContext]  id[urn:uuid:0A8D3BDD1E6E2697DE1174189668852]  hashcode[15791788] 
class[org.apache.axis2.context.OperationContext]  id[TestOperationA1]  hashcode[24457725] 
class[org.apache.axis2.context.ServiceContext]  id[ServiceA]  hashcode[5956071] 
class[org.apache.axis2.context.ServiceGroupContext]  id[ABCServiceGroup]  hashcode[9615298] 
class[org.apache.axis2.context.ConfigurationContext]  id[null]  hashcode[21728289] 
class[org.apache.axis2.description.InOutAxisOperation]  id[TestOperationA1]  hashcode[599654] 
class[org.apache.axis2.description.AxisService]  id[ServiceA]  hashcode[14474926] 
class[org.apache.axis2.description.AxisServiceGroup]  id[ServiceA]  hashcode[10459899] 
class[org.apache.axis2.engine.AxisConfiguration]  id[null]  hashcode[7864356] 
MessageContextSaveCTest:testHierarchyReuse(): - - - Restore the message context on a separate engine  - - - - - - - - - - - - - - - -
restoreMessageContext(): temp file = [mcObjTest24484.tmp]
restoreMessageContext(): restoring a message context.....
restoreMessageContext(): ....restored message context.....
MessageContextSaveCTest:testHierarchyReuse(): *** Restored object graph ****
class[org.apache.axis2.context.MessageContext]  id[urn:uuid:0A8D3BDD1E6E2697DE1174189668852]  hashcode[18105374] 
class[org.apache.axis2.context.OperationContext]  id[TestOperationA1]  hashcode[25437623] 
class[org.apache.axis2.context.ServiceContext]  id[ServiceA]  hashcode[13123665] 
class[org.apache.axis2.context.ServiceGroupContext]  id[ABCServiceGroup]  hashcode[16164625] 
class[org.apache.axis2.context.ConfigurationContext]  id[null]  hashcode[22174443] 
class[org.apache.axis2.description.InOutAxisOperation]  id[TestOperationA1]  hashcode[14740287] 
class[org.apache.axis2.description.AxisService]  id[ServiceA]  hashcode[30348972] 
class[org.apache.axis2.description.AxisServiceGroup]  id[ServiceA]  hashcode[14268353] 
class[org.apache.axis2.engine.AxisConfiguration]  id[null]  hashcode[28253142] 
MessageContextSaveCTest:testHierarchyReuse(): - - - Resume the restored message context - - - - - - - - - - - - - - - -
SaveHandler[2]:invoke(): msgContext.pause()
SaveHandler[2]:invoke(): Resetting the file to use.
SaveHandler[2]:invoke(): temp file = [mcObjTest24484.tmp]
SaveHandler[2]:invoke(): saving message context.....
SaveHandler[2]:invoke(): ....saved message context.....
SaveHandler[2]:invoke(): file size after save [14662]   temp file = [mcObjTest24484.tmp]
SaveHandler[2]:invoke(): executedHandlers.add(2)
MessageContextSaveCTest:testHierarchyReuse(): *** Post Resumed object graph ****
class[org.apache.axis2.context.MessageContext]  id[urn:uuid:0A8D3BDD1E6E2697DE1174189668852]  hashcode[18105374] 
class[org.apache.axis2.context.OperationContext]  id[TestOperationA1]  hashcode[25437623] 
class[org.apache.axis2.context.ServiceContext]  id[ServiceA]  hashcode[13123665] 
class[org.apache.axis2.context.ServiceGroupContext]  id[ABCServiceGroup]  hashcode[16164625] 
class[org.apache.axis2.context.ConfigurationContext]  id[null]  hashcode[22174443] 
class[org.apache.axis2.description.InOutAxisOperation]  id[TestOperationA1]  hashcode[14740287] 
class[org.apache.axis2.description.AxisService]  id[ServiceA]  hashcode[30348972] 
class[org.apache.axis2.description.AxisServiceGroup]  id[ServiceA]  hashcode[14268353] 
class[org.apache.axis2.engine.AxisConfiguration]  id[null]  hashcode[28253142] 
[surefire] Tests run: 2, Failures: 0, Errors: 0, Time elapsed: 0.431 sec
[surefire] Running org.apache.axis2.engine.OptionsSaveTest
OptionsSaveTest:testSaveAndRestore():  BEGIN ---------------
OptionsSaveTest:testSaveAndRestore(): temp file = [optionsSave24485.tmp]
OptionsSaveTest:testSaveAndRestore(): saving .....
OptionsSaveTest:testSaveAndRestore(): ....save operation completed.....
OptionsSaveTest:testSaveAndRestore(): file size after save [3034]   temp file = [optionsSave24485.tmp]
OptionsSaveTest:testSaveAndRestore(): restoring .....
OptionsSaveTest:testSaveAndRestore(): ....restored operation completed.....
OptionsSaveTest:testSaveAndRestore():   Options equivalency [true]
OptionsSaveTest:testSaveAndRestore():  END ---------------
[surefire] Tests run: 1, Failures: 0, Errors: 0, Time elapsed: 0.019 sec
[surefire] Running org.apache.axis2.engine.EnginePausingTest
[surefire] Tests run: 1, Failures: 0, Errors: 0, Time elapsed: 0.01 sec
[surefire] Running org.apache.axis2.engine.MessageContextTest
[surefire] Tests run: 1, Failures: 0, Errors: 0, Time elapsed: 0.002 sec
[surefire] Running org.apache.axis2.engine.MessageContextSelfManagedDataTest
MessageContextSelfManagedDataTest::testSelfManagedData01()=======================================
MessageContextSelfManagedDataTest::TempHandler01[id=101].invoke()
MessageContextSelfManagedDataTest::TempHandler01[id=101].invoke(): Completed
MessageContextSelfManagedDataTest::testPause01_noExceptions()=======================================
MessageContextSelfManagedDataTest::TempHandler02[id=102].invoke()
MessageContextSelfManagedDataTest::TempHandler02[id=102].invoke():   Setting self managed data using key [102]
MessageContextSelfManagedDataTest::saveAndRestore::[TempHandler02[id=102].invoke()]   
MessageContextSelfManagedDataTest::saveAndRestore::[TempHandler02[id=102].invoke()]   temp file = [TempHandler02_24486.tmp]
MessageContextSelfManagedDataTest::saveAndRestore::[TempHandler02[id=102].invoke()]   saving message context ....
MessageContextSelfManagedDataTest::TempHandler02[id=102].serializeSelfManagedData()   count [1]
MessageContextSelfManagedDataTest::TempHandler02[id=102].serializeSelfManagedData()   count [1]: saved self managed data string length [25]
MessageContextSelfManagedDataTest::TempHandler02[id=102].serializeSelfManagedData()   count [1]: saved self managed data byte array output stream (UTF) length [33]
MessageContextSelfManagedDataTest::saveAndRestore::[TempHandler02[id=102].invoke()]   ....saved message context .....
MessageContextSelfManagedDataTest::saveAndRestore::[TempHandler02[id=102].invoke()]   restoring message context .....
MessageContextSelfManagedDataTest::TempHandler02[id=102].deserializeSelfManagedData()   count [1]
MessageContextSelfManagedDataTest::saveAndRestore::[TempHandler02[id=102].invoke()]   ....restored message context .....
MessageContextSelfManagedDataTest::TempHandler02[id=102].invoke(): Completed
MessageContextSelfManagedDataTest::testPause02_saveRestoreSelfManagedData()=======================================
MessageContextSelfManagedDataTest::TempHandler02[id=102].invoke()
MessageContextSelfManagedDataTest::TempHandler02[id=102].invoke():   Setting self managed data using key [102]
MessageContextSelfManagedDataTest::saveAndRestore::[TempHandler02[id=102].invoke()]   
MessageContextSelfManagedDataTest::saveAndRestore::[TempHandler02[id=102].invoke()]   temp file = [TempHandler02_24487.tmp]
MessageContextSelfManagedDataTest::saveAndRestore::[TempHandler02[id=102].invoke()]   saving message context ....
MessageContextSelfManagedDataTest::TempHandler02[id=102].serializeSelfManagedData()   count [1]
MessageContextSelfManagedDataTest::TempHandler02[id=102].serializeSelfManagedData()   count [1]: saved self managed data string length [25]
MessageContextSelfManagedDataTest::TempHandler02[id=102].serializeSelfManagedData()   count [1]: saved self managed data byte array output stream (UTF) length [33]
MessageContextSelfManagedDataTest::saveAndRestore::[TempHandler02[id=102].invoke()]   ....saved message context .....
MessageContextSelfManagedDataTest::saveAndRestore::[TempHandler02[id=102].invoke()]   restoring message context .....
MessageContextSelfManagedDataTest::TempHandler02[id=102].deserializeSelfManagedData()   count [1]
MessageContextSelfManagedDataTest::saveAndRestore::[TempHandler02[id=102].invoke()]   ....restored message context .....
MessageContextSelfManagedDataTest::TempHandler02[id=102].invoke(): Completed
MessageContextSelfManagedDataTest::testPause03_saveRestoreOperation()=======================================
MessageContextSelfManagedDataTest::TempHandler02[id=102].invoke()
MessageContextSelfManagedDataTest::TempHandler02[id=102].invoke():   Setting self managed data using key [102]
MessageContextSelfManagedDataTest::saveAndRestore::[TempHandler02[id=102].invoke()]   
MessageContextSelfManagedDataTest::saveAndRestore::[TempHandler02[id=102].invoke()]   temp file = [TempHandler02_24488.tmp]
MessageContextSelfManagedDataTest::saveAndRestore::[TempHandler02[id=102].invoke()]   saving message context ....
MessageContextSelfManagedDataTest::TempHandler02[id=102].serializeSelfManagedData()   count [1]
MessageContextSelfManagedDataTest::TempHandler02[id=102].serializeSelfManagedData()   count [1]: saved self managed data string length [25]
MessageContextSelfManagedDataTest::TempHandler02[id=102].serializeSelfManagedData()   count [1]: saved self managed data byte array output stream (UTF) length [33]
MessageContextSelfManagedDataTest::saveAndRestore::[TempHandler02[id=102].invoke()]   ....saved message context .....
MessageContextSelfManagedDataTest::saveAndRestore::[TempHandler02[id=102].invoke()]   restoring message context .....
MessageContextSelfManagedDataTest::TempHandler02[id=102].deserializeSelfManagedData()   count [1]
MessageContextSelfManagedDataTest::saveAndRestore::[TempHandler02[id=102].invoke()]   ....restored message context .....
MessageContextSelfManagedDataTest::TempHandler02[id=102].invoke(): Completed
MessageContextSelfManagedDataTest::testPause04_saveRestoreAxisService()=======================================
MessageContextSelfManagedDataTest::TempHandler02[id=102].invoke()
MessageContextSelfManagedDataTest::TempHandler02[id=102].invoke():   Setting self managed data using key [102]
MessageContextSelfManagedDataTest::saveAndRestore::[TempHandler02[id=102].invoke()]   
MessageContextSelfManagedDataTest::saveAndRestore::[TempHandler02[id=102].invoke()]   temp file = [TempHandler02_24489.tmp]
MessageContextSelfManagedDataTest::saveAndRestore::[TempHandler02[id=102].invoke()]   saving message context ....
MessageContextSelfManagedDataTest::TempHandler02[id=102].serializeSelfManagedData()   count [1]
MessageContextSelfManagedDataTest::TempHandler02[id=102].serializeSelfManagedData()   count [1]: saved self managed data string length [25]
MessageContextSelfManagedDataTest::TempHandler02[id=102].serializeSelfManagedData()   count [1]: saved self managed data byte array output stream (UTF) length [33]
MessageContextSelfManagedDataTest::saveAndRestore::[TempHandler02[id=102].invoke()]   ....saved message context .....
MessageContextSelfManagedDataTest::saveAndRestore::[TempHandler02[id=102].invoke()]   restoring message context .....
MessageContextSelfManagedDataTest::TempHandler02[id=102].deserializeSelfManagedData()   count [1]
MessageContextSelfManagedDataTest::saveAndRestore::[TempHandler02[id=102].invoke()]   ....restored message context .....
MessageContextSelfManagedDataTest::TempHandler02[id=102].invoke(): Completed
MessageContextSelfManagedDataTest::testPause05_saveRestoreAxisServiceGroup()=======================================
MessageContextSelfManagedDataTest::TempHandler02[id=102].invoke()
MessageContextSelfManagedDataTest::TempHandler02[id=102].invoke():   Setting self managed data using key [102]
MessageContextSelfManagedDataTest::saveAndRestore::[TempHandler02[id=102].invoke()]   
MessageContextSelfManagedDataTest::saveAndRestore::[TempHandler02[id=102].invoke()]   temp file = [TempHandler02_24490.tmp]
MessageContextSelfManagedDataTest::saveAndRestore::[TempHandler02[id=102].invoke()]   saving message context ....
MessageContextSelfManagedDataTest::TempHandler02[id=102].serializeSelfManagedData()   count [1]
MessageContextSelfManagedDataTest::TempHandler02[id=102].serializeSelfManagedData()   count [1]: saved self managed data string length [25]
MessageContextSelfManagedDataTest::TempHandler02[id=102].serializeSelfManagedData()   count [1]: saved self managed data byte array output stream (UTF) length [33]
MessageContextSelfManagedDataTest::saveAndRestore::[TempHandler02[id=102].invoke()]   ....saved message context .....
MessageContextSelfManagedDataTest::saveAndRestore::[TempHandler02[id=102].invoke()]   restoring message context .....
MessageContextSelfManagedDataTest::TempHandler02[id=102].deserializeSelfManagedData()   count [1]
MessageContextSelfManagedDataTest::saveAndRestore::[TempHandler02[id=102].invoke()]   ....restored message context .....
MessageContextSelfManagedDataTest::TempHandler02[id=102].invoke(): Completed
MessageContextSelfManagedDataTest::testPause06_saveRestorePhases()=======================================
MessageContextSelfManagedDataTest::TempHandler02[id=61].invoke()
MessageContextSelfManagedDataTest::TempHandler02[id=61].invoke():   Setting self managed data using key [61]
MessageContextSelfManagedDataTest::saveAndRestore::[TempHandler02[id=61].invoke()]   
MessageContextSelfManagedDataTest::saveAndRestore::[TempHandler02[id=61].invoke()]   temp file = [TempHandler02_24491.tmp]
MessageContextSelfManagedDataTest::saveAndRestore::[TempHandler02[id=61].invoke()]   saving message context ....
MessageContextSelfManagedDataTest::TempHandler02[id=61].serializeSelfManagedData()   count [1]
MessageContextSelfManagedDataTest::TempHandler02[id=61].serializeSelfManagedData()   count [1]: saved self managed data string length [24]
MessageContextSelfManagedDataTest::TempHandler02[id=61].serializeSelfManagedData()   count [1]: saved self managed data byte array output stream (UTF) length [32]
MessageContextSelfManagedDataTest::TempHandler03[id=62].serializeSelfManagedData()   count [1]
MessageContextSelfManagedDataTest::TempHandler03[id=62].serializeSelfManagedData()   count [1]:  No self managed data to serialize
MessageContextSelfManagedDataTest::TempHandler02[id=63].serializeSelfManagedData()   count [1]
MessageContextSelfManagedDataTest::TempHandler02[id=63].serializeSelfManagedData()   count [1]:  No self managed data to serialize
MessageContextSelfManagedDataTest::TempHandler02[id=666].serializeSelfManagedData()   count [1]
MessageContextSelfManagedDataTest::TempHandler02[id=666].serializeSelfManagedData()   count [1]:  No self managed data to serialize
MessageContextSelfManagedDataTest::TempHandler03[id=64].serializeSelfManagedData()   count [1]
MessageContextSelfManagedDataTest::TempHandler03[id=64].serializeSelfManagedData()   count [1]:  No self managed data to serialize
MessageContextSelfManagedDataTest::TempHandler02[id=65].serializeSelfManagedData()   count [1]
MessageContextSelfManagedDataTest::TempHandler02[id=65].serializeSelfManagedData()   count [1]:  No self managed data to serialize
MessageContextSelfManagedDataTest::TempHandler02[id=1000].serializeSelfManagedData()   count [1]
MessageContextSelfManagedDataTest::TempHandler02[id=1000].serializeSelfManagedData()   count [1]:  No self managed data to serialize
MessageContextSelfManagedDataTest::TempHandler03[id=66].serializeSelfManagedData()   count [1]
MessageContextSelfManagedDataTest::TempHandler03[id=66].serializeSelfManagedData()   count [1]:  No self managed data to serialize
MessageContextSelfManagedDataTest::TempHandler02[id=67].serializeSelfManagedData()   count [1]
MessageContextSelfManagedDataTest::TempHandler02[id=67].serializeSelfManagedData()   count [1]:  No self managed data to serialize
MessageContextSelfManagedDataTest::TempHandler03[id=68].serializeSelfManagedData()   count [1]
MessageContextSelfManagedDataTest::TempHandler03[id=68].serializeSelfManagedData()   count [1]:  No self managed data to serialize
MessageContextSelfManagedDataTest::saveAndRestore::[TempHandler02[id=61].invoke()]   ....saved message context .....
MessageContextSelfManagedDataTest::saveAndRestore::[TempHandler02[id=61].invoke()]   restoring message context .....
MessageContextSelfManagedDataTest::TempHandler02[id=61].deserializeSelfManagedData()   count [1]
MessageContextSelfManagedDataTest::saveAndRestore::[TempHandler02[id=61].invoke()]   ....restored message context .....
MessageContextSelfManagedDataTest::TempHandler02[id=61].invoke(): Completed
MessageContextSelfManagedDataTest::TempHandler03[id=62].invoke()
MessageContextSelfManagedDataTest::TempHandler03[id=62].invoke():   Setting self managed data using key [62]
MessageContextSelfManagedDataTest::saveAndRestore::[TempHandler03[id=62].invoke()]   
MessageContextSelfManagedDataTest::saveAndRestore::[TempHandler03[id=62].invoke()]   temp file = [TempHandler03_24492.tmp]
MessageContextSelfManagedDataTest::saveAndRestore::[TempHandler03[id=62].invoke()]   saving message context ....
MessageContextSelfManagedDataTest::TempHandler02[id=61].serializeSelfManagedData()   count [2]
MessageContextSelfManagedDataTest::TempHandler02[id=61].serializeSelfManagedData()   count [2]: saved self managed data string length [24]
MessageContextSelfManagedDataTest::TempHandler02[id=61].serializeSelfManagedData()   count [2]: saved self managed data byte array output stream (UTF) length [32]
MessageContextSelfManagedDataTest::TempHandler03[id=62].serializeSelfManagedData()   count [2]
MessageContextSelfManagedDataTest::TempHandler03[id=62].serializeSelfManagedData()   count [2]: saved self managed data byte [] length [25]
MessageContextSelfManagedDataTest::TempHandler03[id=62].serializeSelfManagedData()   count [2]: saved self managed data byte array output stream length [25]
MessageContextSelfManagedDataTest::TempHandler02[id=63].serializeSelfManagedData()   count [2]
MessageContextSelfManagedDataTest::TempHandler02[id=63].serializeSelfManagedData()   count [2]:  No self managed data to serialize
MessageContextSelfManagedDataTest::TempHandler02[id=666].serializeSelfManagedData()   count [2]
MessageContextSelfManagedDataTest::TempHandler02[id=666].serializeSelfManagedData()   count [2]:  No self managed data to serialize
MessageContextSelfManagedDataTest::TempHandler03[id=64].serializeSelfManagedData()   count [2]
MessageContextSelfManagedDataTest::TempHandler03[id=64].serializeSelfManagedData()   count [2]:  No self managed data to serialize
MessageContextSelfManagedDataTest::TempHandler02[id=65].serializeSelfManagedData()   count [2]
MessageContextSelfManagedDataTest::TempHandler02[id=65].serializeSelfManagedData()   count [2]:  No self managed data to serialize
MessageContextSelfManagedDataTest::TempHandler02[id=1000].serializeSelfManagedData()   count [2]
MessageContextSelfManagedDataTest::TempHandler02[id=1000].serializeSelfManagedData()   count [2]:  No self managed data to serialize
MessageContextSelfManagedDataTest::TempHandler03[id=66].serializeSelfManagedData()   count [2]
MessageContextSelfManagedDataTest::TempHandler03[id=66].serializeSelfManagedData()   count [2]:  No self managed data to serialize
MessageContextSelfManagedDataTest::TempHandler02[id=67].serializeSelfManagedData()   count [2]
MessageContextSelfManagedDataTest::TempHandler02[id=67].serializeSelfManagedData()   count [2]:  No self managed data to serialize
MessageContextSelfManagedDataTest::TempHandler03[id=68].serializeSelfManagedData()   count [2]
MessageContextSelfManagedDataTest::TempHandler03[id=68].serializeSelfManagedData()   count [2]:  No self managed data to serialize
MessageContextSelfManagedDataTest::saveAndRestore::[TempHandler03[id=62].invoke()]   ....saved message context .....
MessageContextSelfManagedDataTest::saveAndRestore::[TempHandler03[id=62].invoke()]   restoring message context .....
MessageContextSelfManagedDataTest::TempHandler02[id=61].deserializeSelfManagedData()   count [2]
MessageContextSelfManagedDataTest::TempHandler03[id=62].deserializeSelfManagedData()   count [1]
MessageContextSelfManagedDataTest::saveAndRestore::[TempHandler03[id=62].invoke()]   ....restored message context .....
MessageContextSelfManagedDataTest::TempHandler03[id=62].invoke(): Completed
MessageContextSelfManagedDataTest::TempHandler02[id=63].invoke()
MessageContextSelfManagedDataTest::TempHandler02[id=63].invoke():   Setting self managed data using key [63]
MessageContextSelfManagedDataTest::saveAndRestore::[TempHandler02[id=63].invoke()]   
MessageContextSelfManagedDataTest::saveAndRestore::[TempHandler02[id=63].invoke()]   temp file = [TempHandler02_24493.tmp]
MessageContextSelfManagedDataTest::saveAndRestore::[TempHandler02[id=63].invoke()]   saving message context ....
MessageContextSelfManagedDataTest::TempHandler02[id=61].serializeSelfManagedData()   count [3]
MessageContextSelfManagedDataTest::TempHandler02[id=61].serializeSelfManagedData()   count [3]: saved self managed data string length [24]
MessageContextSelfManagedDataTest::TempHandler02[id=61].serializeSelfManagedData()   count [3]: saved self managed data byte array output stream (UTF) length [32]
MessageContextSelfManagedDataTest::TempHandler03[id=62].serializeSelfManagedData()   count [3]
MessageContextSelfManagedDataTest::TempHandler03[id=62].serializeSelfManagedData()   count [3]: saved self managed data byte [] length [25]
MessageContextSelfManagedDataTest::TempHandler03[id=62].serializeSelfManagedData()   count [3]: saved self managed data byte array output stream length [25]
MessageContextSelfManagedDataTest::TempHandler02[id=63].serializeSelfManagedData()   count [3]
MessageContextSelfManagedDataTest::TempHandler02[id=63].serializeSelfManagedData()   count [3]: saved self managed data string length [24]
MessageContextSelfManagedDataTest::TempHandler02[id=63].serializeSelfManagedData()   count [3]: saved self managed data byte array output stream (UTF) length [32]
MessageContextSelfManagedDataTest::TempHandler02[id=666].serializeSelfManagedData()   count [3]
MessageContextSelfManagedDataTest::TempHandler02[id=666].serializeSelfManagedData()   count [3]:  No self managed data to serialize
MessageContextSelfManagedDataTest::TempHandler03[id=64].serializeSelfManagedData()   count [3]
MessageContextSelfManagedDataTest::TempHandler03[id=64].serializeSelfManagedData()   count [3]:  No self managed data to serialize
MessageContextSelfManagedDataTest::TempHandler02[id=65].serializeSelfManagedData()   count [3]
MessageContextSelfManagedDataTest::TempHandler02[id=65].serializeSelfManagedData()   count [3]:  No self managed data to serialize
MessageContextSelfManagedDataTest::TempHandler02[id=1000].serializeSelfManagedData()   count [3]
MessageContextSelfManagedDataTest::TempHandler02[id=1000].serializeSelfManagedData()   count [3]:  No self managed data to serialize
MessageContextSelfManagedDataTest::TempHandler03[id=66].serializeSelfManagedData()   count [3]
MessageContextSelfManagedDataTest::TempHandler03[id=66].serializeSelfManagedData()   count [3]:  No self managed data to serialize
MessageContextSelfManagedDataTest::TempHandler02[id=67].serializeSelfManagedData()   count [3]
MessageContextSelfManagedDataTest::TempHandler02[id=67].serializeSelfManagedData()   count [3]:  No self managed data to serialize
MessageContextSelfManagedDataTest::TempHandler03[id=68].serializeSelfManagedData()   count [3]
MessageContextSelfManagedDataTest::TempHandler03[id=68].serializeSelfManagedData()   count [3]:  No self managed data to serialize
MessageContextSelfManagedDataTest::saveAndRestore::[TempHandler02[id=63].invoke()]   ....saved message context .....
MessageContextSelfManagedDataTest::saveAndRestore::[TempHandler02[id=63].invoke()]   restoring message context .....
MessageContextSelfManagedDataTest::TempHandler02[id=61].deserializeSelfManagedData()   count [3]
MessageContextSelfManagedDataTest::TempHandler03[id=62].deserializeSelfManagedData()   count [2]
MessageContextSelfManagedDataTest::TempHandler02[id=63].deserializeSelfManagedData()   count [1]
MessageContextSelfManagedDataTest::saveAndRestore::[TempHandler02[id=63].invoke()]   ....restored message context .....
MessageContextSelfManagedDataTest::TempHandler02[id=63].invoke(): Completed
MessageContextSelfManagedDataTest::TempHandler02[id=666].invoke()
MessageContextSelfManagedDataTest::TempHandler02[id=666].invoke():   Setting self managed data using key [666]
MessageContextSelfManagedDataTest::saveAndRestore::[TempHandler02[id=666].invoke()]   
MessageContextSelfManagedDataTest::saveAndRestore::[TempHandler02[id=666].invoke()]   temp file = [TempHandler02_24494.tmp]
MessageContextSelfManagedDataTest::saveAndRestore::[TempHandler02[id=666].invoke()]   saving message context ....
MessageContextSelfManagedDataTest::TempHandler02[id=61].serializeSelfManagedData()   count [4]
MessageContextSelfManagedDataTest::TempHandler02[id=61].serializeSelfManagedData()   count [4]: saved self managed data string length [24]
MessageContextSelfManagedDataTest::TempHandler02[id=61].serializeSelfManagedData()   count [4]: saved self managed data byte array output stream (UTF) length [32]
MessageContextSelfManagedDataTest::TempHandler03[id=62].serializeSelfManagedData()   count [4]
MessageContextSelfManagedDataTest::TempHandler03[id=62].serializeSelfManagedData()   count [4]: saved self managed data byte [] length [25]
MessageContextSelfManagedDataTest::TempHandler03[id=62].serializeSelfManagedData()   count [4]: saved self managed data byte array output stream length [25]
MessageContextSelfManagedDataTest::TempHandler02[id=63].serializeSelfManagedData()   count [4]
MessageContextSelfManagedDataTest::TempHandler02[id=63].serializeSelfManagedData()   count [4]: saved self managed data string length [24]
MessageContextSelfManagedDataTest::TempHandler02[id=63].serializeSelfManagedData()   count [4]: saved self managed data byte array output stream (UTF) length [32]
MessageContextSelfManagedDataTest::TempHandler02[id=666].serializeSelfManagedData()   count [4]
MessageContextSelfManagedDataTest::TempHandler02[id=666].serializeSelfManagedData()   count [4]: saved self managed data string length [25]
MessageContextSelfManagedDataTest::TempHandler02[id=666].serializeSelfManagedData()   count [4]: saved self managed data byte array output stream (UTF) length [33]
MessageContextSelfManagedDataTest::TempHandler03[id=64].serializeSelfManagedData()   count [4]
MessageContextSelfManagedDataTest::TempHandler03[id=64].serializeSelfManagedData()   count [4]:  No self managed data to serialize
MessageContextSelfManagedDataTest::TempHandler02[id=65].serializeSelfManagedData()   count [4]
MessageContextSelfManagedDataTest::TempHandler02[id=65].serializeSelfManagedData()   count [4]:  No self managed data to serialize
MessageContextSelfManagedDataTest::TempHandler02[id=1000].serializeSelfManagedData()   count [4]
MessageContextSelfManagedDataTest::TempHandler02[id=1000].serializeSelfManagedData()   count [4]:  No self managed data to serialize
MessageContextSelfManagedDataTest::TempHandler03[id=66].serializeSelfManagedData()   count [4]
MessageContextSelfManagedDataTest::TempHandler03[id=66].serializeSelfManagedData()   count [4]:  No self managed data to serialize
MessageContextSelfManagedDataTest::TempHandler02[id=67].serializeSelfManagedData()   count [4]
MessageContextSelfManagedDataTest::TempHandler02[id=67].serializeSelfManagedData()   count [4]:  No self managed data to serialize
MessageContextSelfManagedDataTest::TempHandler03[id=68].serializeSelfManagedData()   count [4]
MessageContextSelfManagedDataTest::TempHandler03[id=68].serializeSelfManagedData()   count [4]:  No self managed data to serialize
MessageContextSelfManagedDataTest::saveAndRestore::[TempHandler02[id=666].invoke()]   ....saved message context .....
MessageContextSelfManagedDataTest::saveAndRestore::[TempHandler02[id=666].invoke()]   restoring message context .....
MessageContextSelfManagedDataTest::TempHandler02[id=61].deserializeSelfManagedData()   count [4]
MessageContextSelfManagedDataTest::TempHandler03[id=62].deserializeSelfManagedData()   count [3]
MessageContextSelfManagedDataTest::TempHandler02[id=63].deserializeSelfManagedData()   count [2]
MessageContextSelfManagedDataTest::TempHandler02[id=666].deserializeSelfManagedData()   count [1]
MessageContextSelfManagedDataTest::saveAndRestore::[TempHandler02[id=666].invoke()]   ....restored message context .....
MessageContextSelfManagedDataTest::TempHandler02[id=666].invoke(): Completed
MessageContextSelfManagedDataTest::TempHandler03[id=64].invoke()
MessageContextSelfManagedDataTest::TempHandler03[id=64].invoke():   Setting self managed data using key [64]
MessageContextSelfManagedDataTest::saveAndRestore::[TempHandler03[id=64].invoke()]   
MessageContextSelfManagedDataTest::saveAndRestore::[TempHandler03[id=64].invoke()]   temp file = [TempHandler03_24495.tmp]
MessageContextSelfManagedDataTest::saveAndRestore::[TempHandler03[id=64].invoke()]   saving message context ....
MessageContextSelfManagedDataTest::TempHandler02[id=61].serializeSelfManagedData()   count [5]
MessageContextSelfManagedDataTest::TempHandler02[id=61].serializeSelfManagedData()   count [5]: saved self managed data string length [24]
MessageContextSelfManagedDataTest::TempHandler02[id=61].serializeSelfManagedData()   count [5]: saved self managed data byte array output stream (UTF) length [32]
MessageContextSelfManagedDataTest::TempHandler03[id=62].serializeSelfManagedData()   count [5]
MessageContextSelfManagedDataTest::TempHandler03[id=62].serializeSelfManagedData()   count [5]: saved self managed data byte [] length [25]
MessageContextSelfManagedDataTest::TempHandler03[id=62].serializeSelfManagedData()   count [5]: saved self managed data byte array output stream length [25]
MessageContextSelfManagedDataTest::TempHandler02[id=63].serializeSelfManagedData()   count [5]
MessageContextSelfManagedDataTest::TempHandler02[id=63].serializeSelfManagedData()   count [5]: saved self managed data string length [24]
MessageContextSelfManagedDataTest::TempHandler02[id=63].serializeSelfManagedData()   count [5]: saved self managed data byte array output stream (UTF) length [32]
MessageContextSelfManagedDataTest::TempHandler02[id=666].serializeSelfManagedData()   count [5]
MessageContextSelfManagedDataTest::TempHandler02[id=666].serializeSelfManagedData()   count [5]: saved self managed data string length [25]
MessageContextSelfManagedDataTest::TempHandler02[id=666].serializeSelfManagedData()   count [5]: saved self managed data byte array output stream (UTF) length [33]
MessageContextSelfManagedDataTest::TempHandler03[id=64].serializeSelfManagedData()   count [5]
MessageContextSelfManagedDataTest::TempHandler03[id=64].serializeSelfManagedData()   count [5]: saved self managed data byte [] length [25]
MessageContextSelfManagedDataTest::TempHandler03[id=64].serializeSelfManagedData()   count [5]: saved self managed data byte array output stream length [25]
MessageContextSelfManagedDataTest::TempHandler02[id=65].serializeSelfManagedData()   count [5]
MessageContextSelfManagedDataTest::TempHandler02[id=65].serializeSelfManagedData()   count [5]:  No self managed data to serialize
MessageContextSelfManagedDataTest::TempHandler02[id=1000].serializeSelfManagedData()   count [5]
MessageContextSelfManagedDataTest::TempHandler02[id=1000].serializeSelfManagedData()   count [5]:  No self managed data to serialize
MessageContextSelfManagedDataTest::TempHandler03[id=66].serializeSelfManagedData()   count [5]
MessageContextSelfManagedDataTest::TempHandler03[id=66].serializeSelfManagedData()   count [5]:  No self managed data to serialize
MessageContextSelfManagedDataTest::TempHandler02[id=67].serializeSelfManagedData()   count [5]
MessageContextSelfManagedDataTest::TempHandler02[id=67].serializeSelfManagedData()   count [5]:  No self managed data to serialize
MessageContextSelfManagedDataTest::TempHandler03[id=68].serializeSelfManagedData()   count [5]
MessageContextSelfManagedDataTest::TempHandler03[id=68].serializeSelfManagedData()   count [5]:  No self managed data to serialize
MessageContextSelfManagedDataTest::saveAndRestore::[TempHandler03[id=64].invoke()]   ....saved message context .....
MessageContextSelfManagedDataTest::saveAndRestore::[TempHandler03[id=64].invoke()]   restoring message context .....
MessageContextSelfManagedDataTest::TempHandler02[id=61].deserializeSelfManagedData()   count [5]
MessageContextSelfManagedDataTest::TempHandler03[id=62].deserializeSelfManagedData()   count [4]
MessageContextSelfManagedDataTest::TempHandler02[id=63].deserializeSelfManagedData()   count [3]
MessageContextSelfManagedDataTest::TempHandler02[id=666].deserializeSelfManagedData()   count [2]
MessageContextSelfManagedDataTest::TempHandler03[id=64].deserializeSelfManagedData()   count [1]
MessageContextSelfManagedDataTest::saveAndRestore::[TempHandler03[id=64].invoke()]   ....restored message context .....
MessageContextSelfManagedDataTest::TempHandler03[id=64].invoke(): Completed
MessageContextSelfManagedDataTest::TempHandler02[id=65].invoke()
MessageContextSelfManagedDataTest::TempHandler02[id=65].invoke():   Setting self managed data using key [65]
MessageContextSelfManagedDataTest::saveAndRestore::[TempHandler02[id=65].invoke()]   
MessageContextSelfManagedDataTest::saveAndRestore::[TempHandler02[id=65].invoke()]   temp file = [TempHandler02_24496.tmp]
MessageContextSelfManagedDataTest::saveAndRestore::[TempHandler02[id=65].invoke()]   saving message context ....
MessageContextSelfManagedDataTest::TempHandler02[id=61].serializeSelfManagedData()   count [6]
MessageContextSelfManagedDataTest::TempHandler02[id=61].serializeSelfManagedData()   count [6]: saved self managed data string length [24]
MessageContextSelfManagedDataTest::TempHandler02[id=61].serializeSelfManagedData()   count [6]: saved self managed data byte array output stream (UTF) length [32]
MessageContextSelfManagedDataTest::TempHandler03[id=62].serializeSelfManagedData()   count [6]
MessageContextSelfManagedDataTest::TempHandler03[id=62].serializeSelfManagedData()   count [6]: saved self managed data byte [] length [25]
MessageContextSelfManagedDataTest::TempHandler03[id=62].serializeSelfManagedData()   count [6]: saved self managed data byte array output stream length [25]
MessageContextSelfManagedDataTest::TempHandler02[id=63].serializeSelfManagedData()   count [6]
MessageContextSelfManagedDataTest::TempHandler02[id=63].serializeSelfManagedData()   count [6]: saved self managed data string length [24]
MessageContextSelfManagedDataTest::TempHandler02[id=63].serializeSelfManagedData()   count [6]: saved self managed data byte array output stream (UTF) length [32]
MessageContextSelfManagedDataTest::TempHandler02[id=666].serializeSelfManagedData()   count [6]
MessageContextSelfManagedDataTest::TempHandler02[id=666].serializeSelfManagedData()   count [6]: saved self managed data string length [25]
MessageContextSelfManagedDataTest::TempHandler02[id=666].serializeSelfManagedData()   count [6]: saved self managed data byte array output stream (UTF) length [33]
MessageContextSelfManagedDataTest::TempHandler03[id=64].serializeSelfManagedData()   count [6]
MessageContextSelfManagedDataTest::TempHandler03[id=64].serializeSelfManagedData()   count [6]: saved self managed data byte [] length [25]
MessageContextSelfManagedDataTest::TempHandler03[id=64].serializeSelfManagedData()   count [6]: saved self managed data byte array output stream length [25]
MessageContextSelfManagedDataTest::TempHandler02[id=65].serializeSelfManagedData()   count [6]
MessageContextSelfManagedDataTest::TempHandler02[id=65].serializeSelfManagedData()   count [6]: saved self managed data string length [24]
MessageContextSelfManagedDataTest::TempHandler02[id=65].serializeSelfManagedData()   count [6]: saved self managed data byte array output stream (UTF) length [32]
MessageContextSelfManagedDataTest::TempHandler02[id=1000].serializeSelfManagedData()   count [6]
MessageContextSelfManagedDataTest::TempHandler02[id=1000].serializeSelfManagedData()   count [6]:  No self managed data to serialize
MessageContextSelfManagedDataTest::TempHandler03[id=66].serializeSelfManagedData()   count [6]
MessageContextSelfManagedDataTest::TempHandler03[id=66].serializeSelfManagedData()   count [6]:  No self managed data to serialize
MessageContextSelfManagedDataTest::TempHandler02[id=67].serializeSelfManagedData()   count [6]
MessageContextSelfManagedDataTest::TempHandler02[id=67].serializeSelfManagedData()   count [6]:  No self managed data to serialize
MessageContextSelfManagedDataTest::TempHandler03[id=68].serializeSelfManagedData()   count [6]
MessageContextSelfManagedDataTest::TempHandler03[id=68].serializeSelfManagedData()   count [6]:  No self managed data to serialize
MessageContextSelfManagedDataTest::saveAndRestore::[TempHandler02[id=65].invoke()]   ....saved message context .....
MessageContextSelfManagedDataTest::saveAndRestore::[TempHandler02[id=65].invoke()]   restoring message context .....
MessageContextSelfManagedDataTest::TempHandler02[id=61].deserializeSelfManagedData()   count [6]
MessageContextSelfManagedDataTest::TempHandler03[id=62].deserializeSelfManagedData()   count [5]
MessageContextSelfManagedDataTest::TempHandler02[id=63].deserializeSelfManagedData()   count [4]
MessageContextSelfManagedDataTest::TempHandler02[id=666].deserializeSelfManagedData()   count [3]
MessageContextSelfManagedDataTest::TempHandler03[id=64].deserializeSelfManagedData()   count [2]
MessageContextSelfManagedDataTest::TempHandler02[id=65].deserializeSelfManagedData()   count [1]
MessageContextSelfManagedDataTest::saveAndRestore::[TempHandler02[id=65].invoke()]   ....restored message context .....
MessageContextSelfManagedDataTest::TempHandler02[id=65].invoke(): Completed
MessageContextSelfManagedDataTest::TempHandler02[id=1000].invoke()
MessageContextSelfManagedDataTest::TempHandler02[id=1000].invoke():   Setting self managed data using key [1000]
MessageContextSelfManagedDataTest::saveAndRestore::[TempHandler02[id=1000].invoke()]   
MessageContextSelfManagedDataTest::saveAndRestore::[TempHandler02[id=1000].invoke()]   temp file = [TempHandler02_24497.tmp]
MessageContextSelfManagedDataTest::saveAndRestore::[TempHandler02[id=1000].invoke()]   saving message context ....
MessageContextSelfManagedDataTest::TempHandler02[id=61].serializeSelfManagedData()   count [7]
MessageContextSelfManagedDataTest::TempHandler02[id=61].serializeSelfManagedData()   count [7]: saved self managed data string length [24]
MessageContextSelfManagedDataTest::TempHandler02[id=61].serializeSelfManagedData()   count [7]: saved self managed data byte array output stream (UTF) length [32]
MessageContextSelfManagedDataTest::TempHandler03[id=62].serializeSelfManagedData()   count [7]
MessageContextSelfManagedDataTest::TempHandler03[id=62].serializeSelfManagedData()   count [7]: saved self managed data byte [] length [25]
MessageContextSelfManagedDataTest::TempHandler03[id=62].serializeSelfManagedData()   count [7]: saved self managed data byte array output stream length [25]
MessageContextSelfManagedDataTest::TempHandler02[id=63].serializeSelfManagedData()   count [7]
MessageContextSelfManagedDataTest::TempHandler02[id=63].serializeSelfManagedData()   count [7]: saved self managed data string length [24]
MessageContextSelfManagedDataTest::TempHandler02[id=63].serializeSelfManagedData()   count [7]: saved self managed data byte array output stream (UTF) length [32]
MessageContextSelfManagedDataTest::TempHandler02[id=666].serializeSelfManagedData()   count [7]
MessageContextSelfManagedDataTest::TempHandler02[id=666].serializeSelfManagedData()   count [7]: saved self managed data string length [25]
MessageContextSelfManagedDataTest::TempHandler02[id=666].serializeSelfManagedData()   count [7]: saved self managed data byte array output stream (UTF) length [33]
MessageContextSelfManagedDataTest::TempHandler03[id=64].serializeSelfManagedData()   count [7]
MessageContextSelfManagedDataTest::TempHandler03[id=64].serializeSelfManagedData()   count [7]: saved self managed data byte [] length [25]
MessageContextSelfManagedDataTest::TempHandler03[id=64].serializeSelfManagedData()   count [7]: saved self managed data byte array output stream length [25]
MessageContextSelfManagedDataTest::TempHandler02[id=65].serializeSelfManagedData()   count [7]
MessageContextSelfManagedDataTest::TempHandler02[id=65].serializeSelfManagedData()   count [7]: saved self managed data string length [24]
MessageContextSelfManagedDataTest::TempHandler02[id=65].serializeSelfManagedData()   count [7]: saved self managed data byte array output stream (UTF) length [32]
MessageContextSelfManagedDataTest::TempHandler02[id=1000].serializeSelfManagedData()   count [7]
MessageContextSelfManagedDataTest::TempHandler02[id=1000].serializeSelfManagedData()   count [7]: saved self managed data string length [26]
MessageContextSelfManagedDataTest::TempHandler02[id=1000].serializeSelfManagedData()   count [7]: saved self managed data byte array output stream (UTF) length [34]
MessageContextSelfManagedDataTest::TempHandler03[id=66].serializeSelfManagedData()   count [7]
MessageContextSelfManagedDataTest::TempHandler03[id=66].serializeSelfManagedData()   count [7]:  No self managed data to serialize
MessageContextSelfManagedDataTest::TempHandler02[id=67].serializeSelfManagedData()   count [7]
MessageContextSelfManagedDataTest::TempHandler02[id=67].serializeSelfManagedData()   count [7]:  No self managed data to serialize
MessageContextSelfManagedDataTest::TempHandler03[id=68].serializeSelfManagedData()   count [7]
MessageContextSelfManagedDataTest::TempHandler03[id=68].serializeSelfManagedData()   count [7]:  No self managed data to serialize
MessageContextSelfManagedDataTest::saveAndRestore::[TempHandler02[id=1000].invoke()]   ....saved message context .....
MessageContextSelfManagedDataTest::saveAndRestore::[TempHandler02[id=1000].invoke()]   restoring message context .....
MessageContextSelfManagedDataTest::TempHandler02[id=61].deserializeSelfManagedData()   count [7]
MessageContextSelfManagedDataTest::TempHandler03[id=62].deserializeSelfManagedData()   count [6]
MessageContextSelfManagedDataTest::TempHandler02[id=63].deserializeSelfManagedData()   count [5]
MessageContextSelfManagedDataTest::TempHandler02[id=666].deserializeSelfManagedData()   count [4]
MessageContextSelfManagedDataTest::TempHandler03[id=64].deserializeSelfManagedData()   count [3]
MessageContextSelfManagedDataTest::TempHandler02[id=65].deserializeSelfManagedData()   count [2]
MessageContextSelfManagedDataTest::TempHandler02[id=1000].deserializeSelfManagedData()   count [1]
MessageContextSelfManagedDataTest::saveAndRestore::[TempHandler02[id=1000].invoke()]   ....restored message context .....
MessageContextSelfManagedDataTest::TempHandler02[id=1000].invoke(): Completed
MessageContextSelfManagedDataTest::TempHandler02[id=666].invoke()
MessageContextSelfManagedDataTest::TempHandler02[id=666].invoke():   Setting self managed data using key [666]
MessageContextSelfManagedDataTest::saveAndRestore::[TempHandler02[id=666].invoke()]   
MessageContextSelfManagedDataTest::saveAndRestore::[TempHandler02[id=666].invoke()]   temp file = [TempHandler02_24498.tmp]
MessageContextSelfManagedDataTest::saveAndRestore::[TempHandler02[id=666].invoke()]   saving message context ....
MessageContextSelfManagedDataTest::TempHandler02[id=61].serializeSelfManagedData()   count [8]
MessageContextSelfManagedDataTest::TempHandler02[id=61].serializeSelfManagedData()   count [8]: saved self managed data string length [24]
MessageContextSelfManagedDataTest::TempHandler02[id=61].serializeSelfManagedData()   count [8]: saved self managed data byte array output stream (UTF) length [32]
MessageContextSelfManagedDataTest::TempHandler03[id=62].serializeSelfManagedData()   count [8]
MessageContextSelfManagedDataTest::TempHandler03[id=62].serializeSelfManagedData()   count [8]: saved self managed data byte [] length [25]
MessageContextSelfManagedDataTest::TempHandler03[id=62].serializeSelfManagedData()   count [8]: saved self managed data byte array output stream length [25]
MessageContextSelfManagedDataTest::TempHandler02[id=63].serializeSelfManagedData()   count [8]
MessageContextSelfManagedDataTest::TempHandler02[id=63].serializeSelfManagedData()   count [8]: saved self managed data string length [24]
MessageContextSelfManagedDataTest::TempHandler02[id=63].serializeSelfManagedData()   count [8]: saved self managed data byte array output stream (UTF) length [32]
MessageContextSelfManagedDataTest::TempHandler02[id=666].serializeSelfManagedData()   count [8]
MessageContextSelfManagedDataTest::TempHandler02[id=666].serializeSelfManagedData()   count [8]: saved self managed data string length [48]
MessageContextSelfManagedDataTest::TempHandler02[id=666].serializeSelfManagedData()   count [8]: saved self managed data byte array output stream (UTF) length [56]
MessageContextSelfManagedDataTest::TempHandler03[id=64].serializeSelfManagedData()   count [8]
MessageContextSelfManagedDataTest::TempHandler03[id=64].serializeSelfManagedData()   count [8]: saved self managed data byte [] length [25]
MessageContextSelfManagedDataTest::TempHandler03[id=64].serializeSelfManagedData()   count [8]: saved self managed data byte array output stream length [25]
MessageContextSelfManagedDataTest::TempHandler02[id=65].serializeSelfManagedData()   count [8]
MessageContextSelfManagedDataTest::TempHandler02[id=65].serializeSelfManagedData()   count [8]: saved self managed data string length [24]
MessageContextSelfManagedDataTest::TempHandler02[id=65].serializeSelfManagedData()   count [8]: saved self managed data byte array output stream (UTF) length [32]
MessageContextSelfManagedDataTest::TempHandler02[id=1000].serializeSelfManagedData()   count [8]
MessageContextSelfManagedDataTest::TempHandler02[id=1000].serializeSelfManagedData()   count [8]: saved self managed data string length [26]
MessageContextSelfManagedDataTest::TempHandler02[id=1000].serializeSelfManagedData()   count [8]: saved self managed data byte array output stream (UTF) length [34]
MessageContextSelfManagedDataTest::TempHandler03[id=66].serializeSelfManagedData()   count [8]
MessageContextSelfManagedDataTest::TempHandler03[id=66].serializeSelfManagedData()   count [8]:  No self managed data to serialize
MessageContextSelfManagedDataTest::TempHandler02[id=67].serializeSelfManagedData()   count [8]
MessageContextSelfManagedDataTest::TempHandler02[id=67].serializeSelfManagedData()   count [8]:  No self managed data to serialize
MessageContextSelfManagedDataTest::TempHandler03[id=68].serializeSelfManagedData()   count [8]
MessageContextSelfManagedDataTest::TempHandler03[id=68].serializeSelfManagedData()   count [8]:  No self managed data to serialize
MessageContextSelfManagedDataTest::saveAndRestore::[TempHandler02[id=666].invoke()]   ....saved message context .....
MessageContextSelfManagedDataTest::saveAndRestore::[TempHandler02[id=666].invoke()]   restoring message context .....
MessageContextSelfManagedDataTest::TempHandler02[id=61].deserializeSelfManagedData()   count [8]
MessageContextSelfManagedDataTest::TempHandler03[id=62].deserializeSelfManagedData()   count [7]
MessageContextSelfManagedDataTest::TempHandler02[id=63].deserializeSelfManagedData()   count [6]
MessageContextSelfManagedDataTest::TempHandler02[id=666].deserializeSelfManagedData()   count [5]
MessageContextSelfManagedDataTest::TempHandler03[id=64].deserializeSelfManagedData()   count [4]
MessageContextSelfManagedDataTest::TempHandler02[id=65].deserializeSelfManagedData()   count [3]
MessageContextSelfManagedDataTest::TempHandler02[id=1000].deserializeSelfManagedData()   count [2]
MessageContextSelfManagedDataTest::saveAndRestore::[TempHandler02[id=666].invoke()]   ....restored message context .....
MessageContextSelfManagedDataTest::TempHandler02[id=666].invoke(): Completed
MessageContextSelfManagedDataTest::TempHandler03[id=66].invoke()
MessageContextSelfManagedDataTest::TempHandler03[id=66].invoke():   Setting self managed data using key [66]
MessageContextSelfManagedDataTest::saveAndRestore::[TempHandler03[id=66].invoke()]   
MessageContextSelfManagedDataTest::saveAndRestore::[TempHandler03[id=66].invoke()]   temp file = [TempHandler03_24499.tmp]
MessageContextSelfManagedDataTest::saveAndRestore::[TempHandler03[id=66].invoke()]   saving message context ....
MessageContextSelfManagedDataTest::TempHandler02[id=61].serializeSelfManagedData()   count [9]
MessageContextSelfManagedDataTest::TempHandler02[id=61].serializeSelfManagedData()   count [9]: saved self managed data string length [24]
MessageContextSelfManagedDataTest::TempHandler02[id=61].serializeSelfManagedData()   count [9]: saved self managed data byte array output stream (UTF) length [32]
MessageContextSelfManagedDataTest::TempHandler03[id=62].serializeSelfManagedData()   count [9]
MessageContextSelfManagedDataTest::TempHandler03[id=62].serializeSelfManagedData()   count [9]: saved self managed data byte [] length [25]
MessageContextSelfManagedDataTest::TempHandler03[id=62].serializeSelfManagedData()   count [9]: saved self managed data byte array output stream length [25]
MessageContextSelfManagedDataTest::TempHandler02[id=63].serializeSelfManagedData()   count [9]
MessageContextSelfManagedDataTest::TempHandler02[id=63].serializeSelfManagedData()   count [9]: saved self managed data string length [24]
MessageContextSelfManagedDataTest::TempHandler02[id=63].serializeSelfManagedData()   count [9]: saved self managed data byte array output stream (UTF) length [32]
MessageContextSelfManagedDataTest::TempHandler02[id=666].serializeSelfManagedData()   count [9]
MessageContextSelfManagedDataTest::TempHandler02[id=666].serializeSelfManagedData()   count [9]: saved self managed data string length [48]
MessageContextSelfManagedDataTest::TempHandler02[id=666].serializeSelfManagedData()   count [9]: saved self managed data byte array output stream (UTF) length [56]
MessageContextSelfManagedDataTest::TempHandler03[id=64].serializeSelfManagedData()   count [9]
MessageContextSelfManagedDataTest::TempHandler03[id=64].serializeSelfManagedData()   count [9]: saved self managed data byte [] length [25]
MessageContextSelfManagedDataTest::TempHandler03[id=64].serializeSelfManagedData()   count [9]: saved self managed data byte array output stream length [25]
MessageContextSelfManagedDataTest::TempHandler02[id=65].serializeSelfManagedData()   count [9]
MessageContextSelfManagedDataTest::TempHandler02[id=65].serializeSelfManagedData()   count [9]: saved self managed data string length [24]
MessageContextSelfManagedDataTest::TempHandler02[id=65].serializeSelfManagedData()   count [9]: saved self managed data byte array output stream (UTF) length [32]
MessageContextSelfManagedDataTest::TempHandler02[id=1000].serializeSelfManagedData()   count [9]
MessageContextSelfManagedDataTest::TempHandler02[id=1000].serializeSelfManagedData()   count [9]: saved self managed data string length [26]
MessageContextSelfManagedDataTest::TempHandler02[id=1000].serializeSelfManagedData()   count [9]: saved self managed data byte array output stream (UTF) length [34]
MessageContextSelfManagedDataTest::TempHandler03[id=66].serializeSelfManagedData()   count [9]
MessageContextSelfManagedDataTest::TempHandler03[id=66].serializeSelfManagedData()   count [9]: saved self managed data byte [] length [25]
MessageContextSelfManagedDataTest::TempHandler03[id=66].serializeSelfManagedData()   count [9]: saved self managed data byte array output stream length [25]
MessageContextSelfManagedDataTest::TempHandler02[id=67].serializeSelfManagedData()   count [9]
MessageContextSelfManagedDataTest::TempHandler02[id=67].serializeSelfManagedData()   count [9]:  No self managed data to serialize
MessageContextSelfManagedDataTest::TempHandler03[id=68].serializeSelfManagedData()   count [9]
MessageContextSelfManagedDataTest::TempHandler03[id=68].serializeSelfManagedData()   count [9]:  No self managed data to serialize
MessageContextSelfManagedDataTest::saveAndRestore::[TempHandler03[id=66].invoke()]   ....saved message context .....
MessageContextSelfManagedDataTest::saveAndRestore::[TempHandler03[id=66].invoke()]   restoring message context .....
MessageContextSelfManagedDataTest::TempHandler02[id=61].deserializeSelfManagedData()   count [9]
MessageContextSelfManagedDataTest::TempHandler03[id=62].deserializeSelfManagedData()   count [8]
MessageContextSelfManagedDataTest::TempHandler02[id=63].deserializeSelfManagedData()   count [7]
MessageContextSelfManagedDataTest::TempHandler02[id=666].deserializeSelfManagedData()   count [6]
MessageContextSelfManagedDataTest::TempHandler03[id=64].deserializeSelfManagedData()   count [5]
MessageContextSelfManagedDataTest::TempHandler02[id=65].deserializeSelfManagedData()   count [4]
MessageContextSelfManagedDataTest::TempHandler02[id=1000].deserializeSelfManagedData()   count [3]
MessageContextSelfManagedDataTest::TempHandler03[id=66].deserializeSelfManagedData()   count [1]
MessageContextSelfManagedDataTest::saveAndRestore::[TempHandler03[id=66].invoke()]   ....restored message context .....
MessageContextSelfManagedDataTest::TempHandler03[id=66].invoke(): Completed
MessageContextSelfManagedDataTest::TempHandler02[id=67].invoke()
MessageContextSelfManagedDataTest::TempHandler02[id=67].invoke():   Setting self managed data using key [67]
MessageContextSelfManagedDataTest::saveAndRestore::[TempHandler02[id=67].invoke()]   
MessageContextSelfManagedDataTest::saveAndRestore::[TempHandler02[id=67].invoke()]   temp file = [TempHandler02_24500.tmp]
MessageContextSelfManagedDataTest::saveAndRestore::[TempHandler02[id=67].invoke()]   saving message context ....
MessageContextSelfManagedDataTest::TempHandler02[id=61].serializeSelfManagedData()   count [10]
MessageContextSelfManagedDataTest::TempHandler02[id=61].serializeSelfManagedData()   count [10]: saved self managed data string length [24]
MessageContextSelfManagedDataTest::TempHandler02[id=61].serializeSelfManagedData()   count [10]: saved self managed data byte array output stream (UTF) length [32]
MessageContextSelfManagedDataTest::TempHandler03[id=62].serializeSelfManagedData()   count [10]
MessageContextSelfManagedDataTest::TempHandler03[id=62].serializeSelfManagedData()   count [10]: saved self managed data byte [] length [25]
MessageContextSelfManagedDataTest::TempHandler03[id=62].serializeSelfManagedData()   count [10]: saved self managed data byte array output stream length [25]
MessageContextSelfManagedDataTest::TempHandler02[id=63].serializeSelfManagedData()   count [10]
MessageContextSelfManagedDataTest::TempHandler02[id=63].serializeSelfManagedData()   count [10]: saved self managed data string length [24]
MessageContextSelfManagedDataTest::TempHandler02[id=63].serializeSelfManagedData()   count [10]: saved self managed data byte array output stream (UTF) length [32]
MessageContextSelfManagedDataTest::TempHandler02[id=666].serializeSelfManagedData()   count [10]
MessageContextSelfManagedDataTest::TempHandler02[id=666].serializeSelfManagedData()   count [10]: saved self managed data string length [48]
MessageContextSelfManagedDataTest::TempHandler02[id=666].serializeSelfManagedData()   count [10]: saved self managed data byte array output stream (UTF) length [56]
MessageContextSelfManagedDataTest::TempHandler03[id=64].serializeSelfManagedData()   count [10]
MessageContextSelfManagedDataTest::TempHandler03[id=64].serializeSelfManagedData()   count [10]: saved self managed data byte [] length [25]
MessageContextSelfManagedDataTest::TempHandler03[id=64].serializeSelfManagedData()   count [10]: saved self managed data byte array output stream length [25]
MessageContextSelfManagedDataTest::TempHandler02[id=65].serializeSelfManagedData()   count [10]
MessageContextSelfManagedDataTest::TempHandler02[id=65].serializeSelfManagedData()   count [10]: saved self managed data string length [24]
MessageContextSelfManagedDataTest::TempHandler02[id=65].serializeSelfManagedData()   count [10]: saved self managed data byte array output stream (UTF) length [32]
MessageContextSelfManagedDataTest::TempHandler02[id=1000].serializeSelfManagedData()   count [10]
MessageContextSelfManagedDataTest::TempHandler02[id=1000].serializeSelfManagedData()   count [10]: saved self managed data string length [26]
MessageContextSelfManagedDataTest::TempHandler02[id=1000].serializeSelfManagedData()   count [10]: saved self managed data byte array output stream (UTF) length [34]
MessageContextSelfManagedDataTest::TempHandler03[id=66].serializeSelfManagedData()   count [10]
MessageContextSelfManagedDataTest::TempHandler03[id=66].serializeSelfManagedData()   count [10]: saved self managed data byte [] length [25]
MessageContextSelfManagedDataTest::TempHandler03[id=66].serializeSelfManagedData()   count [10]: saved self managed data byte array output stream length [25]
MessageContextSelfManagedDataTest::TempHandler02[id=67].serializeSelfManagedData()   count [10]
MessageContextSelfManagedDataTest::TempHandler02[id=67].serializeSelfManagedData()   count [10]: saved self managed data string length [24]
MessageContextSelfManagedDataTest::TempHandler02[id=67].serializeSelfManagedData()   count [10]: saved self managed data byte array output stream (UTF) length [32]
MessageContextSelfManagedDataTest::TempHandler03[id=68].serializeSelfManagedData()   count [10]
MessageContextSelfManagedDataTest::TempHandler03[id=68].serializeSelfManagedData()   count [10]:  No self managed data to serialize
MessageContextSelfManagedDataTest::saveAndRestore::[TempHandler02[id=67].invoke()]   ....saved message context .....
MessageContextSelfManagedDataTest::saveAndRestore::[TempHandler02[id=67].invoke()]   restoring message context .....
MessageContextSelfManagedDataTest::TempHandler02[id=61].deserializeSelfManagedData()   count [10]
MessageContextSelfManagedDataTest::TempHandler03[id=62].deserializeSelfManagedData()   count [9]
MessageContextSelfManagedDataTest::TempHandler02[id=63].deserializeSelfManagedData()   count [8]
MessageContextSelfManagedDataTest::TempHandler02[id=666].deserializeSelfManagedData()   count [7]
MessageContextSelfManagedDataTest::TempHandler03[id=64].deserializeSelfManagedData()   count [6]
MessageContextSelfManagedDataTest::TempHandler02[id=65].deserializeSelfManagedData()   count [5]
MessageContextSelfManagedDataTest::TempHandler02[id=1000].deserializeSelfManagedData()   count [4]
MessageContextSelfManagedDataTest::TempHandler03[id=66].deserializeSelfManagedData()   count [2]
MessageContextSelfManagedDataTest::TempHandler02[id=67].deserializeSelfManagedData()   count [1]
MessageContextSelfManagedDataTest::saveAndRestore::[TempHandler02[id=67].invoke()]   ....restored message context .....
MessageContextSelfManagedDataTest::TempHandler02[id=67].invoke(): Completed
MessageContextSelfManagedDataTest::TempHandler03[id=68].invoke()
MessageContextSelfManagedDataTest::TempHandler03[id=68].invoke():   Setting self managed data using key [68]
MessageContextSelfManagedDataTest::saveAndRestore::[TempHandler03[id=68].invoke()]   
MessageContextSelfManagedDataTest::saveAndRestore::[TempHandler03[id=68].invoke()]   temp file = [TempHandler03_24501.tmp]
MessageContextSelfManagedDataTest::saveAndRestore::[TempHandler03[id=68].invoke()]   saving message context ....
MessageContextSelfManagedDataTest::TempHandler02[id=61].serializeSelfManagedData()   count [11]
MessageContextSelfManagedDataTest::TempHandler02[id=61].serializeSelfManagedData()   count [11]: saved self managed data string length [24]
MessageContextSelfManagedDataTest::TempHandler02[id=61].serializeSelfManagedData()   count [11]: saved self managed data byte array output stream (UTF) length [32]
MessageContextSelfManagedDataTest::TempHandler03[id=62].serializeSelfManagedData()   count [11]
MessageContextSelfManagedDataTest::TempHandler03[id=62].serializeSelfManagedData()   count [11]: saved self managed data byte [] length [25]
MessageContextSelfManagedDataTest::TempHandler03[id=62].serializeSelfManagedData()   count [11]: saved self managed data byte array output stream length [25]
MessageContextSelfManagedDataTest::TempHandler02[id=63].serializeSelfManagedData()   count [11]
MessageContextSelfManagedDataTest::TempHandler02[id=63].serializeSelfManagedData()   count [11]: saved self managed data string length [24]
MessageContextSelfManagedDataTest::TempHandler02[id=63].serializeSelfManagedData()   count [11]: saved self managed data byte array output stream (UTF) length [32]
MessageContextSelfManagedDataTest::TempHandler02[id=666].serializeSelfManagedData()   count [11]
MessageContextSelfManagedDataTest::TempHandler02[id=666].serializeSelfManagedData()   count [11]: saved self managed data string length [48]
MessageContextSelfManagedDataTest::TempHandler02[id=666].serializeSelfManagedData()   count [11]: saved self managed data byte array output stream (UTF) length [56]
MessageContextSelfManagedDataTest::TempHandler03[id=64].serializeSelfManagedData()   count [11]
MessageContextSelfManagedDataTest::TempHandler03[id=64].serializeSelfManagedData()   count [11]: saved self managed data byte [] length [25]
MessageContextSelfManagedDataTest::TempHandler03[id=64].serializeSelfManagedData()   count [11]: saved self managed data byte array output stream length [25]
MessageContextSelfManagedDataTest::TempHandler02[id=65].serializeSelfManagedData()   count [11]
MessageContextSelfManagedDataTest::TempHandler02[id=65].serializeSelfManagedData()   count [11]: saved self managed data string length [24]
MessageContextSelfManagedDataTest::TempHandler02[id=65].serializeSelfManagedData()   count [11]: saved self managed data byte array output stream (UTF) length [32]
MessageContextSelfManagedDataTest::TempHandler02[id=1000].serializeSelfManagedData()   count [11]
MessageContextSelfManagedDataTest::TempHandler02[id=1000].serializeSelfManagedData()   count [11]: saved self managed data string length [26]
MessageContextSelfManagedDataTest::TempHandler02[id=1000].serializeSelfManagedData()   count [11]: saved self managed data byte array output stream (UTF) length [34]
MessageContextSelfManagedDataTest::TempHandler03[id=66].serializeSelfManagedData()   count [11]
MessageContextSelfManagedDataTest::TempHandler03[id=66].serializeSelfManagedData()   count [11]: saved self managed data byte [] length [25]
MessageContextSelfManagedDataTest::TempHandler03[id=66].serializeSelfManagedData()   count [11]: saved self managed data byte array output stream length [25]
MessageContextSelfManagedDataTest::TempHandler02[id=67].serializeSelfManagedData()   count [11]
MessageContextSelfManagedDataTest::TempHandler02[id=67].serializeSelfManagedData()   count [11]: saved self managed data string length [24]
MessageContextSelfManagedDataTest::TempHandler02[id=67].serializeSelfManagedData()   count [11]: saved self managed data byte array output stream (UTF) length [32]
MessageContextSelfManagedDataTest::TempHandler03[id=68].serializeSelfManagedData()   count [11]
MessageContextSelfManagedDataTest::TempHandler03[id=68].serializeSelfManagedData()   count [11]: saved self managed data byte [] length [25]
MessageContextSelfManagedDataTest::TempHandler03[id=68].serializeSelfManagedData()   count [11]: saved self managed data byte array output stream length [25]
MessageContextSelfManagedDataTest::saveAndRestore::[TempHandler03[id=68].invoke()]   ....saved message context .....
MessageContextSelfManagedDataTest::saveAndRestore::[TempHandler03[id=68].invoke()]   restoring message context .....
MessageContextSelfManagedDataTest::TempHandler02[id=61].deserializeSelfManagedData()   count [11]
MessageContextSelfManagedDataTest::TempHandler03[id=62].deserializeSelfManagedData()   count [10]
MessageContextSelfManagedDataTest::TempHandler02[id=63].deserializeSelfManagedData()   count [9]
MessageContextSelfManagedDataTest::TempHandler02[id=666].deserializeSelfManagedData()   count [8]
MessageContextSelfManagedDataTest::TempHandler03[id=64].deserializeSelfManagedData()   count [7]
MessageContextSelfManagedDataTest::TempHandler02[id=65].deserializeSelfManagedData()   count [6]
MessageContextSelfManagedDataTest::TempHandler02[id=1000].deserializeSelfManagedData()   count [5]
MessageContextSelfManagedDataTest::TempHandler03[id=66].deserializeSelfManagedData()   count [3]
MessageContextSelfManagedDataTest::TempHandler02[id=67].deserializeSelfManagedData()   count [2]
MessageContextSelfManagedDataTest::TempHandler03[id=68].deserializeSelfManagedData()   count [1]
MessageContextSelfManagedDataTest::saveAndRestore::[TempHandler03[id=68].invoke()]   ....restored message context .....
MessageContextSelfManagedDataTest::TempHandler03[id=68].invoke(): Completed
MessagecontextSelfManagedDataTest::compareHandlers:  class [org.apache.axis2.engine.MessageContextSelfManagedDataTest$TempHandler02] match 
MessagecontextSelfManagedDataTest::compareHandlers:  id [61] match
MessagecontextSelfManagedDataTest::compareHandlers:  class [org.apache.axis2.engine.MessageContextSelfManagedDataTest$TempHandler03] match 
MessagecontextSelfManagedDataTest::compareHandlers:  id [62] match
MessagecontextSelfManagedDataTest::compareHandlers:  class [org.apache.axis2.engine.MessageContextSelfManagedDataTest$TempHandler02] match 
MessagecontextSelfManagedDataTest::compareHandlers:  id [63] match
MessagecontextSelfManagedDataTest::compareHandlers:  class [org.apache.axis2.engine.MessageContextSelfManagedDataTest$TempHandler02] match 
MessagecontextSelfManagedDataTest::compareHandlers:  id [666] match
MessagecontextSelfManagedDataTest::compareHandlers:  class [org.apache.axis2.engine.MessageContextSelfManagedDataTest$TempHandler03] match 
MessagecontextSelfManagedDataTest::compareHandlers:  id [64] match
MessagecontextSelfManagedDataTest::compareHandlers:  class [org.apache.axis2.engine.MessageContextSelfManagedDataTest$TempHandler02] match 
MessagecontextSelfManagedDataTest::compareHandlers:  id [65] match
MessagecontextSelfManagedDataTest::compareHandlers:  class [org.apache.axis2.engine.MessageContextSelfManagedDataTest$TempHandler02] match 
MessagecontextSelfManagedDataTest::compareHandlers:  id [1000] match
MessagecontextSelfManagedDataTest::compareHandlers:  class [org.apache.axis2.engine.MessageContextSelfManagedDataTest$TempHandler02] match 
MessagecontextSelfManagedDataTest::compareHandlers:  id [666] match
MessagecontextSelfManagedDataTest::compareHandlers:  class [org.apache.axis2.engine.MessageContextSelfManagedDataTest$TempHandler03] match 
MessagecontextSelfManagedDataTest::compareHandlers:  id [66] match
MessagecontextSelfManagedDataTest::compareHandlers:  class [org.apache.axis2.engine.MessageContextSelfManagedDataTest$TempHandler02] match 
MessagecontextSelfManagedDataTest::compareHandlers:  id [1000] match
MessagecontextSelfManagedDataTest::compareHandlers:  class [org.apache.axis2.engine.MessageContextSelfManagedDataTest$TempHandler02] match 
MessagecontextSelfManagedDataTest::compareHandlers:  id [67] match
MessagecontextSelfManagedDataTest::compareHandlers:  class [org.apache.axis2.engine.MessageContextSelfManagedDataTest$TempHandler03] match 
MessagecontextSelfManagedDataTest::compareHandlers:  id [68] match
MessageContextSelfManagedDataTest::testPause06_saveRestorePhases()::  invokecallcount [11]
MessageContextSelfManagedDataTest::testPause06_saveRestorePhases()::  handlerA serialize call count [11]
MessageContextSelfManagedDataTest::testPause06_saveRestorePhases()::  handlerA deserialize call count [8]
MessageContextSelfManagedDataTest::testSelfManagedData07()=======================================
MessageContextSelfManagedDataTest::TempHandler03[id=103].invoke()
MessageContextSelfManagedDataTest::TempHandler03[id=103].invoke():   Setting self managed data using key [103]
MessageContextSelfManagedDataTest::saveAndRestore::[TempHandler03[id=103].invoke()]   
MessageContextSelfManagedDataTest::saveAndRestore::[TempHandler03[id=103].invoke()]   temp file = [TempHandler03_24502.tmp]
MessageContextSelfManagedDataTest::saveAndRestore::[TempHandler03[id=103].invoke()]   saving message context ....
MessageContextSelfManagedDataTest::TempHandler03[id=103].serializeSelfManagedData()   count [1]
MessageContextSelfManagedDataTest::TempHandler03[id=103].serializeSelfManagedData()   count [1]: saved self managed data byte [] length [25]
MessageContextSelfManagedDataTest::TempHandler03[id=103].serializeSelfManagedData()   count [1]: saved self managed data byte array output stream length [25]
MessageContextSelfManagedDataTest::saveAndRestore::[TempHandler03[id=103].invoke()]   ....saved message context .....
MessageContextSelfManagedDataTest::saveAndRestore::[TempHandler03[id=103].invoke()]   restoring message context .....
MessageContextSelfManagedDataTest::TempHandler03[id=103].deserializeSelfManagedData()   count [1]
MessageContextSelfManagedDataTest::saveAndRestore::[TempHandler03[id=103].invoke()]   ....restored message context .....
MessageContextSelfManagedDataTest::TempHandler03[id=103].invoke(): Completed
MessageContextSelfManagedDataTest::testSelfManagedData08()=======================================
MessageContextSelfManagedDataTest::TempHandler04[id=104].invoke()
MessageContextSelfManagedDataTest::TempHandler04[id=104].invoke():   Setting self managed data using key [104]
MessageContextSelfManagedDataTest::saveAndRestore::[TempHandler04[id=104].invoke()]   
MessageContextSelfManagedDataTest::saveAndRestore::[TempHandler04[id=104].invoke()]   temp file = [TempHandler04_24503.tmp]
MessageContextSelfManagedDataTest::saveAndRestore::[TempHandler04[id=104].invoke()]   saving message context ....
MessageContextSelfManagedDataTest::TempHandler04[id=104].serializeSelfManagedData()   count [1]
MessageContextSelfManagedDataTest::TempHandler04[id=104].serializeSelfManagedData()   count [1]: saved self managed data byte [] length [4]
MessageContextSelfManagedDataTest::TempHandler04[id=104].serializeSelfManagedData()   count [1]: saved self managed data byte array output stream length [42]
MessageContextSelfManagedDataTest::saveAndRestore::[TempHandler04[id=104].invoke()]   ....saved message context .....
MessageContextSelfManagedDataTest::saveAndRestore::[TempHandler04[id=104].invoke()]   restoring message context .....
MessageContextSelfManagedDataTest::TempHandler04[id=104].deserializeSelfManagedData()   count [1]
MessageContextSelfManagedDataTest::saveAndRestore::[TempHandler04[id=104].invoke()]   ....restored message context .....
MessageContextSelfManagedDataTest::TempHandler04[id=104].invoke(): Completed
MessageContextSelfManagedDataTest::testSelfManagedData09()=======================================
MessageContextSelfManagedDataTest::TempHandler03[id=103].invoke()
MessageContextSelfManagedDataTest::TempHandler03[id=103].invoke():   Setting self managed data using key [103]
MessageContextSelfManagedDataTest::saveAndRestore::[TempHandler03[id=103].invoke()]   
MessageContextSelfManagedDataTest::saveAndRestore::[TempHandler03[id=103].invoke()]   temp file = [TempHandler03_24504.tmp]
MessageContextSelfManagedDataTest::saveAndRestore::[TempHandler03[id=103].invoke()]   saving message context ....
MessageContextSelfManagedDataTest::TempHandler03[id=103].serializeSelfManagedData()   count [1]
MessageContextSelfManagedDataTest::TempHandler03[id=103].serializeSelfManagedData()   count [1]: saved self managed data byte [] length [25]
MessageContextSelfManagedDataTest::TempHandler03[id=103].serializeSelfManagedData()   count [1]: saved self managed data byte array output stream length [25]
MessageContextSelfManagedDataTest::TempHandler04[id=104].serializeSelfManagedData()   count [1]
MessageContextSelfManagedDataTest::TempHandler04[id=104].serializeSelfManagedData()   count [1]:  No self managed data to serialize
MessageContextSelfManagedDataTest::saveAndRestore::[TempHandler03[id=103].invoke()]   ....saved message context .....
MessageContextSelfManagedDataTest::saveAndRestore::[TempHandler03[id=103].invoke()]   restoring message context .....
MessageContextSelfManagedDataTest::TempHandler03[id=103].deserializeSelfManagedData()   count [1]
MessageContextSelfManagedDataTest::saveAndRestore::[TempHandler03[id=103].invoke()]   ....restored message context .....
MessageContextSelfManagedDataTest::TempHandler03[id=103].invoke(): Completed
MessageContextSelfManagedDataTest::TempHandler04[id=104].invoke()
MessageContextSelfManagedDataTest::TempHandler04[id=104].invoke():   Setting self managed data using key [104]
MessageContextSelfManagedDataTest::saveAndRestore::[TempHandler04[id=104].invoke()]   
MessageContextSelfManagedDataTest::saveAndRestore::[TempHandler04[id=104].invoke()]   temp file = [TempHandler04_24505.tmp]
MessageContextSelfManagedDataTest::saveAndRestore::[TempHandler04[id=104].invoke()]   saving message context ....
MessageContextSelfManagedDataTest::TempHandler03[id=103].serializeSelfManagedData()   count [2]
MessageContextSelfManagedDataTest::TempHandler03[id=103].serializeSelfManagedData()   count [2]: saved self managed data byte [] length [25]
MessageContextSelfManagedDataTest::TempHandler03[id=103].serializeSelfManagedData()   count [2]: saved self managed data byte array output stream length [25]
MessageContextSelfManagedDataTest::TempHandler04[id=104].serializeSelfManagedData()   count [2]
MessageContextSelfManagedDataTest::TempHandler04[id=104].serializeSelfManagedData()   count [2]: saved self managed data byte [] length [4]
MessageContextSelfManagedDataTest::TempHandler04[id=104].serializeSelfManagedData()   count [2]: saved self managed data byte array output stream length [42]
MessageContextSelfManagedDataTest::saveAndRestore::[TempHandler04[id=104].invoke()]   ....saved message context .....
MessageContextSelfManagedDataTest::saveAndRestore::[TempHandler04[id=104].invoke()]   restoring message context .....
MessageContextSelfManagedDataTest::TempHandler03[id=103].deserializeSelfManagedData()   count [2]
MessageContextSelfManagedDataTest::TempHandler04[id=104].deserializeSelfManagedData()   count [1]
MessageContextSelfManagedDataTest::saveAndRestore::[TempHandler04[id=104].invoke()]   ....restored message context .....
MessageContextSelfManagedDataTest::TempHandler04[id=104].invoke(): Completed
[surefire] Tests run: 10, Failures: 0, Errors: 0, Time elapsed: 0.726 sec
[surefire] Running org.apache.axis2.engine.SOAPActionBasedDispatcherTest
[surefire] Tests run: 4, Failures: 0, Errors: 0, Time elapsed: 0.007 sec
[surefire] Running org.apache.axis2.engine.ModuleEngageTest
[surefire] Tests run: 1, Failures: 0, Errors: 0, Time elapsed: 0.027 sec
[surefire] Running org.apache.axis2.engine.ParameterAddTest
[surefire] Tests run: 4, Failures: 0, Errors: 0, Time elapsed: 0.004 sec
[surefire] Running org.apache.axis2.engine.MessageContextSaveATest
MessageContextSaveATest:testReceive(): start - - engine.receive(mc) - - - - - - - - - - - - - - - -
TempHandler[1]:invoke(): pause = [false]
TempHandler[1]:invoke(): executedHandlers.add(1)
TempHandler[2]:invoke(): pause = [false]
TempHandler[2]:invoke(): executedHandlers.add(2)
TempHandler[3]:invoke(): pause = [false]
TempHandler[3]:invoke(): executedHandlers.add(3)
TempHandler[4]:invoke(): pause = [false]
TempHandler[4]:invoke(): executedHandlers.add(4)
TempHandler[5]:invoke(): pause = [false]
TempHandler[5]:invoke(): executedHandlers.add(5)
TempHandler[6]:invoke(): pause = [false]
TempHandler[6]:invoke(): executedHandlers.add(6)
TempHandler[7]:invoke(): pause = [false]
TempHandler[7]:invoke(): executedHandlers.add(7)
TempHandler[8]:invoke(): pause = [false]
TempHandler[8]:invoke(): executedHandlers.add(8)
TempHandler[9]:invoke(): pause = [false]
TempHandler[9]:invoke(): executedHandlers.add(9)
TempHandler[10]:invoke(): pause = [false]
TempHandler[10]:invoke(): executedHandlers.add(10)
TempHandler[11]:invoke(): pause = [false]
TempHandler[11]:invoke(): executedHandlers.add(11)
TempHandler[12]:invoke(): pause = [false]
TempHandler[12]:invoke(): executedHandlers.add(12)
TempHandler[13]:invoke(): pause = [false]
TempHandler[13]:invoke(): executedHandlers.add(13)
TempHandler[14]:invoke(): pause = [false]
TempHandler[14]:invoke(): executedHandlers.add(14)
TempHandler[15]:invoke(): pause = [true]
TempHandler[15]:invoke(): msgContext.pause()
TempHandler[15]:invoke(): temp file = [mcSave24506.tmp]
TempHandler[15]:invoke(): saving message context.....
TempHandler[15]:invoke(): ....saved message context.....
TempHandler[15]:invoke(): file size after save [22453]   temp file = [mcSave24506.tmp]
TempHandler[15]:invoke(): restoring a message context.....
TempHandler[15]:invoke(): ....restored message context.....
TempHandler[15]:invoke(): execution chain equivalency [true]
MessageContextSaveATest::compareHandlers:  class [org.apache.axis2.engine.MessageContextSaveATest$TempHandler] match 
MessageContextSaveATest::compareHandlers:  id [10] match
MessageContextSaveATest::compareHandlers:  class [org.apache.axis2.engine.MessageContextSaveATest$TempHandler] match 
MessageContextSaveATest::compareHandlers:  id [11] match
MessageContextSaveATest::compareHandlers:  class [org.apache.axis2.engine.MessageContextSaveATest$TempHandler] match 
MessageContextSaveATest::compareHandlers:  id [12] match
MessageContextSaveATest::compareHandlers:  class [org.apache.axis2.engine.MessageContextSaveATest$TempHandler] match 
MessageContextSaveATest::compareHandlers:  id [13] match
MessageContextSaveATest::compareHandlers:  class [org.apache.axis2.engine.MessageContextSaveATest$TempHandler] match 
MessageContextSaveATest::compareHandlers:  id [14] match
MessageContextSaveATest::compareHandlers:  class [org.apache.axis2.engine.MessageContextSaveATest$TempHandler] match 
MessageContextSaveATest::compareHandlers:  id [15] match
MessageContextSaveATest::compareHandlers:  class [org.apache.axis2.engine.MessageContextSaveATest$TempHandler] match 
MessageContextSaveATest::compareHandlers:  id [16] match
MessageContextSaveATest::compareHandlers:  class [org.apache.axis2.engine.MessageContextSaveATest$TempHandler] match 
MessageContextSaveATest::compareHandlers:  id [17] match
MessageContextSaveATest::compareHandlers:  class [org.apache.axis2.engine.MessageContextSaveATest$TempHandler] match 
MessageContextSaveATest::compareHandlers:  id [18] match
MessageContextSaveATest: comparePhases:  Phase1[middlePhase2] == Phase2[middlePhase2] - matched handler lists
TempHandler[15]:invoke(): executed phase list:  compare phases [true]
MessageContextSaveATest::compareHandlers:  class [org.apache.axis2.engine.MessageContextSaveATest$TempHandler] match 
MessageContextSaveATest::compareHandlers:  id [1] match
MessageContextSaveATest::compareHandlers:  class [org.apache.axis2.engine.MessageContextSaveATest$TempHandler] match 
MessageContextSaveATest::compareHandlers:  id [2] match
MessageContextSaveATest::compareHandlers:  class [org.apache.axis2.engine.MessageContextSaveATest$TempHandler] match 
MessageContextSaveATest::compareHandlers:  id [3] match
MessageContextSaveATest::compareHandlers:  class [org.apache.axis2.engine.MessageContextSaveATest$TempHandler] match 
MessageContextSaveATest::compareHandlers:  id [4] match
MessageContextSaveATest::compareHandlers:  class [org.apache.axis2.engine.MessageContextSaveATest$TempHandler] match 
MessageContextSaveATest::compareHandlers:  id [5] match
MessageContextSaveATest::compareHandlers:  class [org.apache.axis2.engine.MessageContextSaveATest$TempHandler] match 
MessageContextSaveATest::compareHandlers:  id [6] match
MessageContextSaveATest::compareHandlers:  class [org.apache.axis2.engine.MessageContextSaveATest$TempHandler] match 
MessageContextSaveATest::compareHandlers:  id [7] match
MessageContextSaveATest::compareHandlers:  class [org.apache.axis2.engine.MessageContextSaveATest$TempHandler] match 
MessageContextSaveATest::compareHandlers:  id [8] match
MessageContextSaveATest::compareHandlers:  class [org.apache.axis2.engine.MessageContextSaveATest$TempHandler] match 
MessageContextSaveATest::compareHandlers:  id [9] match
MessageContextSaveATest: comparePhases:  Phase1[beginPhase1] == Phase2[beginPhase1] - matched handler lists
TempHandler[15]:invoke(): executed phase list:  compare phases [true]
MessageContextSaveATest:testReceive(): resume - - engine.resume(mc) - - - - - - - - - - - - - - - -
TempHandler[15]:invoke(): pause = [false]
TempHandler[15]:invoke(): executedHandlers.add(15)
TempHandler[16]:invoke(): pause = [false]
TempHandler[16]:invoke(): executedHandlers.add(16)
TempHandler[17]:invoke(): pause = [false]
TempHandler[17]:invoke(): executedHandlers.add(17)
TempHandler[18]:invoke(): pause = [false]
TempHandler[18]:invoke(): executedHandlers.add(18)
TempHandler[19]:invoke(): pause = [false]
TempHandler[19]:invoke(): executedHandlers.add(19)
TempHandler[20]:invoke(): pause = [false]
TempHandler[20]:invoke(): executedHandlers.add(20)
TempHandler[21]:invoke(): pause = [false]
TempHandler[21]:invoke(): executedHandlers.add(21)
TempHandler[22]:invoke(): pause = [false]
TempHandler[22]:invoke(): executedHandlers.add(22)
TempHandler[23]:invoke(): pause = [false]
TempHandler[23]:invoke(): executedHandlers.add(23)
TempHandler[24]:invoke(): pause = [false]
TempHandler[24]:invoke(): executedHandlers.add(24)
TempHandler[25]:invoke(): pause = [false]
TempHandler[25]:invoke(): executedHandlers.add(25)
TempHandler[26]:invoke(): pause = [false]
TempHandler[26]:invoke(): executedHandlers.add(26)
TempHandler[27]:invoke(): pause = [false]
TempHandler[27]:invoke(): executedHandlers.add(27)
TempHandler[28]:invoke(): pause = [false]
TempHandler[28]:invoke(): executedHandlers.add(28)
TempHandler[29]:invoke(): pause = [false]
TempHandler[29]:invoke(): executedHandlers.add(29)
TempHandler[30]:invoke(): pause = [false]
TempHandler[30]:invoke(): executedHandlers.add(30)
TempHandler[31]:invoke(): pause = [true]
TempHandler[31]:invoke(): msgContext.pause()
TempHandler[31]:invoke(): temp file = [mcSave24507.tmp]
TempHandler[31]:invoke(): saving message context.....
TempHandler[31]:invoke(): ....saved message context.....
TempHandler[31]:invoke(): file size after save [26603]   temp file = [mcSave24507.tmp]
TempHandler[31]:invoke(): restoring a message context.....
TempHandler[31]:invoke(): ....restored message context.....
TempHandler[31]:invoke(): execution chain equivalency [true]
MessageContextSaveATest::compareHandlers:  class [org.apache.axis2.engine.MessageContextSaveATest$TempHandler] match 
MessageContextSaveATest::compareHandlers:  id [31] match
MessageContextSaveATest::compareHandlers:  class [org.apache.axis2.engine.MessageContextSaveATest$TempHandler] match 
MessageContextSaveATest::compareHandlers:  id [32] match
MessageContextSaveATest: comparePhases:  Phase1[extraPhase3] == Phase2[extraPhase3] - matched handler lists
TempHandler[31]:invoke(): executed phase list:  compare phases [true]
MessageContextSaveATest::compareHandlers:  class [org.apache.axis2.engine.MessageContextSaveATest$TempHandler] match 
MessageContextSaveATest::compareHandlers:  id [30] match
MessageContextSaveATest: comparePhases:  Phase1[extraPhase2] == Phase2[extraPhase2] - matched handler lists
TempHandler[31]:invoke(): executed phase list:  compare phases [true]
MessageContextSaveATest::compareHandlers:  class [org.apache.axis2.engine.MessageContextSaveATest$TempHandler] match 
MessageContextSaveATest::compareHandlers:  id [28] match
MessageContextSaveATest::compareHandlers:  class [org.apache.axis2.engine.MessageContextSaveATest$TempHandler] match 
MessageContextSaveATest::compareHandlers:  id [29] match
MessageContextSaveATest: comparePhases:  Phase1[extraPhase1] == Phase2[extraPhase1] - matched handler lists
TempHandler[31]:invoke(): executed phase list:  compare phases [true]
MessageContextSaveATest::compareHandlers:  class [org.apache.axis2.engine.MessageContextSaveATest$TempHandler] match 
MessageContextSaveATest::compareHandlers:  id [19] match
MessageContextSaveATest::compareHandlers:  class [org.apache.axis2.engine.MessageContextSaveATest$TempHandler] match 
MessageContextSaveATest::compareHandlers:  id [20] match
MessageContextSaveATest::compareHandlers:  class [org.apache.axis2.engine.MessageContextSaveATest$TempHandler] match 
MessageContextSaveATest::compareHandlers:  id [21] match
MessageContextSaveATest::compareHandlers:  class [org.apache.axis2.engine.MessageContextSaveATest$TempHandler] match 
MessageContextSaveATest::compareHandlers:  id [22] match
MessageContextSaveATest::compareHandlers:  class [org.apache.axis2.engine.MessageContextSaveATest$TempHandler] match 
MessageContextSaveATest::compareHandlers:  id [23] match
MessageContextSaveATest::compareHandlers:  class [org.apache.axis2.engine.MessageContextSaveATest$TempHandler] match 
MessageContextSaveATest::compareHandlers:  id [24] match
MessageContextSaveATest::compareHandlers:  class [org.apache.axis2.engine.MessageContextSaveATest$TempHandler] match 
MessageContextSaveATest::compareHandlers:  id [25] match
MessageContextSaveATest::compareHandlers:  class [org.apache.axis2.engine.MessageContextSaveATest$TempHandler] match 
MessageContextSaveATest::compareHandlers:  id [26] match
MessageContextSaveATest::compareHandlers:  class [org.apache.axis2.engine.MessageContextSaveATest$TempHandler] match 
MessageContextSaveATest::compareHandlers:  id [27] match
MessageContextSaveATest: comparePhases:  Phase1[lastPhase3] == Phase2[lastPhase3] - matched handler lists
TempHandler[31]:invoke(): executed phase list:  compare phases [true]
MessageContextSaveATest::compareHandlers:  class [org.apache.axis2.engine.MessageContextSaveATest$TempHandler] match 
MessageContextSaveATest::compareHandlers:  id [10] match
MessageContextSaveATest::compareHandlers:  class [org.apache.axis2.engine.MessageContextSaveATest$TempHandler] match 
MessageContextSaveATest::compareHandlers:  id [11] match
MessageContextSaveATest::compareHandlers:  class [org.apache.axis2.engine.MessageContextSaveATest$TempHandler] match 
MessageContextSaveATest::compareHandlers:  id [12] match
MessageContextSaveATest::compareHandlers:  class [org.apache.axis2.engine.MessageContextSaveATest$TempHandler] match 
MessageContextSaveATest::compareHandlers:  id [13] match
MessageContextSaveATest::compareHandlers:  class [org.apache.axis2.engine.MessageContextSaveATest$TempHandler] match 
MessageContextSaveATest::compareHandlers:  id [14] match
MessageContextSaveATest::compareHandlers:  class [org.apache.axis2.engine.MessageContextSaveATest$TempHandler] match 
MessageContextSaveATest::compareHandlers:  id [15] match
MessageContextSaveATest::compareHandlers:  class [org.apache.axis2.engine.MessageContextSaveATest$TempHandler] match 
MessageContextSaveATest::compareHandlers:  id [16] match
MessageContextSaveATest::compareHandlers:  class [org.apache.axis2.engine.MessageContextSaveATest$TempHandler] match 
MessageContextSaveATest::compareHandlers:  id [17] match
MessageContextSaveATest::compareHandlers:  class [org.apache.axis2.engine.MessageContextSaveATest$TempHandler] match 
MessageContextSaveATest::compareHandlers:  id [18] match
MessageContextSaveATest: comparePhases:  Phase1[middlePhase2] == Phase2[middlePhase2] - matched handler lists
TempHandler[31]:invoke(): executed phase list:  compare phases [true]
MessageContextSaveATest::compareHandlers:  class [org.apache.axis2.engine.MessageContextSaveATest$TempHandler] match 
MessageContextSaveATest::compareHandlers:  id [1] match
MessageContextSaveATest::compareHandlers:  class [org.apache.axis2.engine.MessageContextSaveATest$TempHandler] match 
MessageContextSaveATest::compareHandlers:  id [2] match
MessageContextSaveATest::compareHandlers:  class [org.apache.axis2.engine.MessageContextSaveATest$TempHandler] match 
MessageContextSaveATest::compareHandlers:  id [3] match
MessageContextSaveATest::compareHandlers:  class [org.apache.axis2.engine.MessageContextSaveATest$TempHandler] match 
MessageContextSaveATest::compareHandlers:  id [4] match
MessageContextSaveATest::compareHandlers:  class [org.apache.axis2.engine.MessageContextSaveATest$TempHandler] match 
MessageContextSaveATest::compareHandlers:  id [5] match
MessageContextSaveATest::compareHandlers:  class [org.apache.axis2.engine.MessageContextSaveATest$TempHandler] match 
MessageContextSaveATest::compareHandlers:  id [6] match
MessageContextSaveATest::compareHandlers:  class [org.apache.axis2.engine.MessageContextSaveATest$TempHandler] match 
MessageContextSaveATest::compareHandlers:  id [7] match
MessageContextSaveATest::compareHandlers:  class [org.apache.axis2.engine.MessageContextSaveATest$TempHandler] match 
MessageContextSaveATest::compareHandlers:  id [8] match
MessageContextSaveATest::compareHandlers:  class [org.apache.axis2.engine.MessageContextSaveATest$TempHandler] match 
MessageContextSaveATest::compareHandlers:  id [9] match
MessageContextSaveATest: comparePhases:  Phase1[beginPhase1] == Phase2[beginPhase1] - matched handler lists
TempHandler[31]:invoke(): executed phase list:  compare phases [true]
MessageContextSaveATest::compareHandlers:  class [org.apache.axis2.engine.MessageContextSaveATest$TempHandler] match 
MessageContextSaveATest::compareHandlers:  id [1] match
MessageContextSaveATest::compareHandlers:  class [org.apache.axis2.engine.MessageContextSaveATest$TempHandler] match 
MessageContextSaveATest::compareHandlers:  id [2] match
MessageContextSaveATest::compareHandlers:  class [org.apache.axis2.engine.MessageContextSaveATest$TempHandler] match 
MessageContextSaveATest::compareHandlers:  id [3] match
MessageContextSaveATest::compareHandlers:  class [org.apache.axis2.engine.MessageContextSaveATest$TempHandler] match 
MessageContextSaveATest::compareHandlers:  id [4] match
MessageContextSaveATest::compareHandlers:  class [org.apache.axis2.engine.MessageContextSaveATest$TempHandler] match 
MessageContextSaveATest::compareHandlers:  id [5] match
MessageContextSaveATest::compareHandlers:  class [org.apache.axis2.engine.MessageContextSaveATest$TempHandler] match 
MessageContextSaveATest::compareHandlers:  id [6] match
MessageContextSaveATest::compareHandlers:  class [org.apache.axis2.engine.MessageContextSaveATest$TempHandler] match 
MessageContextSaveATest::compareHandlers:  id [7] match
MessageContextSaveATest::compareHandlers:  class [org.apache.axis2.engine.MessageContextSaveATest$TempHandler] match 
MessageContextSaveATest::compareHandlers:  id [8] match
MessageContextSaveATest::compareHandlers:  class [org.apache.axis2.engine.MessageContextSaveATest$TempHandler] match 
MessageContextSaveATest::compareHandlers:  id [9] match
MessageContextSaveATest: comparePhases:  Phase1[beginPhase1] == Phase2[beginPhase1] - matched handler lists
MessageContextSaveATest::compareHandlers:  class [org.apache.axis2.engine.MessageContextSaveATest$TempHandler] match 
MessageContextSaveATest::compareHandlers:  id [10] match
MessageContextSaveATest::compareHandlers:  class [org.apache.axis2.engine.MessageContextSaveATest$TempHandler] match 
MessageContextSaveATest::compareHandlers:  id [11] match
MessageContextSaveATest::compareHandlers:  class [org.apache.axis2.engine.MessageContextSaveATest$TempHandler] match 
MessageContextSaveATest::compareHandlers:  id [12] match
MessageContextSaveATest::compareHandlers:  class [org.apache.axis2.engine.MessageContextSaveATest$TempHandler] match 
MessageContextSaveATest::compareHandlers:  id [13] match
MessageContextSaveATest::compareHandlers:  class [org.apache.axis2.engine.MessageContextSaveATest$TempHandler] match 
MessageContextSaveATest::compareHandlers:  id [14] match
MessageContextSaveATest::compareHandlers:  class [org.apache.axis2.engine.MessageContextSaveATest$TempHandler] match 
MessageContextSaveATest::compareHandlers:  id [15] match
MessageContextSaveATest::compareHandlers:  class [org.apache.axis2.engine.MessageContextSaveATest$TempHandler] match 
MessageContextSaveATest::compareHandlers:  id [16] match
MessageContextSaveATest::compareHandlers:  class [org.apache.axis2.engine.MessageContextSaveATest$TempHandler] match 
MessageContextSaveATest::compareHandlers:  id [17] match
MessageContextSaveATest::compareHandlers:  class [org.apache.axis2.engine.MessageContextSaveATest$TempHandler] match 
MessageContextSaveATest::compareHandlers:  id [18] match
MessageContextSaveATest: comparePhases:  Phase1[middlePhase2] == Phase2[middlePhase2] - matched handler lists
MessageContextSaveATest::compareHandlers:  class [org.apache.axis2.engine.MessageContextSaveATest$TempHandler] match 
MessageContextSaveATest::compareHandlers:  id [19] match
MessageContextSaveATest::compareHandlers:  class [org.apache.axis2.engine.MessageContextSaveATest$TempHandler] match 
MessageContextSaveATest::compareHandlers:  id [20] match
MessageContextSaveATest::compareHandlers:  class [org.apache.axis2.engine.MessageContextSaveATest$TempHandler] match 
MessageContextSaveATest::compareHandlers:  id [21] match
MessageContextSaveATest::compareHandlers:  class [org.apache.axis2.engine.MessageContextSaveATest$TempHandler] match 
MessageContextSaveATest::compareHandlers:  id [22] match
MessageContextSaveATest::compareHandlers:  class [org.apache.axis2.engine.MessageContextSaveATest$TempHandler] match 
MessageContextSaveATest::compareHandlers:  id [23] match
MessageContextSaveATest::compareHandlers:  class [org.apache.axis2.engine.MessageContextSaveATest$TempHandler] match 
MessageContextSaveATest::compareHandlers:  id [24] match
MessageContextSaveATest::compareHandlers:  class [org.apache.axis2.engine.MessageContextSaveATest$TempHandler] match 
MessageContextSaveATest::compareHandlers:  id [25] match
MessageContextSaveATest::compareHandlers:  class [org.apache.axis2.engine.MessageContextSaveATest$TempHandler] match 
MessageContextSaveATest::compareHandlers:  id [26] match
MessageContextSaveATest::compareHandlers:  class [org.apache.axis2.engine.MessageContextSaveATest$TempHandler] match 
MessageContextSaveATest::compareHandlers:  id [27] match
MessageContextSaveATest: comparePhases:  Phase1[lastPhase3] == Phase2[lastPhase3] - matched handler lists
MessageContextSaveATest::compareHandlers:  class [org.apache.axis2.engine.MessageContextSaveATest$TempHandler] match 
MessageContextSaveATest::compareHandlers:  id [28] match
MessageContextSaveATest::compareHandlers:  class [org.apache.axis2.engine.MessageContextSaveATest$TempHandler] match 
MessageContextSaveATest::compareHandlers:  id [29] match
MessageContextSaveATest: comparePhases:  Phase1[extraPhase1] == Phase2[extraPhase1] - matched handler lists
MessageContextSaveATest::compareHandlers:  class [org.apache.axis2.engine.MessageContextSaveATest$TempHandler] match 
MessageContextSaveATest::compareHandlers:  id [30] match
MessageContextSaveATest: comparePhases:  Phase1[extraPhase2] == Phase2[extraPhase2] - matched handler lists
MessageContextSaveATest::compareHandlers:  class [org.apache.axis2.engine.MessageContextSaveATest$TempHandler] match 
MessageContextSaveATest::compareHandlers:  id [31] match
MessageContextSaveATest::compareHandlers:  class [org.apache.axis2.engine.MessageContextSaveATest$TempHandler] match 
MessageContextSaveATest::compareHandlers:  id [32] match
MessageContextSaveATest: comparePhases:  Phase1[extraPhase3] == Phase2[extraPhase3] - matched handler lists
MessageContextSaveATest::compareHandlers:  class [org.apache.axis2.engine.MessageContextSaveATest$TempHandler] match 
MessageContextSaveATest::compareHandlers:  id [33] match
MessageContextSaveATest::compareHandlers:  class [org.apache.axis2.engine.MessageContextSaveATest$TempHandler] match 
MessageContextSaveATest::compareHandlers:  id [34] match
MessageContextSaveATest::compareHandlers:  class [org.apache.axis2.engine.MessageContextSaveATest$TempHandler] match 
MessageContextSaveATest::compareHandlers:  id [35] match
MessageContextSaveATest: comparePhases:  Phase1[extraPhase4] == Phase2[extraPhase4] - matched handler lists
MessageContextSaveATest:testReceive(): resume - - engine.resume(mc) - - - - - - - - - - - - - - - -
TempHandler[31]:invoke(): pause = [false]
TempHandler[31]:invoke(): executedHandlers.add(31)
TempHandler[32]:invoke(): pause = [false]
TempHandler[32]:invoke(): executedHandlers.add(32)
TempHandler[33]:invoke(): pause = [false]
TempHandler[33]:invoke(): executedHandlers.add(33)
TempHandler[34]:invoke(): pause = [false]
TempHandler[34]:invoke(): executedHandlers.add(34)
TempHandler[35]:invoke(): pause = [false]
TempHandler[35]:invoke(): executedHandlers.add(35)
MessageContextSaveATest::compareHandlers:  class [org.apache.axis2.engine.MessageContextSaveATest$TempHandler] match 
MessageContextSaveATest::compareHandlers:  id [1] match
MessageContextSaveATest::compareHandlers:  class [org.apache.axis2.engine.MessageContextSaveATest$TempHandler] match 
MessageContextSaveATest::compareHandlers:  id [2] match
MessageContextSaveATest::compareHandlers:  class [org.apache.axis2.engine.MessageContextSaveATest$TempHandler] match 
MessageContextSaveATest::compareHandlers:  id [3] match
MessageContextSaveATest::compareHandlers:  class [org.apache.axis2.engine.MessageContextSaveATest$TempHandler] match 
MessageContextSaveATest::compareHandlers:  id [4] match
MessageContextSaveATest::compareHandlers:  class [org.apache.axis2.engine.MessageContextSaveATest$TempHandler] match 
MessageContextSaveATest::compareHandlers:  id [5] match
MessageContextSaveATest::compareHandlers:  class [org.apache.axis2.engine.MessageContextSaveATest$TempHandler] match 
MessageContextSaveATest::compareHandlers:  id [6] match
MessageContextSaveATest::compareHandlers:  class [org.apache.axis2.engine.MessageContextSaveATest$TempHandler] match 
MessageContextSaveATest::compareHandlers:  id [7] match
MessageContextSaveATest::compareHandlers:  class [org.apache.axis2.engine.MessageContextSaveATest$TempHandler] match 
MessageContextSaveATest::compareHandlers:  id [8] match
MessageContextSaveATest::compareHandlers:  class [org.apache.axis2.engine.MessageContextSaveATest$TempHandler] match 
MessageContextSaveATest::compareHandlers:  id [9] match
MessageContextSaveATest: comparePhases:  Phase1[beginPhase1] == Phase2[beginPhase1] - matched handler lists
MessageContextSaveATest::compareHandlers:  class [org.apache.axis2.engine.MessageContextSaveATest$TempHandler] match 
MessageContextSaveATest::compareHandlers:  id [10] match
MessageContextSaveATest::compareHandlers:  class [org.apache.axis2.engine.MessageContextSaveATest$TempHandler] match 
MessageContextSaveATest::compareHandlers:  id [11] match
MessageContextSaveATest::compareHandlers:  class [org.apache.axis2.engine.MessageContextSaveATest$TempHandler] match 
MessageContextSaveATest::compareHandlers:  id [12] match
MessageContextSaveATest::compareHandlers:  class [org.apache.axis2.engine.MessageContextSaveATest$TempHandler] match 
MessageContextSaveATest::compareHandlers:  id [13] match
MessageContextSaveATest::compareHandlers:  class [org.apache.axis2.engine.MessageContextSaveATest$TempHandler] match 
MessageContextSaveATest::compareHandlers:  id [14] match
MessageContextSaveATest::compareHandlers:  class [org.apache.axis2.engine.MessageContextSaveATest$TempHandler] match 
MessageContextSaveATest::compareHandlers:  id [15] match
MessageContextSaveATest::compareHandlers:  class [org.apache.axis2.engine.MessageContextSaveATest$TempHandler] match 
MessageContextSaveATest::compareHandlers:  id [16] match
MessageContextSaveATest::compareHandlers:  class [org.apache.axis2.engine.MessageContextSaveATest$TempHandler] match 
MessageContextSaveATest::compareHandlers:  id [17] match
MessageContextSaveATest::compareHandlers:  class [org.apache.axis2.engine.MessageContextSaveATest$TempHandler] match 
MessageContextSaveATest::compareHandlers:  id [18] match
MessageContextSaveATest: comparePhases:  Phase1[middlePhase2] == Phase2[middlePhase2] - matched handler lists
MessageContextSaveATest::compareHandlers:  class [org.apache.axis2.engine.MessageContextSaveATest$TempHandler] match 
MessageContextSaveATest::compareHandlers:  id [19] match
MessageContextSaveATest::compareHandlers:  class [org.apache.axis2.engine.MessageContextSaveATest$TempHandler] match 
MessageContextSaveATest::compareHandlers:  id [20] match
MessageContextSaveATest::compareHandlers:  class [org.apache.axis2.engine.MessageContextSaveATest$TempHandler] match 
MessageContextSaveATest::compareHandlers:  id [21] match
MessageContextSaveATest::compareHandlers:  class [org.apache.axis2.engine.MessageContextSaveATest$TempHandler] match 
MessageContextSaveATest::compareHandlers:  id [22] match
MessageContextSaveATest::compareHandlers:  class [org.apache.axis2.engine.MessageContextSaveATest$TempHandler] match 
MessageContextSaveATest::compareHandlers:  id [23] match
MessageContextSaveATest::compareHandlers:  class [org.apache.axis2.engine.MessageContextSaveATest$TempHandler] match 
MessageContextSaveATest::compareHandlers:  id [24] match
MessageContextSaveATest::compareHandlers:  class [org.apache.axis2.engine.MessageContextSaveATest$TempHandler] match 
MessageContextSaveATest::compareHandlers:  id [25] match
MessageContextSaveATest::compareHandlers:  class [org.apache.axis2.engine.MessageContextSaveATest$TempHandler] match 
MessageContextSaveATest::compareHandlers:  id [26] match
MessageContextSaveATest::compareHandlers:  class [org.apache.axis2.engine.MessageContextSaveATest$TempHandler] match 
MessageContextSaveATest::compareHandlers:  id [27] match
MessageContextSaveATest: comparePhases:  Phase1[lastPhase3] == Phase2[lastPhase3] - matched handler lists
MessageContextSaveATest::compareHandlers:  class [org.apache.axis2.engine.MessageContextSaveATest$TempHandler] match 
MessageContextSaveATest::compareHandlers:  id [28] match
MessageContextSaveATest::compareHandlers:  class [org.apache.axis2.engine.MessageContextSaveATest$TempHandler] match 
MessageContextSaveATest::compareHandlers:  id [29] match
MessageContextSaveATest: comparePhases:  Phase1[extraPhase1] == Phase2[extraPhase1] - matched handler lists
MessageContextSaveATest::compareHandlers:  class [org.apache.axis2.engine.MessageContextSaveATest$TempHandler] match 
MessageContextSaveATest::compareHandlers:  id [30] match
MessageContextSaveATest: comparePhases:  Phase1[extraPhase2] == Phase2[extraPhase2] - matched handler lists
MessageContextSaveATest::compareHandlers:  class [org.apache.axis2.engine.MessageContextSaveATest$TempHandler] match 
MessageContextSaveATest::compareHandlers:  id [31] match
MessageContextSaveATest::compareHandlers:  class [org.apache.axis2.engine.MessageContextSaveATest$TempHandler] match 
MessageContextSaveATest::compareHandlers:  id [32] match
MessageContextSaveATest: comparePhases:  Phase1[extraPhase3] == Phase2[extraPhase3] - matched handler lists
MessageContextSaveATest::compareHandlers:  class [org.apache.axis2.engine.MessageContextSaveATest$TempHandler] match 
MessageContextSaveATest::compareHandlers:  id [33] match
MessageContextSaveATest::compareHandlers:  class [org.apache.axis2.engine.MessageContextSaveATest$TempHandler] match 
MessageContextSaveATest::compareHandlers:  id [34] match
MessageContextSaveATest::compareHandlers:  class [org.apache.axis2.engine.MessageContextSaveATest$TempHandler] match 
MessageContextSaveATest::compareHandlers:  id [35] match
MessageContextSaveATest: comparePhases:  Phase1[extraPhase4] == Phase2[extraPhase4] - matched handler lists
MessageContextSaveATest:testSimpleMC(): start - - - - - - - - - - - - - - - -
MessageContextSaveATest:testSimpleMC(): temp file = [Simple24508.tmp]
MessageContextSaveATest:testSimpleMC(): saving message context.....
MessageContextSaveATest:testSimpleMC(): ....saved message context.....
MessageContextSaveATest:testSimpleMC(): file size after save [3298]   temp file = [Simple24508.tmp]
MessageContextSaveATest:testSimpleMC(): restoring a message context.....
MessageContextSaveATest:testSimpleMC(): ....restored message context.....
MessageContextSaveATest:testSimpleMC(): execution chain equivalency [true]
MessageContextSaveATest:testSimpleMC(): end - - - - - - - - - - - - - - - -
MessageContextSaveATest:testMcProperties(): start - - - - - - - - - - - - - - - -
MessageContextSaveATest:testMcProperties(): temp file = [McProps24509.tmp]
MessageContextSaveATest:testMcProperties(): saving message context.....
MessageContextSaveATest:testMcProperties(): ....saved message context.....
MessageContextSaveATest:testMcProperties(): file size after save [3547]   temp file = [McProps24509.tmp]
MessageContextSaveATest:testMcProperties(): restoring a message context.....
MessageContextSaveATest:testMcProperties(): ....restored message context.....
MessageContextSaveATest:testMcProperties(): execution chain equivalency [true]
MessageContextSaveATest:testMcProperties(): end - - - - - - - - - - - - - - - -
MessageContextSaveATest:testMapping(): start - - - - - - - - - - - - - - - -
MessageContextSaveATest:testMapping(): - - - - - original message contexts table- - - - - - - - - - -
MessageContextSaveATest: showMcMap:  Message context   ID[urn:uuid:0A8D3BDD1E6E2697DE1174189668976]   Key Label [In]
MessageContextSaveATest:testMapping(): temp file = [McMappings24510.tmp]
MessageContextSaveATest:testMapping(): saving message context.....
MessageContextSaveATest:testMapping(): ....saved message context.....
MessageContextSaveATest:testMapping(): file size after save [8506]   temp file = [McMappings24510.tmp]
MessageContextSaveATest:testMapping(): restoring a message context.....
MessageContextSaveATest:testMapping(): ....restored message context.....
MessageContextSaveATest:testMapping(): - - - - - restored message contexts table- - - - - - - - - - -
MessageContextSaveATest: showMcMap:  Message context   ID[urn:uuid:0A8D3BDD1E6E2697DE1174189668976]   Key Label [In]
MessageContextSaveATest:testMapping(): end - - - - - - - - - - - - - - - -
[surefire] Tests run: 4, Failures: 0, Errors: 0, Time elapsed: 0.205 sec
[surefire] Running org.apache.axis2.engine.OperationContextSaveTest
OperationContextSaveTest:testSaveAndRestore():  BEGIN ---------------
OperationContextSaveTest:testSaveAndRestore(): temp file = [OpCtxSave24511.tmp]
OperationContextSaveTest:testSaveAndRestore(): saving .....
OperationContextSaveTest:testSaveAndRestore(): ....save operation completed.....
OperationContextSaveTest:testSaveAndRestore(): file size after save [6965]   temp file = [OpCtxSave24511.tmp]
OperationContextSaveTest:testSaveAndRestore(): restoring .....
OperationContextSaveTest:testSaveAndRestore(): ....restored operation completed.....
OperationContextSaveTest:testSaveAndRestore():  OperationContext equivalency [true]
OperationContextSaveTest:testSaveAndRestore():  ServiceContext equivalency [true]
OperationContextSaveTest:testSaveAndRestore():  ServiceGroupContext equivalency [true]
OperationContextSaveTest:testSaveAndRestore():  END ---------------
[surefire] Tests run: 1, Failures: 0, Errors: 0, Time elapsed: 0.039 sec
[surefire] Running org.apache.axis2.engine.ModuleConfigTest
[surefire] Tests run: 2, Failures: 0, Errors: 0, Time elapsed: 0.045 sec
[surefire] Running org.apache.axis2.engine.ObjectSaveTest
ObjectSaveTest:testObjectSerializable():  BEGIN ---------------
ObjectSaveTest:testObjectSerializable(): temp file = [objectTest24512.tmp]
ObjectSaveTest:testObjectSerializable(): saving .....
ObjectSaveTest:testObjectSerializable(): ....save operation completed.....
ObjectSaveTest:testObjectSerializable(): file size after save [265]   temp file = [objectTest24512.tmp]
ObjectSaveTest:testObjectSerializable(): restoring .....
ObjectSaveTest:testObjectSerializable(): ....restored operation completed.....
ObjectSaveTest:testObjectSerializable():  END ---------------
ObjectSaveTest:testObjectNotSerializable():  BEGIN ---------------
ObjectSaveTest:testObjectNotSerializable(): temp file = [objectTest24513.tmp]
ObjectSaveTest:testObjectNotSerializable(): saving .....
ObjectSaveTest:testObjectSerializable(): restoring .....
ObjectSaveTest:testObjectNotSerializable(): ....restored operation completed.....
ObjectSaveTest:testObjectNotSerializable():  END ---------------
ObjectSaveTest:testArrayList():  BEGIN ---------------
ObjectSaveTest:testArrayList(): temp file = [arraylistTest24514.tmp]
ObjectSaveTest:testArrayList(): saving .....
ObjectSaveTest:testArrayList(): ....save operation completed.....
ObjectSaveTest:testArrayList(): file size after save [199]   temp file = [arraylistTest24514.tmp]
ObjectSaveTest:testArrayList(): restoring .....
ObjectSaveTest:testArrayList(): ....restored operation completed.....
ObjectSaveTest:testArrayList():  END ---------------
ObjectSaveTest:testHashMap():  BEGIN ---------------
ObjectSaveTest:testHashMap(): temp file = [hashmapTest24515.tmp]
ObjectSaveTest:testHashMap(): saving .....
ObjectSaveTest:testHashMap(): ....save operation completed.....
ObjectSaveTest:testHashMap(): file size after save [253]   temp file = [hashmapTest24515.tmp]
ObjectSaveTest:testHashMap(): restoring .....
ObjectSaveTest:testHashMap(): ....restored operation completed.....
ObjectSaveTest:testHashMap():  END ---------------
ObjectSaveTest:testLinkedList():  BEGIN ---------------
ObjectSaveTest:testLinkedList(): temp file = [linkedlistTest24516.tmp]
ObjectSaveTest:testLinkedList(): saving .....
ObjectSaveTest:testLinkedList(): ....save operation completed.....
ObjectSaveTest:testLinkedList(): file size after save [200]   temp file = [linkedlistTest24516.tmp]
ObjectSaveTest:testLinkedList(): restoring .....
ObjectSaveTest:testLinkedList(): ....restored operation completed.....
ObjectSaveTest:testLinkedList():  END ---------------
[surefire] Tests run: 5, Failures: 0, Errors: 0, Time elapsed: 0.026 sec
[surefire] Running org.apache.axis2.engine.MessageContextChangeTest
[surefire] Tests run: 1, Failures: 0, Errors: 0, Time elapsed: 0.004 sec
[surefire] Running org.apache.axis2.engine.MessageContextSaveBTest
original properties ======================================
original properties: key-value pair [serviceKey2][serviceValue2_before]
original properties: key-value pair [serviceKey3][serviceValue3_before]
original properties: key-value pair [serviceKey1][serviceValue1_before]
original properties ======================================
MessageContextSaveBTest: testServiceProperties(): start - - engine.receive(mc) - - - - - - - - - - - - - - - -
TempHandler[1]:invoke(): executedHandlers.add(1)
HandlerMCS[2]:invoke(): pause = [true]
HandlerMCS[2]:invoke(): msgContext.pause()
HandlerMCS[2]:invoke(): temp file = [mcSave24517.tmp]
HandlerMCS[2]:invoke(): saving message context.....
HandlerMCS[2]:invoke(): ....saved message context.....
HandlerMCS[2]:invoke(): file size after save [11197]   temp file = [mcSave24517.tmp]
HandlerMCS[2]:invoke(): restoring a message context.....
HandlerMCS[2]:invoke(): ....restored message context.....
restored properties ======================================
restored properties: key-value pair [serviceKey2][serviceValue2_before]
restored properties: key-value pair [Property.ID[1].2][ServiceLevelSetting[2]]
restored properties: key-value pair [serviceKey3][serviceValue3_before]
restored properties: key-value pair [serviceKey1][serviceValue1_before]
restored properties: key-value pair [Property.ID[1].1][ServiceLevelSetting[1]]
restored properties ======================================
MessageContextSaveBTest: testServiceProperties(): resume - - engine.resume(mc) - - - - - - - - - - - - - - - -
HandlerMCS[2]:invoke(): pause = [false]
HandlerMCS[2]:invoke(): executedHandlers.add(2)
TempHandler[3]:invoke(): executedHandlers.add(3)
restored service properties post-resume ======================================
restored service properties post-resume: key-value pair [serviceKey2][serviceValue2_postReceive]
restored service properties post-resume: key-value pair [Property.ID[1].2][ServiceLevelSetting[2]]
restored service properties post-resume: key-value pair [Property.ID[3].2][ServiceLevelSetting[2]]
restored service properties post-resume: key-value pair [serviceKey3][serviceValue3_postReceive]
restored service properties post-resume: key-value pair [Property.ID[3].1][ServiceLevelSetting[1]]
restored service properties post-resume: key-value pair [serviceKey1][serviceValue1_postReceive]
restored service properties post-resume: key-value pair [Property.ID[1].1][ServiceLevelSetting[1]]
restored service properties post-resume ======================================
service properties from other active MsgCtx ======================================
service properties from other active MsgCtx: key-value pair [serviceKey2][serviceValue2_postReceive]
service properties from other active MsgCtx: key-value pair [Property.ID[1].2][ServiceLevelSetting[2]]
service properties from other active MsgCtx: key-value pair [Property.ID[3].2][ServiceLevelSetting[2]]
service properties from other active MsgCtx: key-value pair [Property.ID[3].1][ServiceLevelSetting[1]]
service properties from other active MsgCtx: key-value pair [serviceKey3][serviceValue3_postReceive]
service properties from other active MsgCtx: key-value pair [Property.ID[1].1][ServiceLevelSetting[1]]
service properties from other active MsgCtx: key-value pair [serviceKey1][serviceValue1_postReceive]
service properties from other active MsgCtx ======================================
[surefire] Tests run: 1, Failures: 0, Errors: 0, Time elapsed: 0.041 sec
[surefire] Running org.apache.axis2.dispatchers.RequestURIBasedServiceDispatcherTest
[surefire] Tests run: 1, Failures: 0, Errors: 0, Time elapsed: 0.004 sec
[surefire] Running org.apache.axis2.dispatchers.SOAPMessageBodyBasedOperationDispatcherTest
[surefire] Tests run: 1, Failures: 0, Errors: 0, Time elapsed: 0.004 sec
[surefire] Running org.apache.axis2.dispatchers.RelatesToBasedServiceDispatcherTest
[surefire] Tests run: 1, Failures: 0, Errors: 0, Time elapsed: 0.054 sec
[surefire] Running org.apache.axis2.dispatchers.RequestURIBasedOperationDispatcherTest
[surefire] Tests run: 1, Failures: 0, Errors: 0, Time elapsed: 0.005 sec
[surefire] Running org.apache.axis2.dispatchers.RelatesToBasedOperationDispatcherTest
[surefire] Tests run: 1, Failures: 0, Errors: 0, Time elapsed: 0.004 sec
[surefire] Running org.apache.axis2.dispatchers.SOAPMessageBodyBasedServiceDispatcherTest
[surefire] Tests run: 1, Failures: 0, Errors: 0, Time elapsed: 0.004 sec
[surefire] Running org.apache.axis2.dispatchers.ActionBasedOperationDispatchTest
[surefire] Tests run: 1, Failures: 0, Errors: 0, Time elapsed: 0.004 sec
[surefire] Running org.apache.axis2.context.OperationContextTest
[surefire] Tests run: 1, Failures: 0, Errors: 0, Time elapsed: 0.002 sec
[surefire] Running org.apache.axis2.context.ContextHierarchyTest
[surefire] Tests run: 2, Failures: 0, Errors: 0, Time elapsed: 0.003 sec
[surefire] Running org.apache.axis2.description.WSDLToAllServicesBuilderTest
[SimpleHTTPServer] Stop called
[SimpleHTTPServer] Stop called
[surefire] Tests run: 2, Failures: 0, Errors: 0, Time elapsed: 3.429 sec
[surefire] Running org.apache.axis2.description.RegistryTest
[surefire] Tests run: 5, Failures: 0, Errors: 0, Time elapsed: 0.006 sec
[surefire] Running org.apache.axis2.util.ThreadContextMigratorTest
[surefire] Tests run: 2, Failures: 0, Errors: 0, Time elapsed: 0.005 sec
[surefire] Running org.apache.axis2.addressing.EndpointReferenceHelperTest
[surefire] Tests run: 2, Failures: 0, Errors: 0, Time elapsed: 0.008 sec
[surefire] Running org.apache.axis2.addressing.miheaders.RelatesToTest
[surefire] Tests run: 3, Failures: 0, Errors: 0, Time elapsed: 0.003 sec
[surefire] Running org.apache.axis2.addressing.wsdl.WSDL11ActionHelperTest
[surefire] Tests run: 8, Failures: 0, Errors: 0, Time elapsed: 0.958 sec
[surefire] Running org.apache.axis2.addressing.EndpointReferenceTypeTest
[surefire] Tests run: 5, Failures: 0, Errors: 0, Time elapsed: 0.009 sec
[surefire] Running org.apache.axis2.addressing.AddressingHelperTest
[surefire] Tests run: 6, Failures: 0, Errors: 0, Time elapsed: 0.006 sec
[surefire] Running org.apache.axis2.transport.tcp.TCPTransportTest
[surefire] Tests run: 1, Failures: 0, Errors: 0, Time elapsed: 0.001 sec
[surefire] Running org.apache.axis2.misc.MiscTest
[surefire] Tests run: 1, Failures: 0, Errors: 0, Time elapsed: 0.002 sec
[INFO] [jar:jar]
[INFO] Building jar: /export/home/illsleyd/continuum/continuum-1.0.3/apps/continuum/working-directory/61/modules/kernel/target/axis2-kernel-SNAPSHOT.jar
[INFO] [install:install]
[INFO] Installing /export/home/illsleyd/continuum/continuum-1.0.3/apps/continuum/working-directory/61/modules/kernel/target/axis2-kernel-SNAPSHOT.jar to /export/home/illsleyd/.m2/repository/org/apache/axis2/axis2-kernel/SNAPSHOT/axis2-kernel-SNAPSHOT.jar
[INFO] ----------------------------------------------------------------------------
[INFO] Building Apache Axis 2.0 - Data Binding
[INFO]    task-segment: [clean, install]
[INFO] ----------------------------------------------------------------------------
[INFO] [clean:clean]
[INFO] Deleting directory /export/home/illsleyd/continuum/continuum-1.0.3/apps/continuum/working-directory/61/modules/adb/target
[INFO] Deleting directory /export/home/illsleyd/continuum/continuum-1.0.3/apps/continuum/working-directory/61/modules/adb/target/classes
[INFO] Deleting directory /export/home/illsleyd/continuum/continuum-1.0.3/apps/continuum/working-directory/61/modules/adb/target/test-classes
[INFO] [resources:resources]
[INFO] Using default encoding to copy filtered resources.
[INFO] [compiler:compile]
[INFO] Compiling 66 source files to /export/home/illsleyd/continuum/continuum-1.0.3/apps/continuum/working-directory/61/modules/adb/target/classes
[INFO] [resources:testResources]
[INFO] Using default encoding to copy filtered resources.
[INFO] [compiler:testCompile]
[INFO] Compiling 9 source files to /export/home/illsleyd/continuum/continuum-1.0.3/apps/continuum/working-directory/61/modules/adb/target/test-classes
[INFO] ------------------------------------------------------------------------
[ERROR] BUILD FAILURE
[INFO] ------------------------------------------------------------------------
[INFO] Compilation failure

/export/home/illsleyd/continuum/continuum-1.0.3/apps/continuum/working-directory/61/modules/adb/test/org/apache/axis2/databinding/utils/NamedStaxOMBuilderTest.java:[9,24] package javax.xml.stream does not exist

/export/home/illsleyd/continuum/continuum-1.0.3/apps/continuum/working-directory/61/modules/adb/test/org/apache/axis2/databinding/utils/NamedStaxOMBuilderTest.java:[10,24] package javax.xml.stream does not exist

/export/home/illsleyd/continuum/continuum-1.0.3/apps/continuum/working-directory/61/modules/adb/test/org/apache/axis2/databinding/ADBSOAPModelBuilderTest.java:[181,15] cannot find symbol
symbol  : class XMLStreamReader
location: class org.apache.axis2.databinding.ADBSOAPModelBuilderTest.DummyADBBean

/export/home/illsleyd/continuum/continuum-1.0.3/apps/continuum/working-directory/61/modules/adb/test/org/apache/axis2/databinding/utils/SimpleElementReaderStateMachineTest.java:[7,24] package javax.xml.stream does not exist

/export/home/illsleyd/continuum/continuum-1.0.3/apps/continuum/working-directory/61/modules/adb/test/org/apache/axis2/databinding/utils/reader/ADBXMLStreamReaderTest.java:[9,24] package javax.activation does not exist

/export/home/illsleyd/continuum/continuum-1.0.3/apps/continuum/working-directory/61/modules/adb/test/org/apache/axis2/databinding/utils/reader/ADBXMLStreamReaderTest.java:[16,24] package javax.xml.stream does not exist

/export/home/illsleyd/continuum/continuum-1.0.3/apps/continuum/working-directory/61/modules/adb/test/org/apache/axis2/databinding/utils/reader/ADBXMLStreamReaderTest.java:[311,44] cannot find symbol
symbol  : class XMLStreamException
location: class org.apache.axis2.databinding.utils.reader.ADBXMLStreamReaderTest

/export/home/illsleyd/continuum/continuum-1.0.3/apps/continuum/working-directory/61/modules/adb/test/org/apache/axis2/databinding/utils/reader/ADBXMLStreamReaderTest.java:[590,40] cannot find symbol
symbol  : class XMLStreamException
location: class org.apache.axis2.databinding.utils.reader.ADBXMLStreamReaderTest

/export/home/illsleyd/continuum/continuum-1.0.3/apps/continuum/working-directory/61/modules/adb/test/org/apache/axis2/databinding/utils/reader/ADBXMLStreamReaderTest.java:[806,32] cannot find symbol
symbol  : class XMLStreamReader
location: class org.apache.axis2.databinding.utils.reader.ADBXMLStreamReaderTest

/export/home/illsleyd/continuum/continuum-1.0.3/apps/continuum/working-directory/61/modules/adb/test/org/apache/axis2/databinding/utils/reader/ADBXMLStreamReaderTest.java:[806,63] cannot find symbol
symbol  : class XMLStreamException
location: class org.apache.axis2.databinding.utils.reader.ADBXMLStreamReaderTest

/export/home/illsleyd/continuum/continuum-1.0.3/apps/continuum/working-directory/61/modules/adb/test/org/apache/axis2/databinding/utils/reader/ADBXMLStreamReaderTest.java:[306,15] cannot find symbol
symbol  : class XMLStreamReader
location: class org.apache.axis2.databinding.utils.reader.ADBXMLStreamReaderTest.DummyADBBean

/export/home/illsleyd/continuum/continuum-1.0.3/apps/continuum/working-directory/61/modules/adb/test/org/apache/axis2/databinding/utils/SimpleArrayReaderStateMachineTest.java:[7,24] package javax.xml.stream does not exist

/export/home/illsleyd/continuum/continuum-1.0.3/apps/continuum/working-directory/61/modules/adb/test/org/apache/axis2/databinding/utils/PrintEvents.java:[25,29] cannot find symbol
symbol  : class XMLStreamReader
location: class org.apache.axis2.databinding.utils.PrintEvents

/export/home/illsleyd/continuum/continuum-1.0.3/apps/continuum/working-directory/61/modules/adb/test/org/apache/axis2/databinding/utils/PrintEvents.java:[25,58] cannot find symbol
symbol  : class XMLStreamException
location: class org.apache.axis2.databinding.utils.PrintEvents

/export/home/illsleyd/continuum/continuum-1.0.3/apps/continuum/working-directory/61/modules/adb/test/org/apache/axis2/databinding/utils/PrintEvents.java:[32,35] cannot find symbol
symbol  : class XMLStreamReader
location: class org.apache.axis2.databinding.utils.PrintEvents

/export/home/illsleyd/continuum/continuum-1.0.3/apps/continuum/working-directory/61/modules/adb/test/org/apache/axis2/databinding/utils/PrintEvents.java:[109,34] cannot find symbol
symbol  : class XMLStreamReader
location: class org.apache.axis2.databinding.utils.PrintEvents

/export/home/illsleyd/continuum/continuum-1.0.3/apps/continuum/working-directory/61/modules/adb/test/org/apache/axis2/databinding/utils/PrintEvents.java:[126,40] cannot find symbol
symbol  : class XMLStreamReader
location: class org.apache.axis2.databinding.utils.PrintEvents

/export/home/illsleyd/continuum/continuum-1.0.3/apps/continuum/working-directory/61/modules/adb/test/org/apache/axis2/databinding/utils/PrintEvents.java:[132,39] cannot find symbol
symbol  : class XMLStreamReader
location: class org.apache.axis2.databinding.utils.PrintEvents

/export/home/illsleyd/continuum/continuum-1.0.3/apps/continuum/working-directory/61/modules/adb/test/org/apache/axis2/databinding/utils/PrintEvents.java:[142,40] cannot find symbol
symbol  : class XMLStreamReader
location: class org.apache.axis2.databinding.utils.PrintEvents

/export/home/illsleyd/continuum/continuum-1.0.3/apps/continuum/working-directory/61/modules/adb/test/org/apache/axis2/databinding/utils/PrintEvents.java:[148,39] cannot find symbol
symbol  : class XMLStreamReader
location: class org.apache.axis2.databinding.utils.PrintEvents

/export/home/illsleyd/continuum/continuum-1.0.3/apps/continuum/working-directory/61/modules/adb/test/org/apache/axis2/databinding/utils/NamedStaxOMBuilderTest.java:[33,8] cannot find symbol
symbol  : class XMLStreamReader
location: class org.apache.axis2.databinding.utils.NamedStaxOMBuilderTest

/export/home/illsleyd/continuum/continuum-1.0.3/apps/continuum/working-directory/61/modules/adb/test/org/apache/axis2/databinding/utils/NamedStaxOMBuilderTest.java:[50,8] cannot find symbol
symbol  : class XMLStreamReader
location: class org.apache.axis2.databinding.utils.NamedStaxOMBuilderTest

/export/home/illsleyd/continuum/continuum-1.0.3/apps/continuum/working-directory/61/modules/adb/test/org/apache/axis2/databinding/utils/NamedStaxOMBuilderTest.java:[68,33] cannot find symbol
symbol  : constructor NamedStaxOMBuilder(org.apache.axis2.util.StreamWrapper,javax.xml.namespace.QName)
location: class org.apache.axis2.databinding.utils.NamedStaxOMBuilder

/export/home/illsleyd/continuum/continuum-1.0.3/apps/continuum/working-directory/61/modules/adb/test/org/apache/axis2/databinding/ADBSOAPModelBuilderTest.java:[70,8] cannot find symbol
symbol  : class XMLStreamReader
location: class org.apache.axis2.databinding.ADBSOAPModelBuilderTest

/export/home/illsleyd/continuum/continuum-1.0.3/apps/continuum/working-directory/61/modules/adb/test/org/apache/axis2/databinding/ADBSOAPModelBuilderTest.java:[82,8] cannot find symbol
symbol  : class XMLStreamReader
location: class org.apache.axis2.databinding.ADBSOAPModelBuilderTest

/export/home/illsleyd/continuum/continuum-1.0.3/apps/continuum/working-directory/61/modules/adb/test/org/apache/axis2/databinding/ADBSOAPModelBuilderTest.java:[88,8] cannot find symbol
symbol  : class XMLStreamReader
location: class org.apache.axis2.databinding.ADBSOAPModelBuilderTest

/export/home/illsleyd/continuum/continuum-1.0.3/apps/continuum/working-directory/61/modules/adb/test/org/apache/axis2/databinding/ADBSOAPModelBuilderTest.java:[155,8] cannot find symbol
symbol  : class XMLStreamReader
location: class org.apache.axis2.databinding.ADBSOAPModelBuilderTest

/export/home/illsleyd/continuum/continuum-1.0.3/apps/continuum/working-directory/61/modules/adb/test/org/apache/axis2/databinding/CreateAccountRequest.java:[102,16] cannot access javax.activation.DataHandler
file javax/activation/DataHandler.class not found
                .convertToString(localPassword));

/export/home/illsleyd/continuum/continuum-1.0.3/apps/continuum/working-directory/61/modules/adb/test/org/apache/axis2/databinding/utils/SimpleElementReaderStateMachineTest.java:[32,8] cannot find symbol
symbol  : class XMLStreamReader
location: class org.apache.axis2.databinding.utils.SimpleElementReaderStateMachineTest

/export/home/illsleyd/continuum/continuum-1.0.3/apps/continuum/working-directory/61/modules/adb/test/org/apache/axis2/databinding/utils/SimpleElementReaderStateMachineTest.java:[38,17] cannot find symbol
symbol  : class XMLStreamException
location: class org.apache.axis2.databinding.utils.SimpleElementReaderStateMachineTest

/export/home/illsleyd/continuum/continuum-1.0.3/apps/continuum/working-directory/61/modules/adb/test/org/apache/axis2/databinding/utils/SimpleElementReaderStateMachineTest.java:[47,8] cannot find symbol
symbol  : class XMLStreamReader
location: class org.apache.axis2.databinding.utils.SimpleElementReaderStateMachineTest

/export/home/illsleyd/continuum/continuum-1.0.3/apps/continuum/working-directory/61/modules/adb/test/org/apache/axis2/databinding/utils/SimpleElementReaderStateMachineTest.java:[53,17] cannot find symbol
symbol  : class XMLStreamException
location: class org.apache.axis2.databinding.utils.SimpleElementReaderStateMachineTest

/export/home/illsleyd/continuum/continuum-1.0.3/apps/continuum/working-directory/61/modules/adb/test/org/apache/axis2/databinding/utils/SimpleElementReaderStateMachineTest.java:[62,8] cannot find symbol
symbol  : class XMLStreamReader
location: class org.apache.axis2.databinding.utils.SimpleElementReaderStateMachineTest

/export/home/illsleyd/continuum/continuum-1.0.3/apps/continuum/working-directory/61/modules/adb/test/org/apache/axis2/databinding/utils/reader/ADBXMLStreamReaderTest.java:[114,12] cannot find symbol
symbol  : class XMLStreamReader
location: class org.apache.axis2.databinding.utils.reader.ADBXMLStreamReaderTest

/export/home/illsleyd/continuum/continuum-1.0.3/apps/continuum/working-directory/61/modules/adb/test/org/apache/axis2/databinding/utils/reader/ADBXMLStreamReaderTest.java:[174,12] cannot find symbol
symbol  : class XMLStreamReader
location: class org.apache.axis2.databinding.utils.reader.ADBXMLStreamReaderTest

/export/home/illsleyd/continuum/continuum-1.0.3/apps/continuum/working-directory/61/modules/adb/test/org/apache/axis2/databinding/utils/reader/ADBXMLStreamReaderTest.java:[218,12] cannot find symbol
symbol  : class XMLStreamReader
location: class org.apache.axis2.databinding.utils.reader.ADBXMLStreamReaderTest

/export/home/illsleyd/continuum/continuum-1.0.3/apps/continuum/working-directory/61/modules/adb/test/org/apache/axis2/databinding/utils/reader/ADBXMLStreamReaderTest.java:[270,12] cannot find symbol
symbol  : class XMLStreamReader
location: class org.apache.axis2.databinding.utils.reader.ADBXMLStreamReaderTest

/export/home/illsleyd/continuum/continuum-1.0.3/apps/continuum/working-directory/61/modules/adb/test/org/apache/axis2/databinding/utils/reader/ADBXMLStreamReaderTest.java:[281,17] cannot find symbol
symbol  : class XMLStreamException
location: class org.apache.axis2.databinding.utils.reader.ADBXMLStreamReaderTest

/export/home/illsleyd/continuum/continuum-1.0.3/apps/continuum/working-directory/61/modules/adb/test/org/apache/axis2/databinding/utils/reader/ADBXMLStreamReaderTest.java:[342,8] cannot find symbol
symbol  : class XMLStreamReader
location: class org.apache.axis2.databinding.utils.reader.ADBXMLStreamReaderTest

/export/home/illsleyd/continuum/continuum-1.0.3/apps/continuum/working-directory/61/modules/adb/test/org/apache/axis2/databinding/utils/reader/ADBXMLStreamReaderTest.java:[378,12] cannot find symbol
symbol  : class XMLStreamReader
location: class org.apache.axis2.databinding.utils.reader.ADBXMLStreamReaderTest

/export/home/illsleyd/continuum/continuum-1.0.3/apps/continuum/working-directory/61/modules/adb/test/org/apache/axis2/databinding/utils/reader/ADBXMLStreamReaderTest.java:[389,18] cannot find symbol
symbol  : class XMLStreamException
location: class org.apache.axis2.databinding.utils.reader.ADBXMLStreamReaderTest

/export/home/illsleyd/continuum/continuum-1.0.3/apps/continuum/working-directory/61/modules/adb/test/org/apache/axis2/databinding/utils/reader/ADBXMLStreamReaderTest.java:[416,12] cannot find symbol
symbol  : class XMLStreamReader
location: class org.apache.axis2.databinding.utils.reader.ADBXMLStreamReaderTest

/export/home/illsleyd/continuum/continuum-1.0.3/apps/continuum/working-directory/61/modules/adb/test/org/apache/axis2/databinding/utils/reader/ADBXMLStreamReaderTest.java:[430,16] cannot find symbol
symbol  : class XMLStreamException
location: class org.apache.axis2.databinding.utils.reader.ADBXMLStreamReaderTest

/export/home/illsleyd/continuum/continuum-1.0.3/apps/continuum/working-directory/61/modules/adb/test/org/apache/axis2/databinding/utils/reader/ADBXMLStreamReaderTest.java:[460,12] cannot find symbol
symbol  : class XMLStreamReader
location: class org.apache.axis2.databinding.utils.reader.ADBXMLStreamReaderTest

/export/home/illsleyd/continuum/continuum-1.0.3/apps/continuum/working-directory/61/modules/adb/test/org/apache/axis2/databinding/utils/reader/ADBXMLStreamReaderTest.java:[474,16] cannot find symbol
symbol  : class XMLStreamException
location: class org.apache.axis2.databinding.utils.reader.ADBXMLStreamReaderTest

/export/home/illsleyd/continuum/continuum-1.0.3/apps/continuum/working-directory/61/modules/adb/test/org/apache/axis2/databinding/utils/reader/ADBXMLStreamReaderTest.java:[518,12] cannot find symbol
symbol  : class XMLStreamReader
location: class org.apache.axis2.databinding.utils.reader.ADBXMLStreamReaderTest

/export/home/illsleyd/continuum/continuum-1.0.3/apps/continuum/working-directory/61/modules/adb/test/org/apache/axis2/databinding/utils/reader/ADBXMLStreamReaderTest.java:[565,12] cannot find symbol
symbol  : class XMLStreamReader
location: class org.apache.axis2.databinding.utils.reader.ADBXMLStreamReaderTest

/export/home/illsleyd/continuum/continuum-1.0.3/apps/continuum/working-directory/61/modules/adb/test/org/apache/axis2/databinding/utils/reader/ADBXMLStreamReaderTest.java:[579,16] cannot find symbol
symbol  : class XMLStreamException
location: class org.apache.axis2.databinding.utils.reader.ADBXMLStreamReaderTest

/export/home/illsleyd/continuum/continuum-1.0.3/apps/continuum/working-directory/61/modules/adb/test/org/apache/axis2/databinding/utils/reader/ADBXMLStreamReaderTest.java:[640,12] cannot find symbol
symbol  : class XMLStreamReader
location: class org.apache.axis2.databinding.utils.reader.ADBXMLStreamReaderTest

/export/home/illsleyd/continuum/continuum-1.0.3/apps/continuum/working-directory/61/modules/adb/test/org/apache/axis2/databinding/utils/reader/ADBXMLStreamReaderTest.java:[717,12] cannot find symbol
symbol  : class XMLStreamReader
location: class org.apache.axis2.databinding.utils.reader.ADBXMLStreamReaderTest

/export/home/illsleyd/continuum/continuum-1.0.3/apps/continuum/working-directory/61/modules/adb/test/org/apache/axis2/databinding/utils/reader/ADBXMLStreamReaderTest.java:[749,31] cannot find symbol
symbol  : class DataHandler
location: class org.apache.axis2.databinding.utils.reader.ADBXMLStreamReaderTest

/export/home/illsleyd/continuum/continuum-1.0.3/apps/continuum/working-directory/61/modules/adb/test/org/apache/axis2/databinding/utils/reader/ADBXMLStreamReaderTest.java:[751,11] cannot find symbol
symbol  : class XMLStreamReader
location: class org.apache.axis2.databinding.utils.reader.ADBXMLStreamReaderTest

/export/home/illsleyd/continuum/continuum-1.0.3/apps/continuum/working-directory/61/modules/adb/test/org/apache/axis2/databinding/utils/reader/ADBXMLStreamReaderTest.java:[783,12] cannot find symbol
symbol  : class XMLStreamReader
location: class org.apache.axis2.databinding.utils.reader.ADBXMLStreamReaderTest

/export/home/illsleyd/continuum/continuum-1.0.3/apps/continuum/working-directory/61/modules/adb/test/org/apache/axis2/databinding/utils/reader/ADBXMLStreamReaderTest.java:[816,8] cannot find symbol
symbol  : class XMLStreamWriter
location: class org.apache.axis2.databinding.utils.reader.ADBXMLStreamReaderTest

/export/home/illsleyd/continuum/continuum-1.0.3/apps/continuum/working-directory/61/modules/adb/test/org/apache/axis2/databinding/utils/SimpleArrayReaderStateMachineTest.java:[34,8] cannot find symbol
symbol  : class XMLStreamReader
location: class org.apache.axis2.databinding.utils.SimpleArrayReaderStateMachineTest

/export/home/illsleyd/continuum/continuum-1.0.3/apps/continuum/working-directory/61/modules/adb/test/org/apache/axis2/databinding/utils/SimpleArrayReaderStateMachineTest.java:[40,17] cannot find symbol
symbol  : class XMLStreamException
location: class org.apache.axis2.databinding.utils.SimpleArrayReaderStateMachineTest

/export/home/illsleyd/continuum/continuum-1.0.3/apps/continuum/working-directory/61/modules/adb/test/org/apache/axis2/databinding/utils/SimpleArrayReaderStateMachineTest.java:[51,8] cannot find symbol
symbol  : class XMLStreamReader
location: class org.apache.axis2.databinding.utils.SimpleArrayReaderStateMachineTest

/export/home/illsleyd/continuum/continuum-1.0.3/apps/continuum/working-directory/61/modules/adb/test/org/apache/axis2/databinding/utils/SimpleArrayReaderStateMachineTest.java:[56,24] cannot find symbol
symbol  : variable XMLStreamConstants
location: class org.apache.axis2.databinding.utils.SimpleArrayReaderStateMachineTest

/export/home/illsleyd/continuum/continuum-1.0.3/apps/continuum/working-directory/61/modules/adb/test/org/apache/axis2/databinding/utils/SimpleArrayReaderStateMachineTest.java:[66,17] cannot find symbol
symbol  : class XMLStreamException
location: class org.apache.axis2.databinding.utils.SimpleArrayReaderStateMachineTest

/export/home/illsleyd/continuum/continuum-1.0.3/apps/continuum/working-directory/61/modules/adb/test/org/apache/axis2/databinding/utils/SimpleArrayReaderStateMachineTest.java:[76,8] cannot find symbol
symbol  : class XMLStreamReader
location: class org.apache.axis2.databinding.utils.SimpleArrayReaderStateMachineTest

/export/home/illsleyd/continuum/continuum-1.0.3/apps/continuum/working-directory/61/modules/adb/test/org/apache/axis2/databinding/utils/SimpleArrayReaderStateMachineTest.java:[82,17] cannot find symbol
symbol  : class XMLStreamException
location: class org.apache.axis2.databinding.utils.SimpleArrayReaderStateMachineTest

/export/home/illsleyd/continuum/continuum-1.0.3/apps/continuum/working-directory/61/modules/adb/test/org/apache/axis2/databinding/utils/SimpleArrayReaderStateMachineTest.java:[91,8] cannot find symbol
symbol  : class XMLStreamReader
location: class org.apache.axis2.databinding.utils.SimpleArrayReaderStateMachineTest

/export/home/illsleyd/continuum/continuum-1.0.3/apps/continuum/working-directory/61/modules/adb/test/org/apache/axis2/databinding/utils/PrintEvents.java:[40,17] cannot find symbol
symbol  : variable XMLStreamConstants
location: class org.apache.axis2.databinding.utils.PrintEvents

/export/home/illsleyd/continuum/continuum-1.0.3/apps/continuum/working-directory/61/modules/adb/test/org/apache/axis2/databinding/utils/PrintEvents.java:[48,17] cannot find symbol
symbol  : variable XMLStreamConstants
location: class org.apache.axis2.databinding.utils.PrintEvents

/export/home/illsleyd/continuum/continuum-1.0.3/apps/continuum/working-directory/61/modules/adb/test/org/apache/axis2/databinding/utils/PrintEvents.java:[54,17] cannot find symbol
symbol  : variable XMLStreamConstants
location: class org.apache.axis2.databinding.utils.PrintEvents

/export/home/illsleyd/continuum/continuum-1.0.3/apps/continuum/working-directory/61/modules/adb/test/org/apache/axis2/databinding/utils/PrintEvents.java:[56,17] cannot find symbol
symbol  : variable XMLStreamConstants
location: class org.apache.axis2.databinding.utils.PrintEvents

/export/home/illsleyd/continuum/continuum-1.0.3/apps/continuum/working-directory/61/modules/adb/test/org/apache/axis2/databinding/utils/PrintEvents.java:[64,17] cannot find symbol
symbol  : variable XMLStreamConstants
location: class org.apache.axis2.databinding.utils.PrintEvents

/export/home/illsleyd/continuum/continuum-1.0.3/apps/continuum/working-directory/61/modules/adb/test/org/apache/axis2/databinding/utils/PrintEvents.java:[71,17] cannot find symbol
symbol  : variable XMLStreamConstants
location: class org.apache.axis2.databinding.utils.PrintEvents

/export/home/illsleyd/continuum/continuum-1.0.3/apps/continuum/working-directory/61/modules/adb/test/org/apache/axis2/databinding/utils/PrintEvents.java:[81,17] cannot find symbol
symbol  : variable XMLStreamConstants
location: class org.apache.axis2.databinding.utils.PrintEvents

/export/home/illsleyd/continuum/continuum-1.0.3/apps/continuum/working-directory/61/modules/adb/test/org/apache/axis2/databinding/utils/PrintEvents.java:[88,17] cannot find symbol
symbol  : variable XMLStreamConstants
location: class org.apache.axis2.databinding.utils.PrintEvents

/export/home/illsleyd/continuum/continuum-1.0.3/apps/continuum/working-directory/61/modules/adb/test/org/apache/axis2/databinding/utils/PrintEvents.java:[94,17] cannot find symbol
symbol  : variable XMLStreamConstants
location: class org.apache.axis2.databinding.utils.PrintEvents


[INFO] ------------------------------------------------------------------------
[INFO] For more information, run Maven with the -e switch
[INFO] ------------------------------------------------------------------------
[INFO] Total time: 1 minute 20 seconds
[INFO] Finished at: Sun Mar 18 03:48:06 GMT+00:00 2007
[INFO] Final Memory: 30M/324M
[INFO] ------------------------------------------------------------------------

****************************************************************************



---------------------------------------------------------------------
To unsubscribe, e-mail: axis-cvs-unsubscribe@ws.apache.org
For additional commands, e-mail: axis-cvs-help@ws.apache.org


Mime
View raw message