axis-java-dev mailing list archives

Site index · List index
Message view « Date » · « Thread »
Top « Date » · « Thread »
From "davidillsley (Continuum)" <davidills...@apache.org>
Subject [Apache Axis 2.0 - Root][continuum] BUILD FAILURE
Date Sat, 24 Mar 2007 11:14:30 GMT
Online report : http://ws.zones.apache.org:10000/continuum/servlet/continuum/target/ProjectBuild.vm/view/ProjectBuild/id/61/buildId/1585
Build statistics:
  State: Failed
  Previous State: Ok
  Started at: Sat, 24 Mar 2007 11:02:41 +0000
  Finished at: Sat, 24 Mar 2007 11:14:29 +0000
  Total time: 11m 48s
  Build Trigger: Schedule
  Exit code: 1
  Building machine hostname: ws.zones.apache.org
  Operating system : SunOS(unknown)
  Java version : 1.5.0_09(Sun Microsystems Inc.)

Changes
         dsosnoski          1. Fix for null local name on QName
2. Handle create-type for objects with no default constructor
3. Handle optional elements (minOccurs='0', not just nillable='true')
4. Get binding factory from binding name and package where possible, rather than always from
class
             /webservices/axis2/trunk/java/modules/jibx/src/org/apache/axis2/jibx/CodeGenerationUtility.java
            /webservices/axis2/trunk/java/modules/jibx/src/org/apache/axis2/jibx/template/JibXDatabindingTemplate.xsl
        
****************************************************************************
Output:
****************************************************************************
Snipped Output:
es/jaxbri/target/test-classes
[INFO] [resources:resources]
[INFO] Using default encoding to copy filtered resources.
[INFO] [compiler:compile]
[INFO] Compiling 1 source file to /export/home/illsleyd/continuum/continuum-1.0.3/apps/continuum/working-directory/61/modules/jaxbri/target/classes
[INFO] [resources:testResources]
[INFO] Using default encoding to copy filtered resources.
[INFO] [compiler:testCompile]
[INFO] No sources to compile
[INFO] [surefire:test]
[INFO] Tests are skipped.
[INFO] [jar:jar]
[INFO] Building jar: /export/home/illsleyd/continuum/continuum-1.0.3/apps/continuum/working-directory/61/modules/jaxbri/target/axis2-jaxbri-SNAPSHOT.jar
[INFO] [install:install]
[INFO] Installing /export/home/illsleyd/continuum/continuum-1.0.3/apps/continuum/working-directory/61/modules/jaxbri/target/axis2-jaxbri-SNAPSHOT.jar
to /export/home/illsleyd/.m2/repository/org/apache/axis2/axis2-jaxbri/SNAPSHOT/axis2-jaxbri-SNAPSHOT.jar
[INFO] ----------------------------------------------------------------------------
[INFO] Building Apache Axis 2.0 - SAAJ API
[INFO]    task-segment: [clean, install]
[INFO] ----------------------------------------------------------------------------
[INFO] [clean:clean]
[INFO] Deleting directory /export/home/illsleyd/continuum/continuum-1.0.3/apps/continuum/working-directory/61/modules/saaj-api/target
[INFO] Deleting directory /export/home/illsleyd/continuum/continuum-1.0.3/apps/continuum/working-directory/61/modules/saaj-api/target/classes
[INFO] Deleting directory /export/home/illsleyd/continuum/continuum-1.0.3/apps/continuum/working-directory/61/modules/saaj-api/target/test-classes
[INFO] [resources:resources]
[INFO] Using default encoding to copy filtered resources.
[INFO] [compiler:compile]
[INFO] Compiling 29 source files to /export/home/illsleyd/continuum/continuum-1.0.3/apps/continuum/working-directory/61/modules/saaj-api/target/classes
[INFO] [resources:testResources]
[INFO] Using default encoding to copy filtered resources.
[INFO] [compiler:testCompile]
[INFO] No sources to compile
[INFO] [surefire:test]
[INFO] Tests are skipped.
[INFO] [jar:jar]
[INFO] Building jar: /export/home/illsleyd/continuum/continuum-1.0.3/apps/continuum/working-directory/61/modules/saaj-api/target/axis2-saaj-api-SNAPSHOT.jar
[INFO] [install:install]
[INFO] Installing /export/home/illsleyd/continuum/continuum-1.0.3/apps/continuum/working-directory/61/modules/saaj-api/target/axis2-saaj-api-SNAPSHOT.jar
to /export/home/illsleyd/.m2/repository/org/apache/axis2/axis2-saaj-api/SNAPSHOT/axis2-saaj-api-SNAPSHOT.jar
[INFO] ----------------------------------------------------------------------------
[INFO] Building Apache Axis 2.0 - JAXWS API
[INFO]    task-segment: [clean, install]
[INFO] ----------------------------------------------------------------------------
[INFO] [clean:clean]
[INFO] Deleting directory /export/home/illsleyd/continuum/continuum-1.0.3/apps/continuum/working-directory/61/modules/jaxws-api/target
[INFO] Deleting directory /export/home/illsleyd/continuum/continuum-1.0.3/apps/continuum/working-directory/61/modules/jaxws-api/target/classes
[INFO] Deleting directory /export/home/illsleyd/continuum/continuum-1.0.3/apps/continuum/working-directory/61/modules/jaxws-api/target/test-classes
[INFO] [resources:resources]
[INFO] Using default encoding to copy filtered resources.
[INFO] [compiler:compile]
[INFO] Compiling 52 source files to /export/home/illsleyd/continuum/continuum-1.0.3/apps/continuum/working-directory/61/modules/jaxws-api/target/classes
[INFO] [resources:testResources]
[INFO] Using default encoding to copy filtered resources.
[INFO] [compiler:testCompile]
[INFO] No sources to compile
[INFO] [surefire:test]
[INFO] Tests are skipped.
[INFO] [jar:jar]
[INFO] Building jar: /export/home/illsleyd/continuum/continuum-1.0.3/apps/continuum/working-directory/61/modules/jaxws-api/target/axis2-jaxws-api-SNAPSHOT.jar
[INFO] [install:install]
[INFO] Installing /export/home/illsleyd/continuum/continuum-1.0.3/apps/continuum/working-directory/61/modules/jaxws-api/target/axis2-jaxws-api-SNAPSHOT.jar
to /export/home/illsleyd/.m2/repository/org/apache/axis2/axis2-jaxws-api/SNAPSHOT/axis2-jaxws-api-SNAPSHOT.jar
[INFO] ----------------------------------------------------------------------------
[INFO] Building Apache Axis 2.0 - Metadata
[INFO]    task-segment: [clean, install]
[INFO] ----------------------------------------------------------------------------
[INFO] [clean:clean]
[INFO] Deleting directory /export/home/illsleyd/continuum/continuum-1.0.3/apps/continuum/working-directory/61/modules/metadata/target
[INFO] Deleting directory /export/home/illsleyd/continuum/continuum-1.0.3/apps/continuum/working-directory/61/modules/metadata/target/classes
[INFO] Deleting directory /export/home/illsleyd/continuum/continuum-1.0.3/apps/continuum/working-directory/61/modules/metadata/target/test-classes
[INFO] [resources:resources]
[INFO] Using default encoding to copy filtered resources.
[INFO] [compiler:compile]
[INFO] Compiling 81 source files to /export/home/illsleyd/continuum/continuum-1.0.3/apps/continuum/working-directory/61/modules/metadata/target/classes
[INFO] [antrun:run {execution: gen-ts}]
[INFO] Executing tasks
    [mkdir] Created dir: /export/home/illsleyd/continuum/continuum-1.0.3/apps/continuum/working-directory/61/modules/metadata/target/schema
    [mkdir] Created dir: /export/home/illsleyd/continuum/continuum-1.0.3/apps/continuum/working-directory/61/modules/metadata/target/schema/src
    [mkdir] Created dir: /export/home/illsleyd/continuum/continuum-1.0.3/apps/continuum/working-directory/61/modules/metadata/target/schema/classes
     [echo] Generating JAX-B classes from XSDs
     [echo] Generating java from ProxyDocLitWrapped.wsdl
[INFO] Executed tasks
[INFO] [resources:testResources]
[INFO] Using default encoding to copy filtered resources.
[INFO] [build-helper:add-test-source {execution: add-test-source}]
[INFO] Test Source directory: /export/home/illsleyd/continuum/continuum-1.0.3/apps/continuum/working-directory/61/modules/metadata/target/schema/src
added.
[INFO] [compiler:testCompile]
[INFO] Compiling 42 source files to /export/home/illsleyd/continuum/continuum-1.0.3/apps/continuum/working-directory/61/modules/metadata/target/test-classes
[INFO] ------------------------------------------------------------------------
[ERROR] BUILD FAILURE
[INFO] ------------------------------------------------------------------------
[INFO] Compilation failure

/export/home/illsleyd/continuum/continuum-1.0.3/apps/continuum/working-directory/61/modules/metadata/test/org/apache/axis2/jaxws/description/AnnotationProviderImplDescriptionTests.java:[21,22]
package javax.xml.soap does not exist

/export/home/illsleyd/continuum/continuum-1.0.3/apps/continuum/working-directory/61/modules/metadata/test/org/apache/axis2/jaxws/description/AnnotationProviderImplDescriptionTests.java:[176,48]
cannot find symbol
symbol: class SOAPMessage
class BasicProviderTestImpl implements Provider<SOAPMessage> {

/export/home/illsleyd/continuum/continuum-1.0.3/apps/continuum/working-directory/61/modules/metadata/test/org/apache/axis2/jaxws/description/AnnotationProviderImplDescriptionTests.java:[178,30]
cannot find symbol
symbol  : class SOAPMessage
location: class org.apache.axis2.jaxws.description.BasicProviderTestImpl

/export/home/illsleyd/continuum/continuum-1.0.3/apps/continuum/working-directory/61/modules/metadata/test/org/apache/axis2/jaxws/description/AnnotationProviderImplDescriptionTests.java:[178,11]
cannot find symbol
symbol  : class SOAPMessage
location: class org.apache.axis2.jaxws.description.BasicProviderTestImpl

/export/home/illsleyd/continuum/continuum-1.0.3/apps/continuum/working-directory/61/modules/metadata/test/org/apache/axis2/jaxws/description/AnnotationProviderImplDescriptionTests.java:[228,55]
cannot find symbol
symbol: class SOAPMessage
class NoWebServiceProviderTestImpl implements Provider<SOAPMessage> {

/export/home/illsleyd/continuum/continuum-1.0.3/apps/continuum/working-directory/61/modules/metadata/test/org/apache/axis2/jaxws/description/AnnotationProviderImplDescriptionTests.java:[230,30]
cannot find symbol
symbol  : class SOAPMessage
location: class org.apache.axis2.jaxws.description.NoWebServiceProviderTestImpl

/export/home/illsleyd/continuum/continuum-1.0.3/apps/continuum/working-directory/61/modules/metadata/test/org/apache/axis2/jaxws/description/AnnotationProviderImplDescriptionTests.java:[230,11]
cannot find symbol
symbol  : class SOAPMessage
location: class org.apache.axis2.jaxws.description.NoWebServiceProviderTestImpl

/export/home/illsleyd/continuum/continuum-1.0.3/apps/continuum/working-directory/61/modules/metadata/test/org/apache/axis2/jaxws/description/AnnotationProviderImplDescriptionTests.java:[243,59]
cannot find symbol
symbol: class SOAPMessage
class BothWebServiceAnnotationTestImpl implements Provider<SOAPMessage> {

/export/home/illsleyd/continuum/continuum-1.0.3/apps/continuum/working-directory/61/modules/metadata/test/org/apache/axis2/jaxws/description/AnnotationProviderImplDescriptionTests.java:[245,30]
cannot find symbol
symbol  : class SOAPMessage
location: class org.apache.axis2.jaxws.description.BothWebServiceAnnotationTestImpl

/export/home/illsleyd/continuum/continuum-1.0.3/apps/continuum/working-directory/61/modules/metadata/test/org/apache/axis2/jaxws/description/AnnotationProviderImplDescriptionTests.java:[245,11]
cannot find symbol
symbol  : class SOAPMessage
location: class org.apache.axis2.jaxws.description.BothWebServiceAnnotationTestImpl


[INFO] ------------------------------------------------------------------------
[INFO] For more information, run Maven with the -e switch
[INFO] ------------------------------------------------------------------------
[INFO] Total time: 11 minutes 39 seconds
[INFO] Finished at: Sat Mar 24 11:14:26 GMT+00:00 2007
[INFO] Final Memory: 30M/1011M
[INFO] ------------------------------------------------------------------------

****************************************************************************



---------------------------------------------------------------------
To unsubscribe, e-mail: axis-cvs-unsubscribe@ws.apache.org
For additional commands, e-mail: axis-cvs-help@ws.apache.org


Mime
View raw message