axis-java-dev mailing list archives

Site index · List index
Message view « Date » · « Thread »
Top « Date » · « Thread »
From "davidillsley (Continuum)" <davidills...@apache.org>
Subject [Axis2][continuum] BUILD FAILURE
Date Fri, 16 Mar 2007 22:03:16 GMT
Online report : http://ws.zones.apache.org:10000/continuum/servlet/continuum/target/ProjectBuild.vm/view/ProjectBuild/id/1/buildId/1451
Build statistics:
  State: Failed
  Previous State: Ok
  Started at: Fri, 16 Mar 2007 21:30:29 +0000
  Finished at: Fri, 16 Mar 2007 22:02:52 +0000
  Total time: 32m 22s
  Build Trigger: Schedule
  Exit code: 70
  Building machine hostname: ws.zones.apache.org
  Operating system : SunOS(unknown)
  Java version : 1.5.0_09(Sun Microsystems Inc.)

Changes
         robinsona          axis2-2293 update message text
             /webservices/axis2/trunk/java/modules/integration/test/org/apache/axis2/engine/CallUnregisteredServiceTest.java
            /webservices/axis2/trunk/java/modules/kernel/src/org/apache/axis2/i18n/resource.properties
            /webservices/axis2/trunk/java/modules/metadata/src/org/apache/axis2/jaxws/i18n/resource.properties
           dims          Fix for SOAP1.2 + Attachments
             /webservices/axis2/trunk/java/modules/saaj/src/org/apache/axis2/saaj/SOAPPartImpl.java
        
****************************************************************************
Output:
****************************************************************************
Snipped Output:
 Cleaning: modules/webapp
    [echo] +----------------------------------------
    [echo] 
    [echo] +----------------------------------------
    [echo] | Cleaning: modules/xmlbeans
    [echo] +----------------------------------------
    [delete] Deleting directory /export/home/illsleyd/continuum/continuum-1.0.3/apps/continuum/working-directory/1/modules/xmlbeans/target
    [echo] 
    [echo] +----------------------------------------
    [echo] | Cleaning: target and etc/target
    [echo] +----------------------------------------
    [delete] Deleting directory /export/home/illsleyd/continuum/continuum-1.0.3/apps/continuum/working-directory/1/target


jar:
multiproject:install:
multiproject:projects-init:
    [echo] Gathering project list
Starting the reactor...
Our processing order:
Apache Axis 2.0 - Java2WSDL
Apache Axis 2.0 - Kernel
Apache Axis 2.0 - Data Binding
Apache Axis 2.0 - Code Generation
Apache Axis 2.0 - ADB Codegen
Apache Axis 2.0 - Addressing
Apache Axis 2.0 - Samples
Apache Axis 2.0 - spring
Apache Axis 2.0 - XMLBeans Data Binding
Apache Axis 2.0 - Tools
Apache Axis 2.0 - Integration
Apache Axis 2.0 - JAXB-RI Data Binding
Apache Axis 2.0 - SAAJ API
Apache Axis 2.0 - JAXWS API
Apache Axis 2.0 - SAAJ
Apache Axis 2.0 - Metadata
Apache Axis 2.0 - JAX-WS
Apache Axis 2.0 - JiBX Data Binding
Apache Axis 2.0 - JSON
Apache Axis 2.0 - Metadata Exchange
Apache Axis 2.0 - MTOM Policy
Apache Axis 2.0 - ping
Apache Axis 2.0 - soapmonitor
+----------------------------------------
| Gathering project list Apache Axis 2.0 - Java2WSDL
| Memory: 10M/37M
+----------------------------------------
+----------------------------------------
| Gathering project list Apache Axis 2.0 - Kernel
| Memory: 10M/37M
+----------------------------------------
+----------------------------------------
| Gathering project list Apache Axis 2.0 - Data Binding
| Memory: 10M/37M
+----------------------------------------
+----------------------------------------
| Gathering project list Apache Axis 2.0 - Code Generation
| Memory: 10M/37M
+----------------------------------------
+----------------------------------------
| Gathering project list Apache Axis 2.0 - ADB Codegen
| Memory: 10M/37M
+----------------------------------------
+----------------------------------------
| Gathering project list Apache Axis 2.0 - Addressing
| Memory: 10M/37M
+----------------------------------------
+----------------------------------------
| Gathering project list Apache Axis 2.0 - Samples
| Memory: 10M/37M
+----------------------------------------
+----------------------------------------
| Gathering project list Apache Axis 2.0 - spring
| Memory: 10M/37M
+----------------------------------------
+----------------------------------------
| Gathering project list Apache Axis 2.0 - XMLBeans Data Binding
| Memory: 10M/37M
+----------------------------------------
+----------------------------------------
| Gathering project list Apache Axis 2.0 - Tools
| Memory: 10M/37M
+----------------------------------------
+----------------------------------------
| Gathering project list Apache Axis 2.0 - Integration
| Memory: 10M/37M
+----------------------------------------
+----------------------------------------
| Gathering project list Apache Axis 2.0 - JAXB-RI Data Binding
| Memory: 10M/37M
+----------------------------------------
+----------------------------------------
| Gathering project list Apache Axis 2.0 - SAAJ API
| Memory: 10M/37M
+----------------------------------------
+----------------------------------------
| Gathering project list Apache Axis 2.0 - JAXWS API
| Memory: 10M/37M
+----------------------------------------
+----------------------------------------
| Gathering project list Apache Axis 2.0 - SAAJ
| Memory: 10M/37M
+----------------------------------------
+----------------------------------------
| Gathering project list Apache Axis 2.0 - Metadata
| Memory: 10M/37M
+----------------------------------------
+----------------------------------------
| Gathering project list Apache Axis 2.0 - JAX-WS
| Memory: 10M/37M
+----------------------------------------
+----------------------------------------
| Gathering project list Apache Axis 2.0 - JiBX Data Binding
| Memory: 10M/37M
+----------------------------------------
+----------------------------------------
| Gathering project list Apache Axis 2.0 - JSON
| Memory: 10M/37M
+----------------------------------------
+----------------------------------------
| Gathering project list Apache Axis 2.0 - Metadata Exchange
| Memory: 10M/37M
+----------------------------------------
+----------------------------------------
| Gathering project list Apache Axis 2.0 - MTOM Policy
| Memory: 10M/37M
+----------------------------------------
+----------------------------------------
| Gathering project list Apache Axis 2.0 - ping
| Memory: 10M/37M
+----------------------------------------
+----------------------------------------
| Gathering project list Apache Axis 2.0 - soapmonitor
| Memory: 10M/37M
+----------------------------------------

multiproject:goal:
Starting the reactor...
Our processing order:
Apache Axis 2.0 - Java2WSDL
Apache Axis 2.0 - Kernel
Apache Axis 2.0 - Data Binding
Apache Axis 2.0 - Code Generation
Apache Axis 2.0 - ADB Codegen
Apache Axis 2.0 - Addressing
Apache Axis 2.0 - Samples
Apache Axis 2.0 - spring
Apache Axis 2.0 - XMLBeans Data Binding
Apache Axis 2.0 - Tools
Apache Axis 2.0 - Integration
Apache Axis 2.0 - JAXB-RI Data Binding
Apache Axis 2.0 - SAAJ API
Apache Axis 2.0 - JAXWS API
Apache Axis 2.0 - SAAJ
Apache Axis 2.0 - Metadata
Apache Axis 2.0 - JAX-WS
Apache Axis 2.0 - JiBX Data Binding
Apache Axis 2.0 - JSON
Apache Axis 2.0 - Metadata Exchange
Apache Axis 2.0 - MTOM Policy
Apache Axis 2.0 - ping
Apache Axis 2.0 - soapmonitor
+----------------------------------------
| Executing multiproject:install-callback Apache Axis 2.0 - Java2WSDL
| Memory: 11M/37M
+----------------------------------------
DEPRECATED: the default goal should be specified in the <build> section of project.xml instead of maven.xml
DEPRECATED: the default goal should be specified in the <build> section of project.xml instead of maven.xml
Trying to get missing/snapshot dependencies required by Apache Axis 2.0 - Java2WSDL:
Attempting to download axiom-api-SNAPSHOT.jar.
4/128K
8/128K
12/128K
16/128K
20/128K
24/128K
28/128K
32/128K
36/128K
40/128K
44/128K
48/128K
52/128K
56/128K
60/128K
64/128K
68/128K
72/128K
76/128K
80/128K
84/128K
88/128K
92/128K
96/128K
100/128K
104/128K
108/128K
112/128K
116/128K
120/128K
124/128K
128/128K
128/128K
128K downloaded
Error retrieving artifact from [http://people.apache.org/repo/m1-snapshot-repository/]: org.apache.maven.verifier.ChecksumVerificationException: Error retrieving checksum file for /org.apache.ws.commons.axiom/jars/axiom-api-SNAPSHOT.jar
Skipping download as local copy is up to date!
Attempting to download axiom-impl-SNAPSHOT.jar.
4/113K
8/113K
12/113K
16/113K
20/113K
24/113K
28/113K
32/113K
36/113K
40/113K
44/113K
48/113K
52/113K
56/113K
60/113K
64/113K
68/113K
72/113K
76/113K
80/113K
84/113K
88/113K
92/113K
92/113K
96/113K
100/113K
104/113K
108/113K
112/113K
113/113K
113K downloaded
Error retrieving artifact from [http://people.apache.org/repo/m1-snapshot-repository/]: org.apache.maven.verifier.ChecksumVerificationException: Error retrieving checksum file for /org.apache.ws.commons.axiom/jars/axiom-impl-SNAPSHOT.jar
Skipping download as local copy is up to date!
Attempting to download XmlSchema-SNAPSHOT.jar.
4/129K
8/129K
12/129K
16/129K
20/129K
24/129K
28/129K
32/129K
36/129K
40/129K
44/129K
48/129K
52/129K
56/129K
60/129K
64/129K
68/129K
72/129K
76/129K
80/129K
84/129K
88/129K
92/129K
92/129K
96/129K
100/129K
104/129K
108/129K
112/129K
116/129K
120/129K
124/129K
128/129K
129/129K
129K downloaded
*** CHECKSUM FAILED - Checksum failed on download: local = 'ccf5d62d330158698396e88c068f5ff3'; remote = '0bb5d882107a7e323eabd8319c7adc9a' - RETRYING
4/129K
8/129K
12/129K
16/129K
20/129K
24/129K
28/129K
32/129K
36/129K
40/129K
44/129K
48/129K
52/129K
56/129K
60/129K
64/129K
68/129K
72/129K
76/129K
80/129K
84/129K
88/129K
92/129K
96/129K
100/129K
104/129K
108/129K
112/129K
116/129K
120/129K
124/129K
128/129K
129/129K
129K downloaded
Error retrieving artifact from [http://people.apache.org/repo/m1-snapshot-repository/]: org.apache.maven.verifier.ChecksumVerificationException: Checksum failed on download: local = 'ccf5d62d330158698396e88c068f5ff3'; remote = '0bb5d882107a7e323eabd8319c7adc9a'
build:start:

multiproject:install-callback:
    [echo] Running jar:install for Apache Axis 2.0 - Java2WSDL
java:prepare-filesystem:
    [mkdir] Created dir: /export/home/illsleyd/continuum/continuum-1.0.3/apps/continuum/working-directory/1/modules/java2wsdl/target/classes
Running post goal: java:prepare-filesystem

java:compile:
    [echo] Compiling to /export/home/illsleyd/continuum/continuum-1.0.3/apps/continuum/working-directory/1/modules/java2wsdl/target/classes
    [javac] Compiling 23 source files to /export/home/illsleyd/continuum/continuum-1.0.3/apps/continuum/working-directory/1/modules/java2wsdl/target/classes

java:jar-resources:
Copying 2 files to /export/home/illsleyd/continuum/continuum-1.0.3/apps/continuum/working-directory/1/modules/java2wsdl/target/classes/META-INF

test:test:
    [echo] No tests to run.

jar:jar:
    [jar] Building jar: /export/home/illsleyd/continuum/continuum-1.0.3/apps/continuum/working-directory/1/modules/java2wsdl/target/axis2-java2wsdl-SNAPSHOT.jar

jar:install:
    [echo] Installing...
Uploading to org.apache.axis2/jars/axis2-java2wsdl-SNAPSHOT.jar: 
.................... (56K)
Uploading to org.apache.axis2/poms/axis2-java2wsdl-SNAPSHOT.pom: 
.................... (14K)

+----------------------------------------
| Executing multiproject:install-callback Apache Axis 2.0 - Kernel
| Memory: 12M/38M
+----------------------------------------
DEPRECATED: the default goal should be specified in the <build> section of project.xml instead of maven.xml
DEPRECATED: the default goal should be specified in the <build> section of project.xml instead of maven.xml

build:end:

Trying to get missing/snapshot dependencies required by Apache Axis 2.0 - Kernel:
Attempting to download axis2-java2wsdl-SNAPSHOT.jar.
Skipping download as local copy is up to date!
Attempting to download neethi-SNAPSHOT.jar.
4/28K
8/28K
12/28K
16/28K
20/28K
24/28K
28/28K
28/28K
28K downloaded
*** CHECKSUM FAILED - Checksum failed on download: local = 'cde1c93d7aefd15e673167b99434ace9'; remote = 'eb97c5022f592a6efdcdc19fb2f63663' - RETRYING
4/28K
5/28K
9/28K
13/28K
17/28K
21/28K
25/28K
28/28K
28K downloaded
Error retrieving artifact from [http://people.apache.org/repo/m1-snapshot-repository/]: org.apache.maven.verifier.ChecksumVerificationException: Checksum failed on download: local = 'cde1c93d7aefd15e673167b99434ace9'; remote = 'eb97c5022f592a6efdcdc19fb2f63663'
Attempting to download woden-1.0-incubating-SNAPSHOT.jar.
4/305K
8/305K
12/305K
16/305K
20/305K
24/305K
28/305K
32/305K
36/305K
40/305K
44/305K
48/305K
52/305K
56/305K
60/305K
64/305K
68/305K
72/305K
76/305K
80/305K
84/305K
88/305K
92/305K
92/305K
96/305K
100/305K
104/305K
108/305K
112/305K
116/305K
120/305K
124/305K
128/305K
132/305K
136/305K
140/305K
144/305K
148/305K
152/305K
156/305K
160/305K
164/305K
168/305K
172/305K
176/305K
180/305K
184/305K
188/305K
192/305K
196/305K
200/305K
204/305K
208/305K
212/305K
216/305K
220/305K
224/305K
228/305K
232/305K
236/305K
240/305K
244/305K
248/305K
252/305K
256/305K
260/305K
264/305K
268/305K
272/305K
276/305K
280/305K
284/305K
288/305K
292/305K
296/305K
300/305K
304/305K
305/305K
305K downloaded
*** CHECKSUM FAILED - Checksum failed on download: local = 'f9d64f9ebad695dadb8b9530d97ed7e9'; remote = '2c1189d99004b3dd0e89c0cc651a73cb' - RETRYING
4/305K
8/305K
12/305K
16/305K
20/305K
24/305K
28/305K
32/305K
36/305K
40/305K
44/305K
48/305K
52/305K
56/305K
60/305K
64/305K
68/305K
72/305K
76/305K
80/305K
84/305K
88/305K
92/305K
96/305K
100/305K
104/305K
108/305K
112/305K
116/305K
120/305K
124/305K
128/305K
132/305K
136/305K
140/305K
144/305K
148/305K
152/305K
156/305K
160/305K
164/305K
168/305K
172/305K
176/305K
180/305K
184/305K
188/305K
192/305K
196/305K
200/305K
204/305K
208/305K
212/305K
216/305K
220/305K
224/305K
228/305K
232/305K
236/305K
240/305K
244/305K
248/305K
252/305K
256/305K
260/305K
264/305K
268/305K
272/305K
276/305K
280/305K
284/305K
288/305K
292/305K
296/305K
300/305K
304/305K
305/305K
305K downloaded
Error retrieving artifact from [http://people.apache.org/repo/m1-snapshot-repository/]: org.apache.maven.verifier.ChecksumVerificationException: Checksum failed on download: local = 'f9d64f9ebad695dadb8b9530d97ed7e9'; remote = '2c1189d99004b3dd0e89c0cc651a73cb'
build:start:

multiproject:install-callback:
    [echo] Running jar:install for Apache Axis 2.0 - Kernel
java:prepare-filesystem:
    [mkdir] Created dir: /export/home/illsleyd/continuum/continuum-1.0.3/apps/continuum/working-directory/1/modules/kernel/target/classes
Running post goal: java:prepare-filesystem

java:compile:
    [echo] Compiling to /export/home/illsleyd/continuum/continuum-1.0.3/apps/continuum/working-directory/1/modules/kernel/target/classes
    [javac] Compiling 336 source files to /export/home/illsleyd/continuum/continuum-1.0.3/apps/continuum/working-directory/1/modules/kernel/target/classes
    [javac] /export/home/illsleyd/continuum/continuum-1.0.3/apps/continuum/working-directory/1/modules/kernel/src/org/apache/axis2/transport/http/MultipartFormDataFormatter.java:46: warning: unmappable character for encoding ASCII
    [javac]  * <name>Fr??jus</name>
    [javac]            ^
    [javac] /export/home/illsleyd/continuum/continuum-1.0.3/apps/continuum/working-directory/1/modules/kernel/src/org/apache/axis2/transport/http/MultipartFormDataFormatter.java:46: warning: unmappable character for encoding ASCII
    [javac]  * <name>Fr??jus</name>
    [javac]             ^
    [javac] /export/home/illsleyd/continuum/continuum-1.0.3/apps/continuum/working-directory/1/modules/kernel/src/org/apache/axis2/transport/http/MultipartFormDataFormatter.java:69: warning: unmappable character for encoding ASCII
    [javac]  * <name>Fr??jus</name>
    [javac]            ^
    [javac] /export/home/illsleyd/continuum/continuum-1.0.3/apps/continuum/working-directory/1/modules/kernel/src/org/apache/axis2/transport/http/MultipartFormDataFormatter.java:69: warning: unmappable character for encoding ASCII
    [javac]  * <name>Fr??jus</name>
    [javac]             ^
    [javac] Note: Some input files use or override a deprecated API.
    [javac] Note: Recompile with -Xlint:deprecation for details.
    [javac] 4 warnings

java:jar-resources:
Copying 1 file to /export/home/illsleyd/continuum/continuum-1.0.3/apps/continuum/working-directory/1/modules/kernel/target/classes
Copying 2 files to /export/home/illsleyd/continuum/continuum-1.0.3/apps/continuum/working-directory/1/modules/kernel/target/classes
Copying 2 files to /export/home/illsleyd/continuum/continuum-1.0.3/apps/continuum/working-directory/1/modules/kernel/target/classes/META-INF

test:test:
java:prepare-filesystem:
Running post goal: java:prepare-filesystem

java:compile:
    [echo] Compiling to /export/home/illsleyd/continuum/continuum-1.0.3/apps/continuum/working-directory/1/modules/kernel/target/classes
    [javac] Compiling 1 source file to /export/home/illsleyd/continuum/continuum-1.0.3/apps/continuum/working-directory/1/modules/kernel/target/classes

java:jar-resources:

test:prepare-filesystem:
    [mkdir] Created dir: /export/home/illsleyd/continuum/continuum-1.0.3/apps/continuum/working-directory/1/modules/kernel/target/test-classes
    [mkdir] Created dir: /export/home/illsleyd/continuum/continuum-1.0.3/apps/continuum/working-directory/1/modules/kernel/target/test-reports

test:test-resources:
Copying 59 files to /export/home/illsleyd/continuum/continuum-1.0.3/apps/continuum/working-directory/1/modules/kernel/target/test-classes/../test-resources

test:compile:
    [javac] Compiling 93 source files to /export/home/illsleyd/continuum/continuum-1.0.3/apps/continuum/working-directory/1/modules/kernel/target/test-classes
Running post goal: test:compile
    [echo] the files are up to date = ${jars.uptodate}
    [mkdir] Created dir: /export/home/illsleyd/continuum/continuum-1.0.3/apps/continuum/working-directory/1/modules/kernel/test-resources/deployment/service2/build/classes
    [mkdir] Created dir: /export/home/illsleyd/continuum/continuum-1.0.3/apps/continuum/working-directory/1/modules/kernel/test-resources/deployment/service2/build/lib
    [copy] Copying 1 file to /export/home/illsleyd/continuum/continuum-1.0.3/apps/continuum/working-directory/1/modules/kernel/test-resources/deployment/service2/build/classes/META-INF
    [mkdir] Created dir: /export/home/illsleyd/continuum/continuum-1.0.3/apps/continuum/working-directory/1/modules/kernel/target/test-resources/deployment/services
    [jar] Building jar: /export/home/illsleyd/continuum/continuum-1.0.3/apps/continuum/working-directory/1/modules/kernel/target/test-resources/deployment/services/service2.jar
    [delete] Deleting directory /export/home/illsleyd/continuum/continuum-1.0.3/apps/continuum/working-directory/1/modules/kernel/test-resources/deployment/service2/build
    [echo] the files are up to date = ${jars.uptodate}
    [mkdir] Created dir: /export/home/illsleyd/continuum/continuum-1.0.3/apps/continuum/working-directory/1/modules/kernel/test-resources/deployment/echo/build/classes
    [mkdir] Created dir: /export/home/illsleyd/continuum/continuum-1.0.3/apps/continuum/working-directory/1/modules/kernel/test-resources/deployment/echo/build/lib
    [copy] Copying 1 file to /export/home/illsleyd/continuum/continuum-1.0.3/apps/continuum/working-directory/1/modules/kernel/test-resources/deployment/echo/build/classes/META-INF
    [mkdir] Created dir: /export/home/illsleyd/continuum/continuum-1.0.3/apps/continuum/working-directory/1/modules/kernel/target/echo
    [jar] Building jar: /export/home/illsleyd/continuum/continuum-1.0.3/apps/continuum/working-directory/1/modules/kernel/target/echo/echo.aar
    [delete] Deleting directory /export/home/illsleyd/continuum/continuum-1.0.3/apps/continuum/working-directory/1/modules/kernel/test-resources/deployment/echo/build
    [echo] the files are up to date = ${jars.uptodate}
    [mkdir] Created dir: /export/home/illsleyd/continuum/continuum-1.0.3/apps/continuum/working-directory/1/modules/kernel/test-resources/deployment/invalidservice/build/classes
    [mkdir] Created dir: /export/home/illsleyd/continuum/continuum-1.0.3/apps/continuum/working-directory/1/modules/kernel/test-resources/deployment/invalidservice/build/lib
    [copy] Copying 1 file to /export/home/illsleyd/continuum/continuum-1.0.3/apps/continuum/working-directory/1/modules/kernel/test-resources/deployment/invalidservice/build/classes/META-INF
    [mkdir] Created dir: /export/home/illsleyd/continuum/continuum-1.0.3/apps/continuum/working-directory/1/modules/kernel/target/test-resources/InvalidDeployment/services
    [jar] Building jar: /export/home/illsleyd/continuum/continuum-1.0.3/apps/continuum/working-directory/1/modules/kernel/target/test-resources/InvalidDeployment/services/invalidService.jar
    [delete] Deleting directory /export/home/illsleyd/continuum/continuum-1.0.3/apps/continuum/working-directory/1/modules/kernel/test-resources/deployment/invalidservice/build
    [echo] the files are up to date = ${jars.uptodate}
    [mkdir] Created dir: /export/home/illsleyd/continuum/continuum-1.0.3/apps/continuum/working-directory/1/modules/kernel/test-resources/deployment/module1/build/classes
    [mkdir] Created dir: /export/home/illsleyd/continuum/continuum-1.0.3/apps/continuum/working-directory/1/modules/kernel/test-resources/deployment/module1/build/lib
    [copy] Copying 1 file to /export/home/illsleyd/continuum/continuum-1.0.3/apps/continuum/working-directory/1/modules/kernel/test-resources/deployment/module1/build/classes/META-INF
    [mkdir] Created dir: /export/home/illsleyd/continuum/continuum-1.0.3/apps/continuum/working-directory/1/modules/kernel/target/test-resources/deployment/modules
    [jar] Building jar: /export/home/illsleyd/continuum/continuum-1.0.3/apps/continuum/working-directory/1/modules/kernel/target/test-resources/deployment/modules/module1.mar
    [delete] Deleting directory /export/home/illsleyd/continuum/continuum-1.0.3/apps/continuum/working-directory/1/modules/kernel/test-resources/deployment/module1/build
    [echo] the files are up to date = ${jars.uptodate}
    [mkdir] Created dir: /export/home/illsleyd/continuum/continuum-1.0.3/apps/continuum/working-directory/1/modules/kernel/test-resources/deployment/serviceModule/build/classes
    [mkdir] Created dir: /export/home/illsleyd/continuum/continuum-1.0.3/apps/continuum/working-directory/1/modules/kernel/test-resources/deployment/serviceModule/build/lib
    [copy] Copying 1 file to /export/home/illsleyd/continuum/continuum-1.0.3/apps/continuum/working-directory/1/modules/kernel/test-resources/deployment/serviceModule/build/classes/META-INF
    [mkdir] Created dir: /export/home/illsleyd/continuum/continuum-1.0.3/apps/continuum/working-directory/1/modules/kernel/target/test-resources/InvalidDeployment/modules
    [jar] Building jar: /export/home/illsleyd/continuum/continuum-1.0.3/apps/continuum/working-directory/1/modules/kernel/target/test-resources/InvalidDeployment/modules/serviceModule.jar
    [delete] Deleting directory /export/home/illsleyd/continuum/continuum-1.0.3/apps/continuum/working-directory/1/modules/kernel/test-resources/deployment/serviceModule/build
    [mkdir] Created dir: /export/home/illsleyd/continuum/continuum-1.0.3/apps/continuum/working-directory/1/modules/kernel/target/test-resources/java2sec/more
    [mkdir] Created dir: /export/home/illsleyd/continuum/continuum-1.0.3/apps/continuum/working-directory/1/modules/kernel/target/test-resources/java2sec/less
    [jar] Building jar: /export/home/illsleyd/continuum/continuum-1.0.3/apps/continuum/working-directory/1/modules/kernel/target/test-resources/java2sec/more/MorePermission.jar
    [delete] Deleting directory /export/home/illsleyd/continuum/continuum-1.0.3/apps/continuum/working-directory/1/modules/kernel/target/test-classes/org/apache/axis2/java/security/driver
    [delete] Deleting directory /export/home/illsleyd/continuum/continuum-1.0.3/apps/continuum/working-directory/1/modules/kernel/target/test-classes/org/apache/axis2/java/security/more
    [delete] Deleting directory /export/home/illsleyd/continuum/continuum-1.0.3/apps/continuum/working-directory/1/modules/kernel/target/test-classes/org/apache/axis2/java/security/action
    [delete] Deleting directory /export/home/illsleyd/continuum/continuum-1.0.3/apps/continuum/working-directory/1/modules/kernel/target/test-classes/org/apache/axis2/java/security/interf
    [jar] Building jar: /export/home/illsleyd/continuum/continuum-1.0.3/apps/continuum/working-directory/1/modules/kernel/target/test-resources/java2sec/less/LessPermission.jar
    [delete] Deleting directory /export/home/illsleyd/continuum/continuum-1.0.3/apps/continuum/working-directory/1/modules/kernel/target/test-classes/org/apache/axis2/java/security/less

    [junit] Running org.apache.axis2.addressing.AddressingHelperTest
    [junit] Tests run: 6, Failures: 0, Errors: 0, Time elapsed: 0.434 sec
    [junit] Running org.apache.axis2.addressing.EndpointReferenceHelperTest
    [junit] Tests run: 2, Failures: 0, Errors: 0, Time elapsed: 0.561 sec
    [junit] Running org.apache.axis2.addressing.EndpointReferenceTypeTest
    [junit] Tests run: 5, Failures: 0, Errors: 0, Time elapsed: 0.676 sec
    [junit] Running org.apache.axis2.addressing.miheaders.RelatesToTest
    [junit] Tests run: 3, Failures: 0, Errors: 0, Time elapsed: 0.377 sec
    [junit] Running org.apache.axis2.addressing.wsdl.WSDL11ActionHelperTest
    [junit] Tests run: 8, Failures: 0, Errors: 0, Time elapsed: 0.805 sec
    [junit] Running org.apache.axis2.context.ContextHierarchyTest
    [junit] Tests run: 2, Failures: 0, Errors: 0, Time elapsed: 0.946 sec
    [junit] Running org.apache.axis2.context.OperationContextTest
    [junit] Tests run: 1, Failures: 0, Errors: 0, Time elapsed: 0.767 sec
    [junit] Running org.apache.axis2.deployment.AddingObserverTest
    [junit] Tests run: 1, Failures: 0, Errors: 0, Time elapsed: 0.97 sec
    [junit] Running org.apache.axis2.deployment.AxisMessageTest
    [junit] Tests run: 1, Failures: 0, Errors: 0, Time elapsed: 1.362 sec
    [junit] Running org.apache.axis2.deployment.BadModuleTest
    [junit] Tests run: 1, Failures: 0, Errors: 0, Time elapsed: 0.67 sec
    [junit] Running org.apache.axis2.deployment.BuildERWithDeploymentTest
    [junit] Tests run: 1, Failures: 0, Errors: 0, Time elapsed: 1.28 sec
    [junit] Running org.apache.axis2.deployment.BuilderSelectorDeploymentTest
    [junit] Tests run: 2, Failures: 0, Errors: 0, Time elapsed: 0.78 sec
    [junit] Running org.apache.axis2.deployment.DeploymentTotalTest
    [junit] Tests run: 1, Failures: 0, Errors: 0, Time elapsed: 1.437 sec
    [junit] Running org.apache.axis2.deployment.MessageFormatterDeploymentTest
    [junit] Tests run: 2, Failures: 0, Errors: 0, Time elapsed: 1.33 sec
    [junit] Running org.apache.axis2.deployment.ModifiedConfigFileTest
    [junit] Tests run: 1, Failures: 0, Errors: 0, Time elapsed: 0.778 sec
    [junit] Running org.apache.axis2.deployment.ModuleDisengagementTest
    [junit] Tests run: 7, Failures: 0, Errors: 0, Time elapsed: 1.404 sec
    [junit] Running org.apache.axis2.deployment.ModuleversionTest
    [junit] Tests run: 2, Failures: 0, Errors: 0, Time elapsed: 0.831 sec
    [junit] Running org.apache.axis2.deployment.OperationExcludeTest
    [junit] Tests run: 1, Failures: 0, Errors: 0, Time elapsed: 1.393 sec
    [junit] Running org.apache.axis2.deployment.SameServiceAddingTest
    [junit] Tests run: 1, Failures: 0, Errors: 0, Time elapsed: 0.933 sec
    [junit] Running org.apache.axis2.deployment.ServiceGroupTest
    [junit] Tests run: 1, Failures: 0, Errors: 0, Time elapsed: 1.579 sec
    [junit] Running org.apache.axis2.deployment.SystemPhasesremovedTest
    [junit] Tests run: 1, Failures: 0, Errors: 0, Time elapsed: 0.82 sec
    [junit] Running org.apache.axis2.deployment.TransportDeploymentTest
    [junit] Tests run: 1, Failures: 0, Errors: 0, Time elapsed: 1.138 sec
    [junit] Running org.apache.axis2.description.RegistryTest
    [junit] Tests run: 5, Failures: 0, Errors: 0, Time elapsed: 0.66 sec
    [junit] Running org.apache.axis2.description.WSDLToAllServicesBuilderTest
    [junit] Tests run: 2, Failures: 0, Errors: 0, Time elapsed: 0.998 sec
    [junit] Running org.apache.axis2.dispatchers.ActionBasedOperationDispatchTest
    [junit] Tests run: 1, Failures: 0, Errors: 0, Time elapsed: 0.765 sec
    [junit] Running org.apache.axis2.dispatchers.RelatesToBasedOperationDispatcherTest
    [junit] Tests run: 1, Failures: 0, Errors: 0, Time elapsed: 0.768 sec
    [junit] Running org.apache.axis2.dispatchers.RelatesToBasedServiceDispatcherTest
    [junit] Tests run: 1, Failures: 0, Errors: 0, Time elapsed: 0.778 sec
    [junit] Running org.apache.axis2.dispatchers.RequestURIBasedOperationDispatcherTest
    [junit] Tests run: 1, Failures: 0, Errors: 0, Time elapsed: 0.745 sec
    [junit] Running org.apache.axis2.dispatchers.RequestURIBasedServiceDispatcherTest
    [junit] Tests run: 1, Failures: 0, Errors: 0, Time elapsed: 0.493 sec
    [junit] Running org.apache.axis2.dispatchers.SOAPMessageBodyBasedOperationDispatcherTest
    [junit] Tests run: 1, Failures: 0, Errors: 0, Time elapsed: 0.837 sec
    [junit] Running org.apache.axis2.dispatchers.SOAPMessageBodyBasedServiceDispatcherTest
    [junit] Tests run: 1, Failures: 0, Errors: 0, Time elapsed: 0.546 sec
    [junit] Running org.apache.axis2.engine.EnginePausingTest
    [junit] Tests run: 1, Failures: 0, Errors: 0, Time elapsed: 0.82 sec
    [junit] Running org.apache.axis2.engine.MessageContextChangeTest
    [junit] Tests run: 1, Failures: 0, Errors: 0, Time elapsed: 0.435 sec
    [junit] Running org.apache.axis2.engine.MessageContextSaveATest
    [junit] Tests run: 4, Failures: 0, Errors: 0, Time elapsed: 1.065 sec
    [junit] Running org.apache.axis2.engine.MessageContextSaveBTest
    [junit] Tests run: 1, Failures: 0, Errors: 0, Time elapsed: 0.784 sec
    [junit] Running org.apache.axis2.engine.MessageContextSaveCTest
    [junit] Tests run: 2, Failures: 0, Errors: 0, Time elapsed: 0.94 sec
    [junit] Running org.apache.axis2.engine.MessageContextSelfManagedDataTest
    [junit] Tests run: 10, Failures: 0, Errors: 0, Time elapsed: 1.897 sec
    [junit] Running org.apache.axis2.engine.MessageContextTest
    [junit] Tests run: 1, Failures: 0, Errors: 0, Time elapsed: 0.536 sec
    [junit] Running org.apache.axis2.engine.ModuleConfigTest
    [junit] Tests run: 2, Failures: 0, Errors: 0, Time elapsed: 1.096 sec
    [junit] Running org.apache.axis2.engine.ModuleEngageTest
    [junit] Tests run: 1, Failures: 0, Errors: 0, Time elapsed: 1.403 sec
    [junit] Running org.apache.axis2.engine.ObjectSaveTest
    [junit] Tests run: 5, Failures: 0, Errors: 0, Time elapsed: 0.772 sec
    [junit] Running org.apache.axis2.engine.OperationContextSaveTest
    [junit] Tests run: 1, Failures: 0, Errors: 0, Time elapsed: 0.913 sec
    [junit] Running org.apache.axis2.engine.OptionsSaveTest
    [junit] Tests run: 1, Failures: 0, Errors: 0, Time elapsed: 1.333 sec
    [junit] Running org.apache.axis2.engine.ParameterAddTest
    [junit] Tests run: 4, Failures: 0, Errors: 0, Time elapsed: 0.777 sec
    [junit] Running org.apache.axis2.engine.SOAPActionBasedDispatcherTest
    [junit] Tests run: 4, Failures: 0, Errors: 0, Time elapsed: 0.816 sec
    [junit] Running org.apache.axis2.java.security.driver.Java2SecTest
    [junit] Tests run: 9, Failures: 0, Errors: 0, Time elapsed: 0.545 sec
    [junit] Running org.apache.axis2.misc.MiscTest
    [junit] Tests run: 1, Failures: 0, Errors: 0, Time elapsed: 0.385 sec
    [junit] Running org.apache.axis2.phaserule.AddingHandlerToEachPhaseTest
    [junit] Tests run: 3, Failures: 0, Errors: 0, Time elapsed: 0.427 sec
    [junit] Running org.apache.axis2.phaserule.BeforeAfterTest
    [junit] Tests run: 1, Failures: 0, Errors: 0, Time elapsed: 0.394 sec
    [junit] Running org.apache.axis2.phaserule.BeforeTest
    [junit] Tests run: 1, Failures: 0, Errors: 0, Time elapsed: 0.561 sec
    [junit] Running org.apache.axis2.phaserule.BeforeWithNoFirstHandlerTest
    [junit] Tests run: 1, Failures: 0, Errors: 0, Time elapsed: 0.464 sec
    [junit] Running org.apache.axis2.phaserule.InvalidPhaseFirstRulesTest
    [junit] Tests run: 1, Failures: 0, Errors: 0, Time elapsed: 0.452 sec
    [junit] Running org.apache.axis2.phaserule.InvalidPhaseFirstTest
    [junit] Tests run: 1, Failures: 0, Errors: 0, Time elapsed: 0.418 sec
    [junit] Running org.apache.axis2.phaserule.InvalidPhaseLastRuleTest
    [junit] Tests run: 1, Failures: 0, Errors: 0, Time elapsed: 0.424 sec
    [junit] Running org.apache.axis2.phaserule.InvalidPhaseRuleTest
    [junit] Tests run: 2, Failures: 0, Errors: 0, Time elapsed: 0.419 sec
    [junit] Running org.apache.axis2.phaserule.InvalidPhaselastTest
    [junit] Tests run: 1, Failures: 0, Errors: 0, Time elapsed: 0.46 sec
    [junit] Running org.apache.axis2.phaserule.PhaseFirstTest
    [junit] Tests run: 1, Failures: 0, Errors: 0, Time elapsed: 0.54 sec
    [junit] Running org.apache.axis2.phaserule.PhaseLastTest
    [junit] Tests run: 1, Failures: 0, Errors: 0, Time elapsed: 0.387 sec
    [junit] Running org.apache.axis2.phaserule.PhaseRuleTest
    [junit] Tests run: 1, Failures: 0, Errors: 0, Time elapsed: 0.41 sec
    [junit] Running org.apache.axis2.phaserule.PreDispatchPhaseRuleTest
    [junit] Tests run: 1, Failures: 0, Errors: 0, Time elapsed: 0.399 sec
    [junit] Running org.apache.axis2.phaserule.SingleHandlerPhaseTest
    [junit] Tests run: 1, Failures: 0, Errors: 0, Time elapsed: 0.474 sec
    [junit] Running org.apache.axis2.transport.tcp.TCPTransportTest
    [junit] Tests run: 1, Failures: 0, Errors: 0, Time elapsed: 0.34 sec
    [junit] Running org.apache.axis2.util.ThreadContextMigratorTest
    [junit] Tests run: 2, Failures: 0, Errors: 0, Time elapsed: 0.434 sec

jar:jar:
    [copy] Copying 1 file to /export/home/illsleyd/continuum/continuum-1.0.3/apps/continuum/working-directory/1/modules/kernel/target/classes/org/apache/axis2/i18n
    [jar] Building jar: /export/home/illsleyd/continuum/continuum-1.0.3/apps/continuum/working-directory/1/modules/kernel/target/axis2-kernel-SNAPSHOT.jar

jar:install:
    [echo] Installing...
Uploading to org.apache.axis2/jars/axis2-kernel-SNAPSHOT.jar: 
.................... (871K)
Uploading to org.apache.axis2/poms/axis2-kernel-SNAPSHOT.pom: 
.................... (15K)

+----------------------------------------
| Executing multiproject:install-callback Apache Axis 2.0 - Data Binding
| Memory: 25M/41M
+----------------------------------------
DEPRECATED: the default goal should be specified in the <build> section of project.xml instead of maven.xml
DEPRECATED: the default goal should be specified in the <build> section of project.xml instead of maven.xml

build:end:

Trying to get missing/snapshot dependencies required by Apache Axis 2.0 - Data Binding:
Attempting to download axiom-dom-SNAPSHOT.jar.
4/131K
8/131K
12/131K
16/131K
20/131K
24/131K
28/131K
32/131K
36/131K
40/131K
44/131K
48/131K
52/131K
56/131K
60/131K
64/131K
68/131K
72/131K
76/131K
80/131K
84/131K
88/131K
92/131K
96/131K
98/131K
102/131K
106/131K
110/131K
114/131K
118/131K
122/131K
126/131K
130/131K
131/131K
131K downloaded
Error retrieving artifact from [http://people.apache.org/repo/m1-snapshot-repository/]: org.apache.maven.verifier.ChecksumVerificationException: Error retrieving checksum file for /org.apache.ws.commons.axiom/jars/axiom-dom-SNAPSHOT.jar
Skipping download as local copy is up to date!
Attempting to download axis2-kernel-SNAPSHOT.jar.
Skipping download as local copy is up to date!
build:start:

multiproject:install-callback:
    [echo] Running jar:install for Apache Axis 2.0 - Data Binding
java:prepare-filesystem:
    [mkdir] Created dir: /export/home/illsleyd/continuum/continuum-1.0.3/apps/continuum/working-directory/1/modules/adb/target/classes
Running post goal: java:prepare-filesystem

java:compile:
    [echo] Compiling to /export/home/illsleyd/continuum/continuum-1.0.3/apps/continuum/working-directory/1/modules/adb/target/classes
    [javac] Compiling 66 source files to /export/home/illsleyd/continuum/continuum-1.0.3/apps/continuum/working-directory/1/modules/adb/target/classes

java:jar-resources:
Copying 1 file to /export/home/illsleyd/continuum/continuum-1.0.3/apps/continuum/working-directory/1/modules/adb/target/classes
Copying 2 files to /export/home/illsleyd/continuum/continuum-1.0.3/apps/continuum/working-directory/1/modules/adb/target/classes/META-INF

test:test:
java:prepare-filesystem:
Running post goal: java:prepare-filesystem

java:compile:
    [echo] Compiling to /export/home/illsleyd/continuum/continuum-1.0.3/apps/continuum/working-directory/1/modules/adb/target/classes

java:jar-resources:

test:prepare-filesystem:
    [mkdir] Created dir: /export/home/illsleyd/continuum/continuum-1.0.3/apps/continuum/working-directory/1/modules/adb/target/test-classes
    [mkdir] Created dir: /export/home/illsleyd/continuum/continuum-1.0.3/apps/continuum/working-directory/1/modules/adb/target/test-reports

test:test-resources:
Copying 1 file to /export/home/illsleyd/continuum/continuum-1.0.3/apps/continuum/working-directory/1/modules/adb/target/test-classes
Copying 1 file to /export/home/illsleyd/continuum/continuum-1.0.3/apps/continuum/working-directory/1/modules/adb/target/test-classes

test:compile:
    [javac] Compiling 9 source files to /export/home/illsleyd/continuum/continuum-1.0.3/apps/continuum/working-directory/1/modules/adb/target/test-classes

    [junit] Running org.apache.axis2.databinding.ADBSOAPModelBuilderTest
    [junit] Tests run: 5, Failures: 0, Errors: 0, Time elapsed: 1.037 sec
    [junit] Running org.apache.axis2.databinding.utils.NamedStaxOMBuilderTest
    [junit] Tests run: 2, Failures: 0, Errors: 0, Time elapsed: 0.559 sec
    [junit] Running org.apache.axis2.databinding.utils.SimpleArrayReaderStateMachineTest
    [junit] Tests run: 4, Failures: 0, Errors: 0, Time elapsed: 0.492 sec
    [junit] Running org.apache.axis2.databinding.utils.SimpleElementReaderStateMachineTest
    [junit] Tests run: 3, Failures: 0, Errors: 0, Time elapsed: 0.5 sec
    [junit] Running org.apache.axis2.databinding.utils.reader.ADBXMLStreamReaderTest
    [junit] Tests run: 15, Failures: 0, Errors: 0, Time elapsed: 0.812 sec

jar:jar:
    [jar] Building jar: /export/home/illsleyd/continuum/continuum-1.0.3/apps/continuum/working-directory/1/modules/adb/target/axis2-adb-SNAPSHOT.jar

jar:install:
    [echo] Installing...
Uploading to org.apache.axis2/jars/axis2-adb-SNAPSHOT.jar: 
.................... (146K)
Uploading to org.apache.axis2/poms/axis2-adb-SNAPSHOT.pom: 
.................... (14K)

+----------------------------------------
| Executing multiproject:install-callback Apache Axis 2.0 - Code Generation
| Memory: 31M/39M
+----------------------------------------
DEPRECATED: the default goal should be specified in the <build> section of project.xml instead of maven.xml
DEPRECATED: the default goal should be specified in the <build> section of project.xml instead of maven.xml

build:end:

Trying to get missing/snapshot dependencies required by Apache Axis 2.0 - Code Generation:
Attempting to download axis2-adb-SNAPSHOT.jar.
Skipping download as local copy is up to date!
build:start:

multiproject:install-callback:
    [echo] Running jar:install for Apache Axis 2.0 - Code Generation
java:prepare-filesystem:
    [mkdir] Created dir: /export/home/illsleyd/continuum/continuum-1.0.3/apps/continuum/working-directory/1/modules/codegen/target/classes
Running post goal: java:prepare-filesystem

java:compile:
    [echo] Compiling to /export/home/illsleyd/continuum/continuum-1.0.3/apps/continuum/working-directory/1/modules/codegen/target/classes
    [javac] Compiling 69 source files to /export/home/illsleyd/continuum/continuum-1.0.3/apps/continuum/working-directory/1/modules/codegen/target/classes

java:jar-resources:
Copying 33 files to /export/home/illsleyd/continuum/continuum-1.0.3/apps/continuum/working-directory/1/modules/codegen/target/classes
Copying 2 files to /export/home/illsleyd/continuum/continuum-1.0.3/apps/continuum/working-directory/1/modules/codegen/target/classes/META-INF
Running post goal: java:jar-resources

test:test:
java:prepare-filesystem:
Running post goal: java:prepare-filesystem

java:compile:
    [echo] Compiling to /export/home/illsleyd/continuum/continuum-1.0.3/apps/continuum/working-directory/1/modules/codegen/target/classes

java:jar-resources:
Running post goal: java:jar-resources

test:prepare-filesystem:
    [mkdir] Created dir: /export/home/illsleyd/continuum/continuum-1.0.3/apps/continuum/working-directory/1/modules/codegen/target/test-classes
    [mkdir] Created dir: /export/home/illsleyd/continuum/continuum-1.0.3/apps/continuum/working-directory/1/modules/codegen/target/test-reports

test:test-resources:
Copying 6 files to /export/home/illsleyd/continuum/continuum-1.0.3/apps/continuum/working-directory/1/modules/codegen/target/test-classes
Copying 31 files to /export/home/illsleyd/continuum/continuum-1.0.3/apps/continuum/working-directory/1/modules/codegen/target/test-classes

test:compile:
    [javac] Compiling 2 source files to /export/home/illsleyd/continuum/continuum-1.0.3/apps/continuum/working-directory/1/modules/codegen/target/test-classes

    [junit] Running org.apache.axis2.wsdl.WSDLServiceBuilderTest
    [junit] Tests run: 1, Failures: 0, Errors: 0, Time elapsed: 4.141 sec
    [junit] Running org.apache.axis2.wsdl.codegen.extension.SchemaUnwrapperExtensionTest
    [junit] Tests run: 4, Failures: 0, Errors: 0, Time elapsed: 0.825 sec

jar:jar:
    [jar] Building jar: /export/home/illsleyd/continuum/continuum-1.0.3/apps/continuum/working-directory/1/modules/codegen/target/axis2-codegen-SNAPSHOT.jar

jar:install:
    [echo] Installing...
Uploading to org.apache.axis2/jars/axis2-codegen-SNAPSHOT.jar: 
.................... (183K)
Uploading to org.apache.axis2/poms/axis2-codegen-SNAPSHOT.pom: 
.................... (17K)

+----------------------------------------
| Executing multiproject:install-callback Apache Axis 2.0 - ADB Codegen
| Memory: 27M/36M
+----------------------------------------
DEPRECATED: the default goal should be specified in the <build> section of project.xml instead of maven.xml
DEPRECATED: the default goal should be specified in the <build> section of project.xml instead of maven.xml

build:end:

Trying to get missing/snapshot dependencies required by Apache Axis 2.0 - ADB Codegen:
Attempting to download axis2-codegen-SNAPSHOT.jar.
Skipping download as local copy is up to date!
build:start:

multiproject:install-callback:
    [echo] Running jar:install for Apache Axis 2.0 - ADB Codegen
java:prepare-filesystem:
    [mkdir] Created dir: /export/home/illsleyd/continuum/continuum-1.0.3/apps/continuum/working-directory/1/modules/adb-codegen/target/classes
Running post goal: java:prepare-filesystem

java:compile:
    [echo] Compiling to /export/home/illsleyd/continuum/continuum-1.0.3/apps/continuum/working-directory/1/modules/adb-codegen/target/classes
    [javac] Compiling 17 source files to /export/home/illsleyd/continuum/continuum-1.0.3/apps/continuum/working-directory/1/modules/adb-codegen/target/classes

java:jar-resources:
Copying 8 files to /export/home/illsleyd/continuum/continuum-1.0.3/apps/continuum/working-directory/1/modules/adb-codegen/target/classes
Copying 2 files to /export/home/illsleyd/continuum/continuum-1.0.3/apps/continuum/working-directory/1/modules/adb-codegen/target/classes/META-INF

test:test:
java:prepare-filesystem:
Running post goal: java:prepare-filesystem

java:compile:
    [echo] Compiling to /export/home/illsleyd/continuum/continuum-1.0.3/apps/continuum/working-directory/1/modules/adb-codegen/target/classes

java:jar-resources:

test:prepare-filesystem:
    [mkdir] Created dir: /export/home/illsleyd/continuum/continuum-1.0.3/apps/continuum/working-directory/1/modules/adb-codegen/target/test-classes
    [mkdir] Created dir: /export/home/illsleyd/continuum/continuum-1.0.3/apps/continuum/working-directory/1/modules/adb-codegen/target/test-reports

test:test-resources:
Copying 37 files to /export/home/illsleyd/continuum/continuum-1.0.3/apps/continuum/working-directory/1/modules/adb-codegen/target/test-classes
Copying 8 files to /export/home/illsleyd/continuum/continuum-1.0.3/apps/continuum/working-directory/1/modules/adb-codegen/target/test-classes

test:compile:
    [mkdir] Created dir: /export/home/illsleyd/continuum/continuum-1.0.3/apps/continuum/working-directory/1/modules/adb-codegen/target/schema
    [mkdir] Created dir: /export/home/illsleyd/continuum/continuum-1.0.3/apps/continuum/working-directory/1/modules/adb-codegen/target/schema/src
    [mkdir] Created dir: /export/home/illsleyd/continuum/continuum-1.0.3/apps/continuum/working-directory/1/modules/adb-codegen/target/schema/classes
    [echo] Compiling simple_maxOccurs2.xsd
    [echo] Compiling anonymous_complexType.xsd
    [echo] Compiling simple_choice.xsd
    [echo] Compiling simple_particle_all.xsd
    [echo] Compiling simple_maxOccurs.xsd
    [echo] Compiling simple_anytype.xsd
    [echo] Compiling simple-minoccurs0.xsd
    [echo] Compiling complex-minoccurs0.xsd
    [echo] Compiling simple-recursive-datatypes.xsd
    [echo] Compiling mixed_minoccus0.xsd
    [echo] Compiling complete.xsd
    [echo] Compiling simpleExtension.xsd
    [echo] Compiling union.xsd
    [echo] Compiling all.xsd
    [echo] Compiling enumeration.xsd
    [echo] Compiling restrictions.xsd
    [echo] Compiling choice.xsd
    [echo] Compiling list.xsd
    [echo] Compiling element_references.xsd
    [echo] Compiling innersequence_choice.xsd
    [javac] Compiling 196 source files to /export/home/illsleyd/continuum/continuum-1.0.3/apps/continuum/working-directory/1/modules/adb-codegen/target/schema/classes
    [javac] Note: Some input files use unchecked or unsafe operations.
    [javac] Note: Recompile with -Xlint:unchecked for details.
    [javac] Compiling 81 source files to /export/home/illsleyd/continuum/continuum-1.0.3/apps/continuum/working-directory/1/modules/adb-codegen/target/test-classes

    [junit] Running org.apache.axis2.schema.all.AllTest
    [junit] Tests run: 1, Failures: 0, Errors: 0, Time elapsed: 1.478 sec
    [junit] Running org.apache.axis2.schema.choice.ChiceTest
    [junit] Tests run: 1, Failures: 0, Errors: 0, Time elapsed: 1.482 sec
    [junit] Running org.apache.axis2.schema.compile.AnonymousComplexTypeTest
    [junit] Tests run: 1, Failures: 0, Errors: 0, Time elapsed: 3.189 sec
    [junit] Running org.apache.axis2.schema.compile.ComplexAllTest
    [junit] Tests run: 1, Failures: 0, Errors: 0, Time elapsed: 5.28 sec
    [junit] Running org.apache.axis2.schema.compile.ComplexExtensionTest
    [junit] Tests run: 1, Failures: 0, Errors: 0, Time elapsed: 3.573 sec
    [junit] Running org.apache.axis2.schema.compile.ImportTest
    [junit] Tests run: 1, Failures: 0, Errors: 0, Time elapsed: 4.04 sec
    [junit] Running org.apache.axis2.schema.compile.RecursiveCompileTest
    [junit] Tests run: 1, Failures: 0, Errors: 0, Time elapsed: 3.689 sec
    [junit] Running org.apache.axis2.schema.compile.SimpleAnyAttribTest
    [junit] Tests run: 1, Failures: 0, Errors: 0, Time elapsed: 3.727 sec
    [junit] Running org.apache.axis2.schema.compile.SimpleAnyTest
    [junit] Tests run: 1, Failures: 0, Errors: 0, Time elapsed: 3.736 sec
    [junit] Running org.apache.axis2.schema.compile.SimpleAnyTypeTest
    [junit] Tests run: 1, Failures: 0, Errors: 0, Time elapsed: 4.566 sec
    [junit] Running org.apache.axis2.schema.compile.SimpleAttributeTest
    [junit] Tests run: 1, Failures: 0, Errors: 0, Time elapsed: 3.267 sec
    [junit] Running org.apache.axis2.schema.compile.SimpleChoiceTest
    [junit] Tests run: 1, Failures: 0, Errors: 0, Time elapsed: 4.091 sec
    [junit] Running org.apache.axis2.schema.compile.SimpleContentExtensionTest
    [junit] Tests run: 1, Failures: 0, Errors: 0, Time elapsed: 3.3 sec
    [junit] Running org.apache.axis2.schema.compile.SimpleElementReferenceTest
    [junit] Tests run: 1, Failures: 0, Errors: 0, Time elapsed: 4.175 sec
    [junit] Running org.apache.axis2.schema.compile.SimpleElementTest
    [junit] Tests run: 1, Failures: 0, Errors: 0, Time elapsed: 3.387 sec
    [junit] Running org.apache.axis2.schema.compile.SimpleParticleAllTest
    [junit] Tests run: 1, Failures: 0, Errors: 0, Time elapsed: 3.808 sec
    [junit] Running org.apache.axis2.schema.compile.SimpleRestrictionTest
    [junit] Tests run: 1, Failures: 0, Errors: 0, Time elapsed: 5.517 sec
    [junit] Running org.apache.axis2.schema.compile.SimpleSequence2Test
    [junit] Tests run: 1, Failures: 0, Errors: 0, Time elapsed: 3.067 sec
    [junit] Running org.apache.axis2.schema.compile.SimpleSequenceTest
    [junit] Tests run: 1, Failures: 0, Errors: 0, Time elapsed: 4.172 sec
    [junit] Running org.apache.axis2.schema.compile.XmlMaxOccurs2Test
    [junit] Tests run: 1, Failures: 0, Errors: 0, Time elapsed: 3.983 sec
    [junit] Running org.apache.axis2.schema.compile.XmlmaxOccursTest
    [junit] Tests run: 1, Failures: 0, Errors: 0, Time elapsed: 3.636 sec
    [junit] Running org.apache.axis2.schema.compile.simple.SimpleTypeAllCompileTest
    [junit] Tests run: 1, Failures: 0, Errors: 0, Time elapsed: 3.536 sec
    [junit] Running org.apache.axis2.schema.enumeration.EnumerationTest
    [junit] Tests run: 1, Failures: 0, Errors: 0, Time elapsed: 0.593 sec
    [junit] Running org.apache.axis2.schema.extension.ComplexExtenstionTest
    [junit] Tests run: 1, Failures: 0, Errors: 0, Time elapsed: 0.653 sec
    [junit] Running org.apache.axis2.schema.extension.SimpleExtensionTest
    [junit] Tests run: 1, Failures: 0, Errors: 0, Time elapsed: 0.636 sec
    [junit] Running org.apache.axis2.schema.innerChoice.InnerChoiceTest
    [junit] Tests run: 5, Failures: 0, Errors: 0, Time elapsed: 0.858 sec
    [junit] Running org.apache.axis2.schema.list.ListTest
    [junit] Tests run: 5, Failures: 0, Errors: 0, Time elapsed: 0.693 sec
    [junit] Running org.apache.axis2.schema.populate.derived.DerivedTypeBytePopulateTest
    [junit] Tests run: 1, Failures: 0, Errors: 0, Time elapsed: 0.688 sec
    [junit] Running org.apache.axis2.schema.populate.derived.DerivedTypeIntPopulateTest
    [junit] Tests run: 1, Failures: 0, Errors: 0, Time elapsed: 0.709 sec
    [junit] Running org.apache.axis2.schema.populate.derived.DerivedTypeIntegerPopulateTest
    [junit] Tests run: 1, Failures: 0, Errors: 0, Time elapsed: 0.731 sec
    [junit] Running org.apache.axis2.schema.populate.derived.DerivedTypeLongPopulateTest
    [junit] Tests run: 1, Failures: 0, Errors: 0, Time elapsed: 0.924 sec
    [junit] Running org.apache.axis2.schema.populate.derived.DerivedTypeNegativeIntegerPopulateTest
    [junit] Tests run: 1, Failures: 0, Errors: 0, Time elapsed: 0.769 sec
    [junit] Running org.apache.axis2.schema.populate.derived.DerivedTypeNonNegativeIntegerPopulateTest
    [junit] Tests run: 1, Failures: 0, Errors: 0, Time elapsed: 0.716 sec
    [junit] Running org.apache.axis2.schema.populate.derived.DerivedTypeNonPositiveIntegerPopulateTest
    [junit] Tests run: 1, Failures: 0, Errors: 0, Time elapsed: 0.936 sec
    [junit] Running org.apache.axis2.schema.populate.derived.DerivedTypePositveIntegerPopulateTest
    [junit] Tests run: 1, Failures: 0, Errors: 0, Time elapsed: 0.809 sec
    [junit] Running org.apache.axis2.schema.populate.derived.DerivedTypeShortPopulateTest
    [junit] Tests run: 1, Failures: 0, Errors: 0, Time elapsed: 0.717 sec
    [junit] Running org.apache.axis2.schema.populate.derived.DerivedTypeUnsignedBytePopulateTest
    [junit] Tests run: 1, Failures: 0, Errors: 0, Time elapsed: 0.826 sec
    [junit] Running org.apache.axis2.schema.populate.derived.DerivedTypeUnsignedIntPopulateTest
    [junit] Tests run: 1, Failures: 0, Errors: 0, Time elapsed: 0.829 sec
    [junit] Running org.apache.axis2.schema.populate.derived.DerivedTypeUnsignedLongPopulateTest
    [junit] Tests run: 1, Failures: 0, Errors: 0, Time elapsed: 1.045 sec
    [junit] Running org.apache.axis2.schema.populate.derived.DerivedTypeUnsignedShortPopulateTest
    [junit] Tests run: 1, Failures: 0, Errors: 0, Time elapsed: 0.759 sec
    [junit] Running org.apache.axis2.schema.populate.other.ADBInOutTest
    [junit] Tests run: 2, Failures: 0, Errors: 0, Time elapsed: 0.562 sec
    [junit] Running org.apache.axis2.schema.populate.other.PopulateAnonComplexTypeTest
    [junit] Tests run: 1, Failures: 0, Errors: 0, Time elapsed: 0.531 sec
    [junit] Running org.apache.axis2.schema.populate.other.PopulateAnyTypeTest
    [junit] Tests run: 1, Failures: 0, Errors: 0, Time elapsed: 0.554 sec
    [junit] Running org.apache.axis2.schema.populate.other.PopulateArrayInArrayTest
    [junit] Tests run: 1, Failures: 0, Errors: 0, Time elapsed: 0.714 sec
    [junit] Running org.apache.axis2.schema.populate.other.PopulateArrayTest
    [junit] Tests run: 1, Failures: 0, Errors: 0, Time elapsed: 0.585 sec
    [junit] Running org.apache.axis2.schema.populate.other.PopulateChoiceTest
    [junit] Tests run: 1, Failures: 0, Errors: 0, Time elapsed: 0.538 sec
    [junit] Running org.apache.axis2.schema.populate.other.PopulateComplexMinOccurs0Test
    [junit] Tests run: 4, Failures: 0, Errors: 0, Time elapsed: 0.666 sec
    [junit] Running org.apache.axis2.schema.populate.other.PopulateMinOccurs0Test
    [junit] Tests run: 3, Failures: 0, Errors: 0, Time elapsed: 0.603 sec
    [junit] Running org.apache.axis2.schema.populate.other.PopulateMixedMinoccurs0Test
    [junit] Tests run: 2, Failures: 0, Errors: 0, Time elapsed: 0.54 sec
    [junit] Running org.apache.axis2.schema.populate.other.PopulateParticleAllTest
    [junit] Tests run: 1, Failures: 0, Errors: 0, Time elapsed: 0.537 sec
    [junit] Running org.apache.axis2.schema.populate.other.PopulateRecursiveTest
    [junit] Tests run: 1, Failures: 0, Errors: 0, Time elapsed: 0.608 sec
    [junit] Running org.apache.axis2.schema.populate.simple.SimpleTypeAnyURIPopulateTest
    [junit] Tests run: 1, Failures: 0, Errors: 0, Time elapsed: 0.523 sec
    [junit] Running org.apache.axis2.schema.populate.simple.SimpleTypeBase64BinPopulateTest
    [junit] Tests run: 1, Failures: 0, Errors: 0, Time elapsed: 0.534 sec
    [junit] Running org.apache.axis2.schema.populate.simple.SimpleTypeBooleanPopulateTest
    [junit] Tests run: 1, Failures: 0, Errors: 0, Time elapsed: 0.644 sec
    [junit] Running org.apache.axis2.schema.populate.simple.SimpleTypeDatePopulateTest
    [junit] Tests run: 1, Failures: 0, Errors: 0, Time elapsed: 0.729 sec
    [junit] Running org.apache.axis2.schema.populate.simple.SimpleTypeDateTimePopulateTest
    [junit] Tests run: 1, Failures: 0, Errors: 0, Time elapsed: 0.714 sec
    [junit] Running org.apache.axis2.schema.populate.simple.SimpleTypeDayPopulateTest
    [junit] Tests run: 1, Failures: 0, Errors: 0, Time elapsed: 0.648 sec
    [junit] Running org.apache.axis2.schema.populate.simple.SimpleTypeDoublePopulateTest
    [junit] Tests run: 1, Failures: 0, Errors: 0, Time elapsed: 0.565 sec
    [junit] Running org.apache.axis2.schema.populate.simple.SimpleTypeDurationPopulateTest
    [junit] Tests run: 1, Failures: 0, Errors: 0, Time elapsed: 0.604 sec
    [junit] Running org.apache.axis2.schema.populate.simple.SimpleTypeFloatPopulateTest
    [junit] Tests run: 1, Failures: 0, Errors: 0, Time elapsed: 0.554 sec
    [junit] Running org.apache.axis2.schema.populate.simple.SimpleTypeHexBinaryPopulateTest
    [junit] Tests run: 1, Failures: 0, Errors: 0, Time elapsed: 0.622 sec
    [junit] Running org.apache.axis2.schema.populate.simple.SimpleTypeMonthDayPopulateTest
    [junit] Tests run: 1, Failures: 0, Errors: 0, Time elapsed: 0.588 sec
    [junit] Running org.apache.axis2.schema.populate.simple.SimpleTypeQNamePopulateTest
    [junit] Tests run: 1, Failures: 0, Errors: 0, Time elapsed: 0.512 sec
    [junit] Running org.apache.axis2.schema.populate.simple.SimpleTypeTimePopulateTest
    [junit] Tests run: 1, Failures: 0, Errors: 0, Time elapsed: 0.584 sec
    [junit] Running org.apache.axis2.schema.populate.simple.SimpleTypegMonthPopulateTest
    [junit] Tests run: 1, Failures: 0, Errors: 0, Time elapsed: 0.568 sec
    [junit] Running org.apache.axis2.schema.populate.simple.SimpleTypegYearMonthPopulateTest
    [junit] Tests run: 1, Failures: 0, Errors: 0, Time elapsed: 0.572 sec
    [junit] Running org.apache.axis2.schema.populate.simple.SimpleTypegYearPopulateTest
    [junit] Tests run: 1, Failures: 0, Errors: 0, Time elapsed: 0.541 sec
    [junit] Running org.apache.axis2.schema.references.ElementReferenceTest
    [junit] Tests run: 2, Failures: 0, Errors: 0, Time elapsed: 0.898 sec
    [junit] Running org.apache.axis2.schema.restriction.ComplexRestrictionTest
    [junit] Tests run: 1, Failures: 0, Errors: 0, Time elapsed: 0.46 sec
    [junit] Running org.apache.axis2.schema.restriction.SimpleRestrictionTest
    [junit] Tests run: 5, Failures: 0, Errors: 0, Time elapsed: 1.925 sec
    [junit] Running org.apache.axis2.schema.testsuite.AnyElementsTest
    [junit] Tests run: 3, Failures: 0, Errors: 0, Time elapsed: 0.717 sec
    [junit] Running org.apache.axis2.schema.testsuite.CustomElementsTest
    [junit] Tests run: 3, Failures: 0, Errors: 0, Time elapsed: 1.022 sec
    [junit] Running org.apache.axis2.schema.testsuite.IntElementsTest
    [junit] Tests run: 3, Failures: 0, Errors: 0, Time elapsed: 0.796 sec
    [junit] Running org.apache.axis2.schema.testsuite.OuterElementsTest
    [junit] Tests run: 5, Failures: 0, Errors: 0, Time elapsed: 0.945 sec
    [junit] Running org.apache.axis2.schema.testsuite.StringElementsTest
    [junit] Tests run: 3, Failures: 0, Errors: 0, Time elapsed: 0.971 sec
    [junit] Running org.apache.axis2.schema.testsuite.XsdAnyElementsTest
    [junit] Tests run: 3, Failures: 0, Errors: 0, Time elapsed: 1.365 sec
    [junit] Running org.apache.axis2.schema.union.UnionTest
    [junit] Tests run: 4, Failures: 0, Errors: 0, Time elapsed: 1.002 sec

jar:jar:
    [jar] Building jar: /export/home/illsleyd/continuum/continuum-1.0.3/apps/continuum/working-directory/1/modules/adb-codegen/target/axis2-adb-codegen-SNAPSHOT.jar

jar:install:
    [echo] Installing...
Uploading to org.apache.axis2/jars/axis2-adb-codegen-SNAPSHOT.jar: 
.................... (122K)
Uploading to org.apache.axis2/poms/axis2-adb-codegen-SNAPSHOT.pom: 
.................... (15K)

+----------------------------------------
| Executing multiproject:install-callback Apache Axis 2.0 - Addressing
| Memory: 38M/56M
+----------------------------------------
DEPRECATED: the default goal should be specified in the <build> section of project.xml instead of maven.xml
DEPRECATED: the default goal should be specified in the <build> section of project.xml instead of maven.xml

build:end:

build:start:

multiproject:install-callback:
    [echo] Running jar:install for Apache Axis 2.0 - Addressing
java:prepare-filesystem:
    [mkdir] Created dir: /export/home/illsleyd/continuum/continuum-1.0.3/apps/continuum/working-directory/1/modules/addressing/target/classes
Running post goal: java:prepare-filesystem

java:compile:
    [echo] Compiling to /export/home/illsleyd/continuum/continuum-1.0.3/apps/continuum/working-directory/1/modules/addressing/target/classes
    [javac] Compiling 9 source files to /export/home/illsleyd/continuum/continuum-1.0.3/apps/continuum/working-directory/1/modules/addressing/target/classes
Running post goal: java:compile
    [mkdir] Created dir: /export/home/illsleyd/continuum/continuum-1.0.3/apps/continuum/working-directory/1/modules/addressing/target/classes/META-INF
    [copy] Copying 1 file to /export/home/illsleyd/continuum/continuum-1.0.3/apps/continuum/working-directory/1/modules/addressing/target/classes/META-INF
    [copy] Copying 1 file to /export/home/illsleyd/continuum/continuum-1.0.3/apps/continuum/working-directory/1/modules/addressing/target/classes/META-INF
    [copy] Copying 1 file to /export/home/illsleyd/continuum/continuum-1.0.3/apps/continuum/working-directory/1/modules/addressing/target/classes/META-INF
    [copy] Copying 1 file to /export/home/illsleyd/continuum/continuum-1.0.3/apps/continuum/working-directory/1/modules/addressing/target
    [mkdir] Created dir: /export/home/illsleyd/continuum/continuum-1.0.3/apps/continuum/working-directory/1/modules/addressing/target/modules
    [jar] Building jar: /export/home/illsleyd/continuum/continuum-1.0.3/apps/continuum/working-directory/1/modules/addressing/target/addressing-SNAPSHOT.mar
    [copy] Copying 1 file to /export/home/illsleyd/continuum/continuum-1.0.3/apps/continuum/working-directory/1/modules/addressing/target/modules
    [copy] Copying 1 file to /export/home/illsleyd/.maven/repository/org.apache.axis2/mars

java:jar-resources:
Copying 1 file to /export/home/illsleyd/continuum/continuum-1.0.3/apps/continuum/working-directory/1/modules/addressing/target/classes

test:test:
java:prepare-filesystem:
Running post goal: java:prepare-filesystem

java:compile:
    [echo] Compiling to /export/home/illsleyd/continuum/continuum-1.0.3/apps/continuum/working-directory/1/modules/addressing/target/classes
Running post goal: java:compile
    [copy] Copying 1 file to /export/home/illsleyd/continuum/continuum-1.0.3/apps/continuum/working-directory/1/modules/addressing/target/classes/META-INF
    [copy] Copying 1 file to /export/home/illsleyd/continuum/continuum-1.0.3/apps/continuum/working-directory/1/modules/addressing/target/classes/META-INF
    [jar] Building jar: /export/home/illsleyd/continuum/continuum-1.0.3/apps/continuum/working-directory/1/modules/addressing/target/addressing-SNAPSHOT.mar
    [copy] Copying 1 file to /export/home/illsleyd/continuum/continuum-1.0.3/apps/continuum/working-directory/1/modules/addressing/target/modules
    [copy] Copying 1 file to /export/home/illsleyd/.maven/repository/org.apache.axis2/mars

java:jar-resources:

test:prepare-filesystem:
    [mkdir] Created dir: /export/home/illsleyd/continuum/continuum-1.0.3/apps/continuum/working-directory/1/modules/addressing/target/test-classes
    [mkdir] Created dir: /export/home/illsleyd/continuum/continuum-1.0.3/apps/continuum/working-directory/1/modules/addressing/target/test-reports

test:test-resources:
Copying 35 files to /export/home/illsleyd/continuum/continuum-1.0.3/apps/continuum/working-directory/1/modules/addressing/target/test-classes
Copying 2 files to /export/home/illsleyd/continuum/continuum-1.0.3/apps/continuum/working-directory/1/modules/addressing/target/test-classes

test:compile:
    [javac] Compiling 8 source files to /export/home/illsleyd/continuum/continuum-1.0.3/apps/continuum/working-directory/1/modules/addressing/target/test-classes
    [javac] Note: /export/home/illsleyd/continuum/continuum-1.0.3/apps/continuum/working-directory/1/modules/addressing/test/org/apache/axis2/handlers/addressing/AddressingOutHandlerTest.java uses or overrides a deprecated API.
    [javac] Note: Recompile with -Xlint:deprecation for details.

    [junit] Running org.apache.axis2.addressing.AddressingFaultsTest
    [junit] Tests run: 6, Failures: 0, Errors: 0, Time elapsed: 0.391 sec
    [junit] Running org.apache.axis2.handlers.addressing.AddressingFinalInHandlerTest
    [junit] Tests run: 17, Failures: 0, Errors: 0, Time elapsed: 0.685 sec
    [junit] Running org.apache.axis2.handlers.addressing.AddressingInFaultHandlerTest
    [junit] Tests run: 4, Failures: 0, Errors: 0, Time elapsed: 0.881 sec
    [junit] Running org.apache.axis2.handlers.addressing.AddressingOutHandlerTest
    [junit] Tests run: 6, Failures: 0, Errors: 0, Time elapsed: 1.481 sec
    [junit] Running org.apache.axis2.handlers.addressing.AddressingSubmissionInHandlerTest
    [junit] Tests run: 14, Failures: 0, Errors: 0, Time elapsed: 0.733 sec
    [junit] Running org.apache.axis2.handlers.addressing.AddressingValidationHandlerTest
    [junit] Tests run: 4, Failures: 0, Errors: 0, Time elapsed: 1.224 sec

jar:jar:
    [jar] Building jar: /export/home/illsleyd/continuum/continuum-1.0.3/apps/continuum/working-directory/1/modules/addressing/target/axis2-addressing-SNAPSHOT.jar

jar:install:
    [echo] Installing...
Uploading to org.apache.axis2/jars/axis2-addressing-SNAPSHOT.jar: 
.................... (38K)
Uploading to org.apache.axis2/poms/axis2-addressing-SNAPSHOT.pom: 
.................... (15K)

+----------------------------------------
| Executing multiproject:install-callback Apache Axis 2.0 - Samples
| Memory: 44M/57M
+----------------------------------------
DEPRECATED: the default goal should be specified in the <build> section of project.xml instead of maven.xml
DEPRECATED: the default goal should be specified in the <build> section of project.xml instead of maven.xml

build:end:

Trying to get missing/snapshot dependencies required by Apache Axis 2.0 - Samples:
Attempting to download axis2-addressing-SNAPSHOT.jar.
Skipping download as local copy is up to date!
build:start:

multiproject:install-callback:
    [echo] Running jar:install for Apache Axis 2.0 - Samples
java:prepare-filesystem:
    [mkdir] Created dir: /export/home/illsleyd/continuum/continuum-1.0.3/apps/continuum/working-directory/1/modules/samples/target/classes
Running post goal: java:prepare-filesystem

java:compile:
    [echo] Compiling to /export/home/illsleyd/continuum/continuum-1.0.3/apps/continuum/working-directory/1/modules/samples/target/classes
    [javac] Compiling 5 source files to /export/home/illsleyd/continuum/continuum-1.0.3/apps/continuum/working-directory/1/modules/samples/target/classes

java:jar-resources:
Copying 2 files to /export/home/illsleyd/continuum/continuum-1.0.3/apps/continuum/working-directory/1/modules/samples/target/classes/META-INF

test:test:
java:prepare-filesystem:
Running post goal: java:prepare-filesystem

java:compile:
Overriding previous definition of reference to samples.src.path
    [echo] Compiling to /export/home/illsleyd/continuum/continuum-1.0.3/apps/continuum/working-directory/1/modules/samples/target/classes

java:jar-resources:

test:prepare-filesystem:
    [mkdir] Created dir: /export/home/illsleyd/continuum/continuum-1.0.3/apps/continuum/working-directory/1/modules/samples/target/test-classes
    [mkdir] Created dir: /export/home/illsleyd/continuum/continuum-1.0.3/apps/continuum/working-directory/1/modules/samples/target/test-reports

test:test-resources:

test:compile:

Running post goal: test:test
create-samples:
    [mkdir] Created dir: /export/home/illsleyd/continuum/continuum-1.0.3/apps/continuum/working-directory/1/modules/samples/target/samples/userguide
    [mkdir] Created dir: /export/home/illsleyd/continuum/continuum-1.0.3/apps/continuum/working-directory/1/modules/samples/target/samples/wsdl
    [copy] Copying 2 files to /export/home/illsleyd/continuum/continuum-1.0.3/apps/continuum/working-directory/1/modules/samples/target/samples/wsdl
userguide:
    [mkdir] Created dir: /export/home/illsleyd/continuum/continuum-1.0.3/apps/continuum/working-directory/1/modules/samples/target/samples/userguide/src
    [copy] Copying 22 files to /export/home/illsleyd/continuum/continuum-1.0.3/apps/continuum/working-directory/1/modules/samples/target/samples/userguide/src
    [jar] Building MANIFEST-only jar: /export/home/illsleyd/continuum/continuum-1.0.3/apps/continuum/working-directory/1/modules/samples/target/samples/userguide/sample.jar

googleSpellcheck:
    [mkdir] Created dir: /export/home/illsleyd/continuum/continuum-1.0.3/apps/continuum/working-directory/1/modules/samples/target/googlespellcheck
    [jar] Building MANIFEST-only jar: /export/home/illsleyd/continuum/continuum-1.0.3/apps/continuum/working-directory/1/modules/samples/target/googlespellcheck/googleSpellcheck.jar

yahooRESTSearch:
    [mkdir] Created dir: /export/home/illsleyd/continuum/continuum-1.0.3/apps/continuum/working-directory/1/modules/samples/target/yahoorestsearch
    [jar] Building jar: /export/home/illsleyd/continuum/continuum-1.0.3/apps/continuum/working-directory/1/modules/samples/target/yahoorestsearch/yahooRESTSearch.jar

version:
    [mkdir] Created dir: /export/home/illsleyd/continuum/continuum-1.0.3/apps/continuum/working-directory/1/modules/samples/target/version
    [jar] Building jar: /export/home/illsleyd/continuum/continuum-1.0.3/apps/continuum/working-directory/1/modules/samples/target/version/version.jar
    [copy] Copying 1 file to /export/home/illsleyd/continuum/continuum-1.0.3/apps/continuum/working-directory/1/modules/samples/target/toWar/services

groovy:
    [mkdir] Created dir: /export/home/illsleyd/continuum/continuum-1.0.3/apps/continuum/working-directory/1/modules/samples/target/groovy
    [copy] Copying 1 file to /export/home/illsleyd/continuum/continuum-1.0.3/apps/continuum/working-directory/1/modules/samples/target/classes/sample/groovy
    [mkdir] Created dir: /export/home/illsleyd/continuum/continuum-1.0.3/apps/continuum/working-directory/1/modules/samples/target/classes/sample/groovy/lib
    [mkdir] Created dir: /export/home/illsleyd/continuum/continuum-1.0.3/apps/continuum/working-directory/1/modules/samples/target/classes/sample/groovy/META-INF
    [mkdir] Created dir: /export/home/illsleyd/continuum/continuum-1.0.3/apps/continuum/working-directory/1/modules/samples/target/classes/sample/groovy/sample
    [mkdir] Created dir: /export/home/illsleyd/continuum/continuum-1.0.3/apps/continuum/working-directory/1/modules/samples/target/classes/sample/groovy/sample/groovy
    [copy] Copying 1 file to /export/home/illsleyd/continuum/continuum-1.0.3/apps/continuum/working-directory/1/modules/samples/target/classes/sample/groovy/sample/groovy
    [copy] Copying 1 file to /export/home/illsleyd/continuum/continuum-1.0.3/apps/continuum/working-directory/1/modules/samples/target/classes/sample/groovy/META-INF
    [delete] Deleting: /export/home/illsleyd/continuum/continuum-1.0.3/apps/continuum/working-directory/1/modules/samples/target/classes/sample/groovy/GroovyReceiver.class
    [copy] Copying 1 file to /export/home/illsleyd/continuum/continuum-1.0.3/apps/continuum/working-directory/1/modules/samples/target/classes/sample/groovy/lib
    [jar] Building jar: /export/home/illsleyd/continuum/continuum-1.0.3/apps/continuum/working-directory/1/modules/samples/target/groovy/groovyService.aar



jar:jar:
    [jar] Building jar: /export/home/illsleyd/continuum/continuum-1.0.3/apps/continuum/working-directory/1/modules/samples/target/axis2-samples-SNAPSHOT.jar

jar:install:
    [echo] Installing...
Uploading to org.apache.axis2/jars/axis2-samples-SNAPSHOT.jar: 
.................... (1623K)
Uploading to org.apache.axis2/poms/axis2-samples-SNAPSHOT.pom: 
.................... (16K)

+----------------------------------------
| Executing multiproject:install-callback Apache Axis 2.0 - spring
| Memory: 48M/61M
+----------------------------------------
DEPRECATED: the default goal should be specified in the <build> section of project.xml instead of maven.xml
DEPRECATED: the default goal should be specified in the <build> section of project.xml instead of maven.xml

build:end:

build:start:

multiproject:install-callback:
    [echo] Running jar:install for Apache Axis 2.0 - spring
java:prepare-filesystem:
    [mkdir] Created dir: /export/home/illsleyd/continuum/continuum-1.0.3/apps/continuum/working-directory/1/modules/spring/target/classes
Running post goal: java:prepare-filesystem

java:compile:
    [echo] Compiling to /export/home/illsleyd/continuum/continuum-1.0.3/apps/continuum/working-directory/1/modules/spring/target/classes
    [javac] Compiling 3 source files to /export/home/illsleyd/continuum/continuum-1.0.3/apps/continuum/working-directory/1/modules/spring/target/classes

java:jar-resources:
Copying 2 files to /export/home/illsleyd/continuum/continuum-1.0.3/apps/continuum/working-directory/1/modules/spring/target/classes/META-INF

test:test:
    [echo] No tests to run.

jar:jar:
    [jar] Building jar: /export/home/illsleyd/continuum/continuum-1.0.3/apps/continuum/working-directory/1/modules/spring/target/axis2-spring-SNAPSHOT.jar

jar:install:
    [echo] Installing...
Uploading to org.apache.axis2/jars/axis2-spring-SNAPSHOT.jar: 
.................... (9K)
Uploading to org.apache.axis2/poms/axis2-spring-SNAPSHOT.pom: 
.................... (14K)

+----------------------------------------
| Executing multiproject:install-callback Apache Axis 2.0 - XMLBeans Data Binding
| Memory: 42M/61M
+----------------------------------------
DEPRECATED: the default goal should be specified in the <build> section of project.xml instead of maven.xml
DEPRECATED: the default goal should be specified in the <build> section of project.xml instead of maven.xml

build:end:

build:start:

multiproject:install-callback:
    [echo] Running jar:install for Apache Axis 2.0 - XMLBeans Data Binding
java:prepare-filesystem:
    [mkdir] Created dir: /export/home/illsleyd/continuum/continuum-1.0.3/apps/continuum/working-directory/1/modules/xmlbeans/target/classes
Running post goal: java:prepare-filesystem

java:compile:
    [echo] Compiling to /export/home/illsleyd/continuum/continuum-1.0.3/apps/continuum/working-directory/1/modules/xmlbeans/target/classes
    [javac] Compiling 2 source files to /export/home/illsleyd/continuum/continuum-1.0.3/apps/continuum/working-directory/1/modules/xmlbeans/target/classes

java:jar-resources:
Copying 1 file to /export/home/illsleyd/continuum/continuum-1.0.3/apps/continuum/working-directory/1/modules/xmlbeans/target/classes
Copying 2 files to /export/home/illsleyd/continuum/continuum-1.0.3/apps/continuum/working-directory/1/modules/xmlbeans/target/classes/META-INF

test:test:
java:prepare-filesystem:
Running post goal: java:prepare-filesystem

java:compile:
    [echo] Compiling to /export/home/illsleyd/continuum/continuum-1.0.3/apps/continuum/working-directory/1/modules/xmlbeans/target/classes

java:jar-resources:

test:prepare-filesystem:
    [mkdir] Created dir: /export/home/illsleyd/continuum/continuum-1.0.3/apps/continuum/working-directory/1/modules/xmlbeans/target/test-classes
    [mkdir] Created dir: /export/home/illsleyd/continuum/continuum-1.0.3/apps/continuum/working-directory/1/modules/xmlbeans/target/test-reports

test:test-resources:
Copying 23 files to /export/home/illsleyd/continuum/continuum-1.0.3/apps/continuum/working-directory/1/modules/xmlbeans/target/test-classes
Copying 1 file to /export/home/illsleyd/continuum/continuum-1.0.3/apps/continuum/working-directory/1/modules/xmlbeans/target/test-classes

test:compile:
    [javac] Compiling 16 source files to /export/home/illsleyd/continuum/continuum-1.0.3/apps/continuum/working-directory/1/modules/xmlbeans/target/test-classes

    [junit] Running org.apache.axis2.xmlbeans.WSDL2Java10Test
    [junit] Tests run: 1, Failures: 0, Errors: 0, Time elapsed: 17.655 sec
    [junit] Running org.apache.axis2.xmlbeans.WSDL2Java11Test
    [junit] Tests run: 1, Failures: 0, Errors: 0, Time elapsed: 15.552 sec
    [junit] Running org.apache.axis2.xmlbeans.WSDL2Java12Test
    [junit] Tests run: 1, Failures: 0, Errors: 0, Time elapsed: 5.063 sec
    [junit] Running org.apache.axis2.xmlbeans.WSDL2Java13Test
    [junit] Tests run: 1, Failures: 0, Errors: 0, Time elapsed: 0.76 sec
    [junit] Running org.apache.axis2.xmlbeans.WSDL2Java1Test
    [junit] Tests run: 1, Failures: 0, Errors: 0, Time elapsed: 17.607 sec
    [junit] Running org.apache.axis2.xmlbeans.WSDL2Java2Test
    [junit] Tests run: 1, Failures: 0, Errors: 0, Time elapsed: 0.787 sec
    [junit] Running org.apache.axis2.xmlbeans.WSDL2Java3Test
    [junit] Tests run: 1, Failures: 0, Errors: 0, Time elapsed: 17.841 sec
    [junit] Running org.apache.axis2.xmlbeans.WSDL2Java4Test
    [junit] Tests run: 1, Failures: 0, Errors: 0, Time elapsed: 20.162 sec
    [junit] Running org.apache.axis2.xmlbeans.WSDL2Java5Test
    [junit] Tests run: 1, Failures: 0, Errors: 0, Time elapsed: 17.444 sec
    [junit] Running org.apache.axis2.xmlbeans.WSDL2Java6Test
    [junit] Tests run: 1, Failures: 0, Errors: 0, Time elapsed: 17.774 sec
    [junit] Running org.apache.axis2.xmlbeans.WSDL2Java7Test
    [junit] Tests run: 1, Failures: 0, Errors: 0, Time elapsed: 15.64 sec
    [junit] Running org.apache.axis2.xmlbeans.WSDL2Java8Test
    [junit] Tests run: 1, Failures: 0, Errors: 0, Time elapsed: 22.723 sec
    [junit] Running org.apache.axis2.xmlbeans.WSDL2Java9Test
    [junit] Tests run: 1, Failures: 0, Errors: 0, Time elapsed: 20.663 sec

jar:jar:
    [jar] Building jar: /export/home/illsleyd/continuum/continuum-1.0.3/apps/continuum/working-directory/1/modules/xmlbeans/target/axis2-xmlbeans-SNAPSHOT.jar

jar:install:
    [echo] Installing...
Uploading to org.apache.axis2/jars/axis2-xmlbeans-SNAPSHOT.jar: 
.................... (22K)
Uploading to org.apache.axis2/poms/axis2-xmlbeans-SNAPSHOT.pom: 
.................... (15K)

+----------------------------------------
| Executing multiproject:install-callback Apache Axis 2.0 - Tools
| Memory: 44M/59M
+----------------------------------------
DEPRECATED: the default goal should be specified in the <build> section of project.xml instead of maven.xml
DEPRECATED: the default goal should be specified in the <build> section of project.xml instead of maven.xml

build:end:

build:start:

multiproject:install-callback:
    [echo] Running jar:install for Apache Axis 2.0 - Tools
java:prepare-filesystem:
    [mkdir] Created dir: /export/home/illsleyd/continuum/continuum-1.0.3/apps/continuum/working-directory/1/modules/tool/target/classes
Running post goal: java:prepare-filesystem

java:compile:
    [echo] Compiling to /export/home/illsleyd/continuum/continuum-1.0.3/apps/continuum/working-directory/1/modules/tool/target/classes
    [javac] Compiling 1 source file to /export/home/illsleyd/continuum/continuum-1.0.3/apps/continuum/working-directory/1/modules/tool/target/classes

java:jar-resources:
Copying 2 files to /export/home/illsleyd/continuum/continuum-1.0.3/apps/continuum/working-directory/1/modules/tool/target/classes
Copying 2 files to /export/home/illsleyd/continuum/continuum-1.0.3/apps/continuum/working-directory/1/modules/tool/target/classes/META-INF

test:test:
    [echo] No tests to run.

jar:jar:
    [jar] Building jar: /export/home/illsleyd/continuum/continuum-1.0.3/apps/continuum/working-directory/1/modules/tool/target/axis2-tools-SNAPSHOT.jar

jar:install:
    [echo] Installing...
Uploading to org.apache.axis2/jars/axis2-tools-SNAPSHOT.jar: 
.................... (9K)
Uploading to org.apache.axis2/poms/axis2-tools-SNAPSHOT.pom: 
.................... (13K)

+----------------------------------------
| Executing multiproject:install-callback Apache Axis 2.0 - Integration
| Memory: 39M/58M
+----------------------------------------
DEPRECATED: the default goal should be specified in the <build> section of project.xml instead of maven.xml
DEPRECATED: the default goal should be specified in the <build> section of project.xml instead of maven.xml

build:end:

Trying to get missing/snapshot dependencies required by Apache Axis 2.0 - Integration:
Attempting to download axis2-adb-codegen-SNAPSHOT.jar.
Skipping download as local copy is up to date!
Attempting to download axis2-samples-SNAPSHOT.jar.
Skipping download as local copy is up to date!
Attempting to download axis2-spring-SNAPSHOT.jar.
Skipping download as local copy is up to date!
Attempting to download axis2-xmlbeans-SNAPSHOT.jar.
Skipping download as local copy is up to date!
Attempting to download axis2-tools-SNAPSHOT.jar.
Skipping download as local copy is up to date!
build:start:

multiproject:install-callback:
    [echo] Running jar:install for Apache Axis 2.0 - Integration
java:prepare-filesystem:
    [mkdir] Created dir: /export/home/illsleyd/continuum/continuum-1.0.3/apps/continuum/working-directory/1/modules/integration/target/classes
Running post goal: java:prepare-filesystem

java:compile:
    [echo] Compiling to /export/home/illsleyd/continuum/continuum-1.0.3/apps/continuum/working-directory/1/modules/integration/target/classes
    [javac] Compiling 136 source files to /export/home/illsleyd/continuum/continuum-1.0.3/apps/continuum/working-directory/1/modules/integration/target/classes
    [javac] Note: /export/home/illsleyd/continuum/continuum-1.0.3/apps/continuum/working-directory/1/modules/integration/src/test/soap12testing/client/SOAPComparator.java uses or overrides a deprecated API.
    [javac] Note: Recompile with -Xlint:deprecation for details.

java:jar-resources:
Copying 1 file to /export/home/illsleyd/continuum/continuum-1.0.3/apps/continuum/working-directory/1/modules/integration/target/classes
Copying 2 files to /export/home/illsleyd/continuum/continuum-1.0.3/apps/continuum/working-directory/1/modules/integration/target/classes/META-INF

test:test:
java:prepare-filesystem:
Running post goal: java:prepare-filesystem

java:compile:
    [echo] Compiling to /export/home/illsleyd/continuum/continuum-1.0.3/apps/continuum/working-directory/1/modules/integration/target/classes
    [javac] Compiling 10 source files to /export/home/illsleyd/continuum/continuum-1.0.3/apps/continuum/working-directory/1/modules/integration/target/classes

java:jar-resources:

test:prepare-filesystem:
    [mkdir] Created dir: /export/home/illsleyd/continuum/continuum-1.0.3/apps/continuum/working-directory/1/modules/integration/target/test-classes
    [mkdir] Created dir: /export/home/illsleyd/continuum/continuum-1.0.3/apps/continuum/working-directory/1/modules/integration/target/test-reports

test:test-resources:
Copying 150 files to /export/home/illsleyd/continuum/continuum-1.0.3/apps/continuum/working-directory/1/modules/integration/target/test-classes

test:compile:
    [copy] Copying 1 file to /export/home/illsleyd/continuum/continuum-1.0.3/apps/continuum/working-directory/1/modules/integration/target/test-classes/modules
    [mkdir] Created dir: /export/home/illsleyd/continuum/continuum-1.0.3/apps/continuum/working-directory/1/modules/integration/target/wsdl
    [echo] Compiling DocumentUnwrappingTest.wsdl 
    [mkdir] Created dir: /export/home/illsleyd/continuum/continuum-1.0.3/apps/continuum/working-directory/1/modules/integration/target/wsdl/documentunwrapping
    [java] log4j:WARN No appenders could be found for logger (org.apache.axis2.description.WSDL11ToAllAxisServicesBuilder).
    [java] log4j:WARN Please initialize the log4j system properly.
    [mkdir] Created dir: /export/home/illsleyd/continuum/continuum-1.0.3/apps/continuum/working-directory/1/modules/integration/target/wsdl/documentunwrapping/build
    [mkdir] Created dir: /export/home/illsleyd/continuum/continuum-1.0.3/apps/continuum/working-directory/1/modules/integration/target/wsdl/documentunwrapping/build/classes
    [mkdir] Created dir: /export/home/illsleyd/continuum/continuum-1.0.3/apps/continuum/working-directory/1/modules/integration/target/wsdl/documentunwrapping/build/lib
    [mkdir] Created dir: /export/home/illsleyd/continuum/continuum-1.0.3/apps/continuum/working-directory/1/modules/integration/target/wsdl/documentunwrapping/test
    [echo] Stax Availability= true
    [echo] Axis2 Availability= true
    [javac] Compiling 26 source files to /export/home/illsleyd/continuum/continuum-1.0.3/apps/continuum/working-directory/1/modules/integration/target/wsdl/documentunwrapping/build/classes
    [javac] Note: Some input files use unchecked or unsafe operations.
    [javac] Note: Recompile with -Xlint:unchecked for details.
    [copy] Copying 2 files to /export/home/illsleyd/continuum/continuum-1.0.3/apps/continuum/working-directory/1/modules/integration/target/wsdl/documentunwrapping/build/classes/META-INF
    [jar] Building jar: /export/home/illsleyd/continuum/continuum-1.0.3/apps/continuum/working-directory/1/modules/integration/target/wsdl/documentunwrapping/build/lib/Services.aar
    [echo] Compiling RPCUnwrappingTest.wsdl 
    [mkdir] Created dir: /export/home/illsleyd/continuum/continuum-1.0.3/apps/continuum/working-directory/1/modules/integration/target/wsdl/rpcunwrapping
    [java] log4j:WARN No appenders could be found for logger (org.apache.axis2.description.WSDL11ToAllAxisServicesBuilder).
    [java] log4j:WARN Please initialize the log4j system properly.
    [mkdir] Created dir: /export/home/illsleyd/continuum/continuum-1.0.3/apps/continuum/working-directory/1/modules/integration/target/wsdl/rpcunwrapping/build
    [mkdir] Created dir: /export/home/illsleyd/continuum/continuum-1.0.3/apps/continuum/working-directory/1/modules/integration/target/wsdl/rpcunwrapping/build/classes
    [mkdir] Created dir: /export/home/illsleyd/continuum/continuum-1.0.3/apps/continuum/working-directory/1/modules/integration/target/wsdl/rpcunwrapping/build/lib
    [mkdir] Created dir: /export/home/illsleyd/continuum/continuum-1.0.3/apps/continuum/working-directory/1/modules/integration/target/wsdl/rpcunwrapping/test
    [echo] Stax Availability= true
    [echo] Axis2 Availability= true
    [javac] Compiling 20 source files to /export/home/illsleyd/continuum/continuum-1.0.3/apps/continuum/working-directory/1/modules/integration/target/wsdl/rpcunwrapping/build/classes
    [javac] Note: Some input files use unchecked or unsafe operations.
    [javac] Note: Recompile with -Xlint:unchecked for details.
    [copy] Copying 2 files to /export/home/illsleyd/continuum/continuum-1.0.3/apps/continuum/working-directory/1/modules/integration/target/wsdl/rpcunwrapping/build/classes/META-INF
    [jar] Building jar: /export/home/illsleyd/continuum/continuum-1.0.3/apps/continuum/working-directory/1/modules/integration/target/wsdl/rpcunwrapping/build/lib/Services.aar
    [java] log4j:WARN No appenders could be found for logger (org.apache.axis2.description.WSDL11ToAllAxisServicesBuilder).
    [java] log4j:WARN Please initialize the log4j system properly.
    [copy] Copying 1 file to /export/home/illsleyd/continuum/continuum-1.0.3/apps/continuum/working-directory/1/modules/integration/target/perf/src/samples/wsdl/perf
    [mkdir] Created dir: /export/home/illsleyd/continuum/continuum-1.0.3/apps/continuum/working-directory/1/modules/integration/target/perf/build
    [mkdir] Created dir: /export/home/illsleyd/continuum/continuum-1.0.3/apps/continuum/working-directory/1/modules/integration/target/perf/build/classes
    [mkdir] Created dir: /export/home/illsleyd/continuum/continuum-1.0.3/apps/continuum/working-directory/1/modules/integration/target/perf/build/lib
    [jar] Building jar: /export/home/illsleyd/continuum/continuum-1.0.3/apps/continuum/working-directory/1/modules/integration/target/perf/build/lib/XBeans-packaged.jar
    [echo] XmlBeans Availability = true
    [echo] Stax Availability= true
    [echo] Axis2 Availability= true
    [javac] Compiling 211 source files to /export/home/illsleyd/continuum/continuum-1.0.3/apps/continuum/working-directory/1/modules/integration/target/perf/build/classes
    [javac] Note: Some input files use or override a deprecated API.
    [javac] Note: Recompile with -Xlint:deprecation for details.
    [javac] Note: Some input files use unchecked or unsafe operations.
    [javac] Note: Recompile with -Xlint:unchecked for details.
    [copy] Copying 2 files to /export/home/illsleyd/continuum/continuum-1.0.3/apps/continuum/working-directory/1/modules/integration/target/perf/build/classes/META-INF
    [copy] Copying 1 file to /export/home/illsleyd/continuum/continuum-1.0.3/apps/continuum/working-directory/1/modules/integration/target/perf/build/classes/lib
    [jar] Building jar: /export/home/illsleyd/continuum/continuum-1.0.3/apps/continuum/working-directory/1/modules/integration/target/perf/build/lib/PerfPortType.aar
    [mkdir] Created dir: /export/home/illsleyd/continuum/continuum-1.0.3/apps/continuum/working-directory/1/modules/integration/target/perf/build/repo
    [mkdir] Created dir: /export/home/illsleyd/continuum/continuum-1.0.3/apps/continuum/working-directory/1/modules/integration/target/perf/build/repo/services
    [copy] Copying 1 file to /export/home/illsleyd/continuum/continuum-1.0.3/apps/continuum/working-directory/1/modules/integration/target/perf/build/repo/services
    [echo] XmlBeans Availability = true
    [echo] Stax Availability= true
    [echo] Axis2 Availability= true
    [javac] Compiling 1 source file to /export/home/illsleyd/continuum/continuum-1.0.3/apps/continuum/working-directory/1/modules/integration/target/perf/build/classes
    [javac] /export/home/illsleyd/continuum/continuum-1.0.3/apps/continuum/working-directory/1/modules/integration/target/perf/test/samples/wsdl/perf/PerfPortTypePerformanceTest.java:46: warning: non-varargs call of varargs method with inexact argument type for last parameter;
    [javac] cast to java.lang.Class for a varargs call
    [javac] cast to java.lang.Class[] for a non-varargs call and to suppress this warning
    [javac]                             creatorMethod = declaredClass.getMethod("newInstance",null);
    [javac]                                                                                   ^
    [javac] /export/home/illsleyd/continuum/continuum-1.0.3/apps/continuum/working-directory/1/modules/integration/target/perf/test/samples/wsdl/perf/PerfPortTypePerformanceTest.java:53: warning: non-varargs call of varargs method with inexact argument type for last parameter;
    [javac] cast to java.lang.Object for a varargs call
    [javac] cast to java.lang.Object[] for a non-varargs call and to suppress this warning
    [javac]                     return  (org.apache.xmlbeans.XmlObject)creatorMethod.invoke(null,null);
    [javac]                                                                                      ^
    [javac] 2 warnings
    [jar] Building jar: /export/home/illsleyd/continuum/continuum-1.0.3/apps/continuum/working-directory/1/modules/integration/target/perf/build/lib/PerfPortType-test-client.jar
    [move] Moving 1 file to /export/home/illsleyd/continuum/continuum-1.0.3/apps/continuum/working-directory/1/modules/integration/target/perf/build/lib
    [move] Moving 1 file to /export/home/illsleyd/continuum/continuum-1.0.3/apps/continuum/working-directory/1/modules/integration/target/perf/build/lib
    [java] log4j:WARN No appenders could be found for logger (org.apache.axis2.description.WSDL11ToAllAxisServicesBuilder).
    [java] log4j:WARN Please initialize the log4j system properly.
    [copy] Copying 1 file to /export/home/illsleyd/continuum/continuum-1.0.3/apps/continuum/working-directory/1/modules/integration/target/perf2/src/samples/wsdl/perf2
    [mkdir] Created dir: /export/home/illsleyd/continuum/continuum-1.0.3/apps/continuum/working-directory/1/modules/integration/target/perf2/build
    [mkdir] Created dir: /export/home/illsleyd/continuum/continuum-1.0.3/apps/continuum/working-directory/1/modules/integration/target/perf2/build/classes
    [mkdir] Created dir: /export/home/illsleyd/continuum/continuum-1.0.3/apps/continuum/working-directory/1/modules/integration/target/perf2/build/lib
    [echo] Stax Availability= true
    [echo] Axis2 Availability= true
    [javac] Compiling 6 source files to /export/home/illsleyd/continuum/continuum-1.0.3/apps/continuum/working-directory/1/modules/integration/target/perf2/build/classes
    [javac] Note: Some input files use unchecked or unsafe operations.
    [javac] Note: Recompile with -Xlint:unchecked for details.
    [copy] Copying 2 files to /export/home/illsleyd/continuum/continuum-1.0.3/apps/continuum/working-directory/1/modules/integration/target/perf2/build/classes/META-INF
    [jar] Building jar: /export/home/illsleyd/continuum/continuum-1.0.3/apps/continuum/working-directory/1/modules/integration/target/perf2/build/lib/Services.aar
    [mkdir] Created dir: /export/home/illsleyd/continuum/continuum-1.0.3/apps/continuum/working-directory/1/modules/integration/target/perf2/build/repo
    [mkdir] Created dir: /export/home/illsleyd/continuum/continuum-1.0.3/apps/continuum/working-directory/1/modules/integration/target/perf2/build/repo/services
    [copy] Copying 1 file to /export/home/illsleyd/continuum/continuum-1.0.3/apps/continuum/working-directory/1/modules/integration/target/perf2/build/repo/services
    [echo] Stax Availability= true
    [echo] Axis2 Availability= true
    [javac] Compiling 1 source file to /export/home/illsleyd/continuum/continuum-1.0.3/apps/continuum/working-directory/1/modules/integration/target/perf2/build/classes
    [jar] Building jar: /export/home/illsleyd/continuum/continuum-1.0.3/apps/continuum/working-directory/1/modules/integration/target/perf2/build/lib/Services-test-client.jar
    [move] Moving 1 file to /export/home/illsleyd/continuum/continuum-1.0.3/apps/continuum/working-directory/1/modules/integration/target/perf2/build/lib
    [java] Time to build schema type system: 1.777 seconds
    [java] Time to generate code: 1.924 seconds
    [java] Time to compile code: 12.462 seconds
    [echo] Running codegen RPC WSDLs - take 1
    [java] log4j:WARN No appenders could be found for logger (org.apache.axis2.description.WSDL11ToAllAxisServicesBuilder).
    [java] log4j:WARN Please initialize the log4j system properly.
    [mkdir] Created dir: /export/home/illsleyd/continuum/continuum-1.0.3/apps/continuum/working-directory/1/modules/integration/target/rpc-test1/build
    [mkdir] Created dir: /export/home/illsleyd/continuum/continuum-1.0.3/apps/continuum/working-directory/1/modules/integration/target/rpc-test1/build/classes
    [mkdir] Created dir: /export/home/illsleyd/continuum/continuum-1.0.3/apps/continuum/working-directory/1/modules/integration/target/rpc-test1/build/lib
    [mkdir] Created dir: /export/home/illsleyd/continuum/continuum-1.0.3/apps/continuum/working-directory/1/modules/integration/target/rpc-test1/test
    [echo] Stax Availability= true
    [echo] Axis2 Availability= true
    [javac] Compiling 2 source files to /export/home/illsleyd/continuum/continuum-1.0.3/apps/continuum/working-directory/1/modules/integration/target/rpc-test1/build/classes
    [javac] Note: /export/home/illsleyd/continuum/continuum-1.0.3/apps/continuum/working-directory/1/modules/integration/target/rpc-test1/src/com/example/www/ServiceNamehttpPortStub.java uses unchecked or unsafe operations.
    [javac] Note: Recompile with -Xlint:unchecked for details.
    [jar] Building jar: /export/home/illsleyd/continuum/continuum-1.0.3/apps/continuum/working-directory/1/modules/integration/target/rpc-test1/build/lib/Services-test-client.jar
    [echo] Running codegen RPC WSDLs - take 2
    [java] log4j:WARN No appenders could be found for logger (org.apache.axis2.description.WSDL11ToAllAxisServicesBuilder).
    [java] log4j:WARN Please initialize the log4j system properly.
    [mkdir] Created dir: /export/home/illsleyd/continuum/continuum-1.0.3/apps/continuum/working-directory/1/modules/integration/target/rpc-test2/build
    [mkdir] Created dir: /export/home/illsleyd/continuum/continuum-1.0.3/apps/continuum/working-directory/1/modules/integration/target/rpc-test2/build/classes
    [mkdir] Created dir: /export/home/illsleyd/continuum/continuum-1.0.3/apps/continuum/working-directory/1/modules/integration/target/rpc-test2/build/lib
    [mkdir] Created dir: /export/home/illsleyd/continuum/continuum-1.0.3/apps/continuum/working-directory/1/modules/integration/target/rpc-test2/test
    [echo] Stax Availability= true
    [echo] Axis2 Availability= true
    [javac] Compiling 2 source files to /export/home/illsleyd/continuum/continuum-1.0.3/apps/continuum/working-directory/1/modules/integration/target/rpc-test2/build/classes
    [javac] Note: /export/home/illsleyd/continuum/continuum-1.0.3/apps/continuum/working-directory/1/modules/integration/target/rpc-test2/src/com/example/www/ServiceNamehttpPortStub.java uses unchecked or unsafe operations.
    [javac] Note: Recompile with -Xlint:unchecked for details.
    [jar] Building jar: /export/home/illsleyd/continuum/continuum-1.0.3/apps/continuum/working-directory/1/modules/integration/target/rpc-test2/build/lib/Services-test-client.jar
    [echo] Running codegen RPC WSDLs - take 3
    [java] log4j:WARN No appenders could be found for logger (org.apache.axis2.description.WSDL11ToAllAxisServicesBuilder).
    [java] log4j:WARN Please initialize the log4j system properly.
    [mkdir] Created dir: /export/home/illsleyd/continuum/continuum-1.0.3/apps/continuum/working-directory/1/modules/integration/target/rpc-test3/build
    [mkdir] Created dir: /export/home/illsleyd/continuum/continuum-1.0.3/apps/continuum/working-directory/1/modules/integration/target/rpc-test3/build/classes
    [mkdir] Created dir: /export/home/illsleyd/continuum/continuum-1.0.3/apps/continuum/working-directory/1/modules/integration/target/rpc-test3/build/lib
    [mkdir] Created dir: /export/home/illsleyd/continuum/continuum-1.0.3/apps/continuum/working-directory/1/modules/integration/target/rpc-test3/test
    [echo] Stax Availability= true
    [echo] Axis2 Availability= true
    [javac] Compiling 2 source files to /export/home/illsleyd/continuum/continuum-1.0.3/apps/continuum/working-directory/1/modules/integration/target/rpc-test3/build/classes
    [javac] Note: /export/home/illsleyd/continuum/continuum-1.0.3/apps/continuum/working-directory/1/modules/integration/target/rpc-test3/src/com/example/www/ServiceNamehttpPortStub.java uses unchecked or unsafe operations.
    [javac] Note: Recompile with -Xlint:unchecked for details.
    [jar] Building jar: /export/home/illsleyd/continuum/continuum-1.0.3/apps/continuum/working-directory/1/modules/integration/target/rpc-test3/build/lib/Services-test-client.jar
    [echo] Running codegen RPC WSDLs - take 4
    [java] log4j:WARN No appenders could be found for logger (org.apache.axis2.description.WSDL11ToAllAxisServicesBuilder).
    [java] log4j:WARN Please initialize the log4j system properly.
    [mkdir] Created dir: /export/home/illsleyd/continuum/continuum-1.0.3/apps/continuum/working-directory/1/modules/integration/target/rpc-test4/build
    [mkdir] Created dir: /export/home/illsleyd/continuum/continuum-1.0.3/apps/continuum/working-directory/1/modules/integration/target/rpc-test4/build/classes
    [mkdir] Created dir: /export/home/illsleyd/continuum/continuum-1.0.3/apps/continuum/working-directory/1/modules/integration/target/rpc-test4/build/lib
    [mkdir] Created dir: /export/home/illsleyd/continuum/continuum-1.0.3/apps/continuum/working-directory/1/modules/integration/target/rpc-test4/test
    [echo] Stax Availability= true
    [echo] Axis2 Availability= true
    [javac] Compiling 5 source files to /export/home/illsleyd/continuum/continuum-1.0.3/apps/continuum/working-directory/1/modules/integration/target/rpc-test4/build/classes
    [javac] Note: Some input files use unchecked or unsafe operations.
    [javac] Note: Recompile with -Xlint:unchecked for details.
    [copy] Copying 2 files to /export/home/illsleyd/continuum/continuum-1.0.3/apps/continuum/working-directory/1/modules/integration/target/rpc-test4/build/classes/META-INF
    [jar] Building jar: /export/home/illsleyd/continuum/continuum-1.0.3/apps/continuum/working-directory/1/modules/integration/target/rpc-test4/build/lib/Services.aar
    [echo] Running codegen RPC WSDLs with helper mode -  take 1
    [java] log4j:WARN No appenders could be found for logger (org.apache.axis2.description.WSDL11ToAllAxisServicesBuilder).
    [java] log4j:WARN Please initialize the log4j system properly.
    [mkdir] Created dir: /export/home/illsleyd/continuum/continuum-1.0.3/apps/continuum/working-directory/1/modules/integration/target/helper-test1/build
    [mkdir] Created dir: /export/home/illsleyd/continuum/continuum-1.0.3/apps/continuum/working-directory/1/modules/integration/target/helper-test1/build/classes
    [mkdir] Created dir: /export/home/illsleyd/continuum/continuum-1.0.3/apps/continuum/working-directory/1/modules/integration/target/helper-test1/build/lib
    [mkdir] Created dir: /export/home/illsleyd/continuum/continuum-1.0.3/apps/continuum/working-directory/1/modules/integration/target/helper-test1/test
    [echo] Stax Availability= true
    [echo] Axis2 Availability= true
    [javac] Compiling 8 source files to /export/home/illsleyd/continuum/continuum-1.0.3/apps/continuum/working-directory/1/modules/integration/target/helper-test1/build/classes
    [javac] Note: Some input files use unchecked or unsafe operations.
    [javac] Note: Recompile with -Xlint:unchecked for details.
    [jar] Building jar: /export/home/illsleyd/continuum/continuum-1.0.3/apps/continuum/working-directory/1/modules/integration/target/helper-test1/build/lib/Services-test-client.jar
    [echo] Running codegen RPC WSDLs with helper mode -  take 2
    [java] log4j:WARN No appenders could be found for logger (org.apache.axis2.description.WSDL11ToAllAxisServicesBuilder).
    [java] log4j:WARN Please initialize the log4j system properly.
    [mkdir] Created dir: /export/home/illsleyd/continuum/continuum-1.0.3/apps/continuum/working-directory/1/modules/integration/target/helper-test2/build
    [mkdir] Created dir: /export/home/illsleyd/continuum/continuum-1.0.3/apps/continuum/working-directory/1/modules/integration/target/helper-test2/build/classes
    [mkdir] Created dir: /export/home/illsleyd/continuum/continuum-1.0.3/apps/continuum/working-directory/1/modules/integration/target/helper-test2/build/lib
    [mkdir] Created dir: /export/home/illsleyd/continuum/continuum-1.0.3/apps/continuum/working-directory/1/modules/integration/target/helper-test2/test
    [echo] Stax Availability= true
    [echo] Axis2 Availability= true
    [javac] Compiling 8 source files to /export/home/illsleyd/continuum/continuum-1.0.3/apps/continuum/working-directory/1/modules/integration/target/helper-test2/build/classes
    [javac] Note: Some input files use unchecked or unsafe operations.
    [javac] Note: Recompile with -Xlint:unchecked for details.
    [jar] Building jar: /export/home/illsleyd/continuum/continuum-1.0.3/apps/continuum/working-directory/1/modules/integration/target/helper-test2/build/lib/Services-test-client.jar
    [echo] Running codegen for Enterprise WSDL - take 1
    [java] log4j:WARN No appenders could be found for logger (org.apache.axis2.description.WSDL11ToAllAxisServicesBuilder).
    [java] log4j:WARN Please initialize the log4j system properly.
    [mkdir] Created dir: /export/home/illsleyd/continuum/continuum-1.0.3/apps/continuum/working-directory/1/modules/integration/target/enterprise-test1/build
    [mkdir] Created dir: /export/home/illsleyd/continuum/continuum-1.0.3/apps/continuum/working-directory/1/modules/integration/target/enterprise-test1/build/classes
    [mkdir] Created dir: /export/home/illsleyd/continuum/continuum-1.0.3/apps/continuum/working-directory/1/modules/integration/target/enterprise-test1/build/lib
    [mkdir] Created dir: /export/home/illsleyd/continuum/continuum-1.0.3/apps/continuum/working-directory/1/modules/integration/target/enterprise-test1/test
    [jar] Building jar: /export/home/illsleyd/continuum/continuum-1.0.3/apps/continuum/working-directory/1/modules/integration/target/enterprise-test1/build/lib/XBeans-packaged.jar
    [echo] XmlBeans Availability = true
    [echo] Stax Availability= true
    [echo] Axis2 Availability= true
    [javac] Compiling 740 source files to /export/home/illsleyd/continuum/continuum-1.0.3/apps/continuum/working-directory/1/modules/integration/target/enterprise-test1/build/classes
    [javac] Note: Some input files use or override a deprecated API.
    [javac] Note: Recompile with -Xlint:deprecation for details.
    [javac] Note: Some input files use unchecked or unsafe operations.
    [javac] Note: Recompile with -Xlint:unchecked for details.
    [jar] Building jar: /export/home/illsleyd/continuum/continuum-1.0.3/apps/continuum/working-directory/1/modules/integration/target/enterprise-test1/build/lib/SforceService-test-client.jar
    [echo] Running codegen for Enterprise WSDL - take 2
    [java] log4j:WARN No appenders could be found for logger (org.apache.axis2.description.WSDL11ToAllAxisServicesBuilder).
    [java] log4j:WARN Please initialize the log4j system properly.
    [mkdir] Created dir: /export/home/illsleyd/continuum/continuum-1.0.3/apps/continuum/working-directory/1/modules/integration/target/enterprise-test2/build
    [mkdir] Created dir: /export/home/illsleyd/continuum/continuum-1.0.3/apps/continuum/working-directory/1/modules/integration/target/enterprise-test2/build/classes
    [mkdir] Created dir: /export/home/illsleyd/continuum/continuum-1.0.3/apps/continuum/working-directory/1/modules/integration/target/enterprise-test2/build/lib
    [mkdir] Created dir: /export/home/illsleyd/continuum/continuum-1.0.3/apps/continuum/working-directory/1/modules/integration/target/enterprise-test2/test
    [echo] Stax Availability= true
    [echo] Axis2 Availability= true
    [javac] Compiling 10 source files to /export/home/illsleyd/continuum/continuum-1.0.3/apps/continuum/working-directory/1/modules/integration/target/enterprise-test2/build/classes
    [javac] Note: /export/home/illsleyd/continuum/continuum-1.0.3/apps/continuum/working-directory/1/modules/integration/target/enterprise-test2/src/com/sforce/soap/enterprise/SforceServiceSoapStub.java uses unchecked or unsafe operations.
    [javac] Note: Recompile with -Xlint:unchecked for details.
    [jar] Building jar: /export/home/illsleyd/continuum/continuum-1.0.3/apps/continuum/working-directory/1/modules/integration/target/enterprise-test2/build/lib/Services-test-client.jar
    [echo] Running codegen for Enterprise WSDL - take 3
    [java] log4j:WARN No appenders could be found for logger (org.apache.axis2.description.WSDL11ToAllAxisServicesBuilder).
    [java] log4j:WARN Please initialize the log4j system properly.
    [mkdir] Created dir: /export/home/illsleyd/continuum/continuum-1.0.3/apps/continuum/working-directory/1/modules/integration/target/enterprise-test3/build
    [mkdir] Created dir: /export/home/illsleyd/continuum/continuum-1.0.3/apps/continuum/working-directory/1/modules/integration/target/enterprise-test3/build/classes
    [mkdir] Created dir: /export/home/illsleyd/continuum/continuum-1.0.3/apps/continuum/working-directory/1/modules/integration/target/enterprise-test3/build/lib
    [mkdir] Created dir: /export/home/illsleyd/continuum/continuum-1.0.3/apps/continuum/working-directory/1/modules/integration/target/enterprise-test3/test
    [jar] Building jar: /export/home/illsleyd/continuum/continuum-1.0.3/apps/continuum/working-directory/1/modules/integration/target/enterprise-test3/build/lib/XBeans-packaged.jar
    [echo] XmlBeans Availability = true
    [echo] Stax Availability= true
    [echo] Axis2 Availability= true
    [javac] Compiling 742 source files to /export/home/illsleyd/continuum/continuum-1.0.3/apps/continuum/working-directory/1/modules/integration/target/enterprise-test3/build/classes
    [javac] Note: Some input files use or override a deprecated API.
    [javac] Note: Recompile with -Xlint:deprecation for details.
    [javac] Note: Some input files use unchecked or unsafe operations.
    [javac] Note: Recompile with -Xlint:unchecked for details.
    [copy] Copying 2 files to /export/home/illsleyd/continuum/continuum-1.0.3/apps/continuum/working-directory/1/modules/integration/target/enterprise-test3/build/classes/META-INF
    [copy] Copying 1 file to /export/home/illsleyd/continuum/continuum-1.0.3/apps/continuum/working-directory/1/modules/integration/target/enterprise-test3/build/classes/lib
    [jar] Building jar: /export/home/illsleyd/continuum/continuum-1.0.3/apps/continuum/working-directory/1/modules/integration/target/enterprise-test3/build/lib/SforceService.aar
    [echo] Running codegen for Enterprise WSDL - take 4
    [java] log4j:WARN No appenders could be found for logger (org.apache.axis2.description.WSDL11ToAllAxisServicesBuilder).
    [java] log4j:WARN Please initialize the log4j system properly.
    [mkdir] Created dir: /export/home/illsleyd/continuum/continuum-1.0.3/apps/continuum/working-directory/1/modules/integration/target/enterprise-test4/build
    [mkdir] Created dir: /export/home/illsleyd/continuum/continuum-1.0.3/apps/continuum/working-directory/1/modules/integration/target/enterprise-test4/build/classes
    [mkdir] Created dir: /export/home/illsleyd/continuum/continuum-1.0.3/apps/continuum/working-directory/1/modules/integration/target/enterprise-test4/build/lib
    [mkdir] Created dir: /export/home/illsleyd/continuum/continuum-1.0.3/apps/continuum/working-directory/1/modules/integration/target/enterprise-test4/test
    [jar] Building jar: /export/home/illsleyd/continuum/continuum-1.0.3/apps/continuum/working-directory/1/modules/integration/target/enterprise-test4/build/lib/XBeans-packaged.jar
    [echo] XmlBeans Availability = true
    [echo] Stax Availability= true
    [echo] Axis2 Availability= true
    [javac] Compiling 742 source files to /export/home/illsleyd/continuum/continuum-1.0.3/apps/continuum/working-directory/1/modules/integration/target/enterprise-test4/build/classes
    [javac] Note: Some input files use or override a deprecated API.
    [javac] Note: Recompile with -Xlint:deprecation for details.
    [javac] Note: Some input files use unchecked or unsafe operations.
    [javac] Note: Recompile with -Xlint:unchecked for details.
    [copy] Copying 2 files to /export/home/illsleyd/continuum/continuum-1.0.3/apps/continuum/working-directory/1/modules/integration/target/enterprise-test4/build/classes/META-INF
    [copy] Copying 1 file to /export/home/illsleyd/continuum/continuum-1.0.3/apps/continuum/working-directory/1/modules/integration/target/enterprise-test4/build/classes/lib
    [jar] Building jar: /export/home/illsleyd/continuum/continuum-1.0.3/apps/continuum/working-directory/1/modules/integration/target/enterprise-test4/build/lib/SforceService.aar
    [echo] Running codegen for eBaySvc WSDL
    [java] log4j:WARN No appenders could be found for logger (org.apache.axis2.description.WSDL11ToAllAxisServicesBuilder).
    [java] log4j:WARN Please initialize the log4j system properly.
    [mkdir] Created dir: /export/home/illsleyd/continuum/continuum-1.0.3/apps/continuum/working-directory/1/modules/integration/target/eBaySvc/build
    [mkdir] Created dir: /export/home/illsleyd/continuum/continuum-1.0.3/apps/continuum/working-directory/1/modules/integration/target/eBaySvc/build/classes
    [mkdir] Created dir: /export/home/illsleyd/continuum/continuum-1.0.3/apps/continuum/working-directory/1/modules/integration/target/eBaySvc/build/lib
    [echo] Stax Availability= true
    [echo] Axis2 Availability= true
    [javac] Compiling 1016 source files to /export/home/illsleyd/continuum/continuum-1.0.3/apps/continuum/working-directory/1/modules/integration/target/eBaySvc/build/classes
    [javac] Note: Some input files use unchecked or unsafe operations.
    [javac] Note: Recompile with -Xlint:unchecked for details.
    [copy] Copying 2 files to /export/home/illsleyd/continuum/continuum-1.0.3/apps/continuum/working-directory/1/modules/integration/target/eBaySvc/build/classes/META-INF
    [jar] Building jar: /export/home/illsleyd/continuum/continuum-1.0.3/apps/continuum/working-directory/1/modules/integration/target/eBaySvc/build/lib/Services.aar
    [echo] Running codegen for eBaySvc WSDL Back word compatibiliy
    [java] log4j:WARN No appenders could be found for logger (org.apache.axis2.description.WSDL11ToAllAxisServicesBuilder).
    [java] log4j:WARN Please initialize the log4j system properly.
    [mkdir] Created dir: /export/home/illsleyd/continuum/continuum-1.0.3/apps/continuum/working-directory/1/modules/integration/target/eBaySvcB/build
    [mkdir] Created dir: /export/home/illsleyd/continuum/continuum-1.0.3/apps/continuum/working-directory/1/modules/integration/target/eBaySvcB/build/classes
    [mkdir] Created dir: /export/home/illsleyd/continuum/continuum-1.0.3/apps/continuum/working-directory/1/modules/integration/target/eBaySvcB/build/lib
    [echo] Stax Availability= true
    [echo] Axis2 Availability= true
    [javac] Compiling 1015 source files to /export/home/illsleyd/continuum/continuum-1.0.3/apps/continuum/working-directory/1/modules/integration/target/eBaySvcB/build/classes
    [javac] Note: Some input files use unchecked or unsafe operations.
    [javac] Note: Recompile with -Xlint:unchecked for details.
    [copy] Copying 2 files to /export/home/illsleyd/continuum/continuum-1.0.3/apps/continuum/working-directory/1/modules/integration/target/eBaySvcB/build/classes/META-INF
    [jar] Building jar: /export/home/illsleyd/continuum/continuum-1.0.3/apps/continuum/working-directory/1/modules/integration/target/eBaySvcB/build/lib/Services.aar
    [echo] Running codegen for eBaySvc WSDL with un wrapping 
    [java] log4j:WARN No appenders could be found for logger (org.apache.axis2.description.WSDL11ToAllAxisServicesBuilder).
    [java] log4j:WARN Please initialize the log4j system properly.
    [mkdir] Created dir: /export/home/illsleyd/continuum/continuum-1.0.3/apps/continuum/working-directory/1/modules/integration/target/eBaySvcUW/build
    [mkdir] Created dir: /export/home/illsleyd/continuum/continuum-1.0.3/apps/continuum/working-directory/1/modules/integration/target/eBaySvcUW/build/classes
    [mkdir] Created dir: /export/home/illsleyd/continuum/continuum-1.0.3/apps/continuum/working-directory/1/modules/integration/target/eBaySvcUW/build/lib
    [echo] Stax Availability= true
    [echo] Axis2 Availability= true
    [javac] Compiling 1016 source files to /export/home/illsleyd/continuum/continuum-1.0.3/apps/continuum/working-directory/1/modules/integration/target/eBaySvcUW/build/classes
    [javac] Note: Some input files use unchecked or unsafe operations.
    [javac] Note: Recompile with -Xlint:unchecked for details.
    [copy] Copying 2 files to /export/home/illsleyd/continuum/continuum-1.0.3/apps/continuum/working-directory/1/modules/integration/target/eBaySvcUW/build/classes/META-INF
    [jar] Building jar: /export/home/illsleyd/continuum/continuum-1.0.3/apps/continuum/working-directory/1/modules/integration/target/eBaySvcUW/build/lib/Services.aar
    [javac] Compiling 106 source files to /export/home/illsleyd/continuum/continuum-1.0.3/apps/continuum/working-directory/1/modules/integration/target/test-classes
    [javac] Note: /export/home/illsleyd/continuum/continuum-1.0.3/apps/continuum/working-directory/1/modules/integration/test/org/apache/axis2/engine/MessageContextInjectionTest.java uses or overrides a deprecated API.
    [javac] Note: Recompile with -Xlint:deprecation for details.
Running post goal: test:compile
    [mkdir] Created dir: /export/home/illsleyd/continuum/continuum-1.0.3/apps/continuum/working-directory/1/modules/integration/target/test-resources/samples/modules
    [mkdir] Created dir: /export/home/illsleyd/continuum/continuum-1.0.3/apps/continuum/working-directory/1/modules/integration/target/test-resources/samples/conf
    [mkdir] Created dir: /export/home/illsleyd/continuum/continuum-1.0.3/apps/continuum/working-directory/1/modules/integration/target/test-resources/repository-client/modules
    [mkdir] Created dir: /export/home/illsleyd/continuum/continuum-1.0.3/apps/continuum/working-directory/1/modules/integration/target/test-resources/repository-client/conf
    [copy] Copying 1 file to /export/home/illsleyd/continuum/continuum-1.0.3/apps/continuum/working-directory/1/modules/integration/target/test-resources/samples/modules
    [copy] Copying 1 file to /export/home/illsleyd/continuum/continuum-1.0.3/apps/continuum/working-directory/1/modules/integration/target/test-resources/samples/conf
    [copy] Copying 1 file to /export/home/illsleyd/continuum/continuum-1.0.3/apps/continuum/working-directory/1/modules/integration/target/test-resources/repository-client/modules
    [copy] Copying 1 file to /export/home/illsleyd/continuum/continuum-1.0.3/apps/continuum/working-directory/1/modules/integration/target/test-resources/repository-client/conf
    [mkdir] Created dir: /export/home/illsleyd/continuum/continuum-1.0.3/apps/continuum/working-directory/1/modules/integration/target/toWar/services
    [mkdir] Created dir: /export/home/illsleyd/continuum/continuum-1.0.3/apps/continuum/working-directory/1/modules/integration/target/test-resources/chunking-enabledRepository
    [mkdir] Created dir: /export/home/illsleyd/continuum/continuum-1.0.3/apps/continuum/working-directory/1/modules/integration/target/test-resources/chunking-enabledRepository/conf
    [copy] Copying 1 file to /export/home/illsleyd/continuum/continuum-1.0.3/apps/continuum/working-directory/1/modules/integration/target/test-resources/chunking-enabledRepository/conf
    [mkdir] Created dir: /export/home/illsleyd/continuum/continuum-1.0.3/apps/continuum/working-directory/1/modules/integration/target/test-resources/chunking-disabledRepository
    [mkdir] Created dir: /export/home/illsleyd/continuum/continuum-1.0.3/apps/continuum/working-directory/1/modules/integration/target/test-resources/chunking-disabledRepository/conf
    [copy] Copying 1 file to /export/home/illsleyd/continuum/continuum-1.0.3/apps/continuum/working-directory/1/modules/integration/target/test-resources/chunking-disabledRepository/conf
    [mkdir] Created dir: /export/home/illsleyd/continuum/continuum-1.0.3/apps/continuum/working-directory/1/modules/integration/target/test-resources/jms-enabled-server-repository
    [mkdir] Created dir: /export/home/illsleyd/continuum/continuum-1.0.3/apps/continuum/working-directory/1/modules/integration/target/test-resources/jms-enabled-server-repository/conf
    [mkdir] Created dir: /export/home/illsleyd/continuum/continuum-1.0.3/apps/continuum/working-directory/1/modules/integration/target/test-resources/jms-enabled-server-repository/modules
    [copy] Copying 1 file to /export/home/illsleyd/continuum/continuum-1.0.3/apps/continuum/working-directory/1/modules/integration/target/test-resources/jms-enabled-server-repository/conf
    [copy] Copying 1 file to /export/home/illsleyd/continuum/continuum-1.0.3/apps/continuum/working-directory/1/modules/integration/target/test-resources/jms-enabled-server-repository/modules
    [mkdir] Created dir: /export/home/illsleyd/continuum/continuum-1.0.3/apps/continuum/working-directory/1/modules/integration/target/test-resources/jms-enabled-client-repository
    [mkdir] Created dir: /export/home/illsleyd/continuum/continuum-1.0.3/apps/continuum/working-directory/1/modules/integration/target/test-resources/jms-enabled-client-repository/conf
    [mkdir] Created dir: /export/home/illsleyd/continuum/continuum-1.0.3/apps/continuum/working-directory/1/modules/integration/target/test-resources/jms-enabled-client-repository/modules
    [copy] Copying 1 file to /export/home/illsleyd/continuum/continuum-1.0.3/apps/continuum/working-directory/1/modules/integration/target/test-resources/jms-enabled-client-repository/conf
    [copy] Copying 1 file to /export/home/illsleyd/continuum/continuum-1.0.3/apps/continuum/working-directory/1/modules/integration/target/test-resources/jms-enabled-client-repository/modules
    [mkdir] Created dir: /export/home/illsleyd/continuum/continuum-1.0.3/apps/continuum/working-directory/1/modules/integration/target/test-resources/mail-transport-client-enabledRepository
    [mkdir] Created dir: /export/home/illsleyd/continuum/continuum-1.0.3/apps/continuum/working-directory/1/modules/integration/target/test-resources/mail-transport-client-enabledRepository/conf
    [mkdir] Created dir: /export/home/illsleyd/continuum/continuum-1.0.3/apps/continuum/working-directory/1/modules/integration/target/test-resources/mail-transport-client-enabledRepository/modules
    [copy] Copying 1 file to /export/home/illsleyd/continuum/continuum-1.0.3/apps/continuum/working-directory/1/modules/integration/target/test-resources/mail-transport-client-enabledRepository/conf
    [copy] Copying 1 file to /export/home/illsleyd/continuum/continuum-1.0.3/apps/continuum/working-directory/1/modules/integration/target/test-resources/mail-transport-client-enabledRepository/modules
    [mkdir] Created dir: /export/home/illsleyd/continuum/continuum-1.0.3/apps/continuum/working-directory/1/modules/integration/target/test-resources/mail-transport-server-enabledRepository
    [mkdir] Created dir: /export/home/illsleyd/continuum/continuum-1.0.3/apps/continuum/working-directory/1/modules/integration/target/test-resources/mail-transport-server-enabledRepository/conf
    [mkdir] Created dir: /export/home/illsleyd/continuum/continuum-1.0.3/apps/continuum/working-directory/1/modules/integration/target/test-resources/mail-transport-server-enabledRepository/modules
    [copy] Copying 1 file to /export/home/illsleyd/continuum/continuum-1.0.3/apps/continuum/working-directory/1/modules/integration/target/test-resources/mail-transport-server-enabledRepository/conf
    [copy] Copying 1 file to /export/home/illsleyd/continuum/continuum-1.0.3/apps/continuum/working-directory/1/modules/integration/target/test-resources/mail-transport-server-enabledRepository/modules
    [mkdir] Created dir: /export/home/illsleyd/continuum/continuum-1.0.3/apps/continuum/working-directory/1/modules/integration/target/test-resources/MessageContextInjectionRepo
    [mkdir] Created dir: /export/home/illsleyd/continuum/continuum-1.0.3/apps/continuum/working-directory/1/modules/integration/target/test-resources/integrationRepo/modules
    [mkdir] Created dir: /export/home/illsleyd/continuum/continuum-1.0.3/apps/continuum/working-directory/1/modules/integration/target/test-resources/integrationRepo/conf
    [copy] Copying 1 file to /export/home/illsleyd/continuum/continuum-1.0.3/apps/continuum/working-directory/1/modules/integration/target/test-resources/integrationRepo/modules
    [copy] Copying 1 file to /export/home/illsleyd/continuum/continuum-1.0.3/apps/continuum/working-directory/1/modules/integration/target/test-resources/integrationRepo/conf
    [mkdir] Created dir: /export/home/illsleyd/continuum/continuum-1.0.3/apps/continuum/working-directory/1/modules/integration/target/test-resources/commons-http-enabledRepository
    [mkdir] Created dir: /export/home/illsleyd/continuum/continuum-1.0.3/apps/continuum/working-directory/1/modules/integration/target/test-resources/commons-http-enabledRepository/conf
    [copy] Copying 1 file to /export/home/illsleyd/continuum/continuum-1.0.3/apps/continuum/working-directory/1/modules/integration/target/test-resources/commons-http-enabledRepository/conf
    [mkdir] Created dir: /export/home/illsleyd/continuum/continuum-1.0.3/apps/continuum/working-directory/1/modules/integration/target/test-resources/MTOM-enabledRepository
    [mkdir] Created dir: /export/home/illsleyd/continuum/continuum-1.0.3/apps/continuum/working-directory/1/modules/integration/target/test-resources/MTOM-enabledRepository/conf
    [mkdir] Created dir: /export/home/illsleyd/continuum/continuum-1.0.3/apps/continuum/working-directory/1/modules/integration/target/test-resources/MTOM-enabledRepository/modules
    [copy] Copying 1 file to /export/home/illsleyd/continuum/continuum-1.0.3/apps/continuum/working-directory/1/modules/integration/target/test-resources/MTOM-enabledRepository/conf
    [copy] Copying 1 file to /export/home/illsleyd/continuum/continuum-1.0.3/apps/continuum/working-directory/1/modules/integration/target/test-resources/MTOM-enabledRepository/modules
    [mkdir] Created dir: /export/home/illsleyd/continuum/continuum-1.0.3/apps/continuum/working-directory/1/modules/integration/target/test-resources/MTOM-fileCache-enabledRepository
    [mkdir] Created dir: /export/home/illsleyd/continuum/continuum-1.0.3/apps/continuum/working-directory/1/modules/integration/target/test-resources/MTOM-fileCache-enabledRepository/conf
    [copy] Copying 1 file to /export/home/illsleyd/continuum/continuum-1.0.3/apps/continuum/working-directory/1/modules/integration/target/test-resources/MTOM-fileCache-enabledRepository/conf
    [copy] Copying 1 file to /export/home/illsleyd/continuum/continuum-1.0.3/apps/continuum/working-directory/1/modules/integration/target/test-resources/MTOM-fileCache-enabledRepository/modules
    [mkdir] Created dir: /export/home/illsleyd/continuum/continuum-1.0.3/apps/continuum/working-directory/1/modules/integration/target/test-resources/SwA-enabledRepository
    [mkdir] Created dir: /export/home/illsleyd/continuum/continuum-1.0.3/apps/continuum/working-directory/1/modules/integration/target/test-resources/SwA-enabledRepository/conf
    [copy] Copying 1 file to /export/home/illsleyd/continuum/continuum-1.0.3/apps/continuum/working-directory/1/modules/integration/target/test-resources/SwA-enabledRepository/conf
    [copy] Copying 1 file to /export/home/illsleyd/continuum/continuum-1.0.3/apps/continuum/working-directory/1/modules/integration/target/test-resources/SwA-enabledRepository/modules
    [mkdir] Created dir: /export/home/illsleyd/continuum/continuum-1.0.3/apps/continuum/working-directory/1/modules/integration/target/test-resources/SwA-fileCache-enabledRepository
    [mkdir] Created dir: /export/home/illsleyd/continuum/continuum-1.0.3/apps/continuum/working-directory/1/modules/integration/target/test-resources/SwA-fileCache-enabledRepository/conf
    [copy] Copying 1 file to /export/home/illsleyd/continuum/continuum-1.0.3/apps/continuum/working-directory/1/modules/integration/target/test-resources/SwA-fileCache-enabledRepository/conf
    [copy] Copying 1 file to /export/home/illsleyd/continuum/continuum-1.0.3/apps/continuum/working-directory/1/modules/integration/target/test-resources/SwA-fileCache-enabledRepository/modules
    [mkdir] Created dir: /export/home/illsleyd/continuum/continuum-1.0.3/apps/continuum/working-directory/1/modules/integration/target/groovyRepo
    [mkdir] Created dir: /export/home/illsleyd/continuum/continuum-1.0.3/apps/continuum/working-directory/1/modules/integration/target/groovyRepo/conf
    [mkdir] Created dir: /export/home/illsleyd/continuum/continuum-1.0.3/apps/continuum/working-directory/1/modules/integration/target/groovyRepo/services
    [mkdir] Created dir: /export/home/illsleyd/continuum/continuum-1.0.3/apps/continuum/working-directory/1/modules/integration/target/groovyRepo/modules
    [copy] Copying 1 file to /export/home/illsleyd/continuum/continuum-1.0.3/apps/continuum/working-directory/1/modules/integration/target/groovyRepo/services
    [copy] Copying 1 file to /export/home/illsleyd/continuum/continuum-1.0.3/apps/continuum/working-directory/1/modules/integration/target/groovyRepo/modules
    [copy] Copying 1 file to /export/home/illsleyd/continuum/continuum-1.0.3/apps/continuum/working-directory/1/modules/integration/target/groovyRepo/conf
    [mkdir] Created dir: /export/home/illsleyd/continuum/continuum-1.0.3/apps/continuum/working-directory/1/modules/integration/target/test-resources/spring
    [copy] Copying 1 file to /export/home/illsleyd/continuum/continuum-1.0.3/apps/continuum/working-directory/1/modules/integration/target/test-classes/spring
    [mkdir] Created dir: /export/home/illsleyd/continuum/continuum-1.0.3/apps/continuum/working-directory/1/modules/integration/target/test-resources/deployment_repo
    [mkdir] Created dir: /export/home/illsleyd/continuum/continuum-1.0.3/apps/continuum/working-directory/1/modules/integration/target/test-resources/deployment_repo/conf
    [mkdir] Created dir: /export/home/illsleyd/continuum/continuum-1.0.3/apps/continuum/working-directory/1/modules/integration/target/test-resources/deployment_repo/services
    [mkdir] Created dir: /export/home/illsleyd/continuum/continuum-1.0.3/apps/continuum/working-directory/1/modules/integration/target/test-resources/deployment_repo/modules
    [copy] Copying 1 file to /export/home/illsleyd/continuum/continuum-1.0.3/apps/continuum/working-directory/1/modules/integration/target/test-resources/deployment_repo/conf
    [copy] Copying 1 file to /export/home/illsleyd/continuum/continuum-1.0.3/apps/continuum/working-directory/1/modules/integration/target/test-resources/deployment_repo/modules
    [mkdir] Created dir: /export/home/illsleyd/continuum/continuum-1.0.3/apps/continuum/working-directory/1/modules/integration/target/Repository
    [mkdir] Created dir: /export/home/illsleyd/continuum/continuum-1.0.3/apps/continuum/working-directory/1/modules/integration/target/Repository/conf
    [mkdir] Created dir: /export/home/illsleyd/continuum/continuum-1.0.3/apps/continuum/working-directory/1/modules/integration/target/Repository/services
    [mkdir] Created dir: /export/home/illsleyd/continuum/continuum-1.0.3/apps/continuum/working-directory/1/modules/integration/target/Repository/modules
    [copy] Copying 1 file to /export/home/illsleyd/continuum/continuum-1.0.3/apps/continuum/working-directory/1/modules/integration/target/Repository/modules
    [copy] Copying 1 file to /export/home/illsleyd/continuum/continuum-1.0.3/apps/continuum/working-directory/1/modules/integration/target/Repository/conf
    [mkdir] Created dir: /export/home/illsleyd/continuum/continuum-1.0.3/apps/continuum/working-directory/1/modules/integration/target/perf2/build/repo/conf
    [mkdir] Created dir: /export/home/illsleyd/continuum/continuum-1.0.3/apps/continuum/working-directory/1/modules/integration/target/perf/build/repo/conf
    [copy] Copying 1 file to /export/home/illsleyd/continuum/continuum-1.0.3/apps/continuum/working-directory/1/modules/integration/target/perf2/build/repo/conf
    [copy] Copying 1 file to /export/home/illsleyd/continuum/continuum-1.0.3/apps/continuum/working-directory/1/modules/integration/target/perf/build/repo/conf
    [mkdir] Created dir: /export/home/illsleyd/continuum/continuum-1.0.3/apps/continuum/working-directory/1/modules/integration/target/perf2/build/repo/modules
    [copy] Copying 1 file to /export/home/illsleyd/continuum/continuum-1.0.3/apps/continuum/working-directory/1/modules/integration/target/perf2/build/repo/modules
    [mkdir] Created dir: /export/home/illsleyd/continuum/continuum-1.0.3/apps/continuum/working-directory/1/modules/integration/target/perf/build/repo/modules
    [copy] Copying 1 file to /export/home/illsleyd/continuum/continuum-1.0.3/apps/continuum/working-directory/1/modules/integration/target/perf/build/repo/modules
    [echo] the files are up to date = ${jars.uptodate}
    [mkdir] Created dir: /export/home/illsleyd/continuum/continuum-1.0.3/apps/continuum/working-directory/1/modules/integration/test-resources/SOAP12Testing/SOAP12TestModuleB/build/classes
    [mkdir] Created dir: /export/home/illsleyd/continuum/continuum-1.0.3/apps/continuum/working-directory/1/modules/integration/test-resources/SOAP12Testing/SOAP12TestModuleB/build/lib
    [javac] Compiling 4 source files to /export/home/illsleyd/continuum/continuum-1.0.3/apps/continuum/working-directory/1/modules/integration/test-resources/SOAP12Testing/SOAP12TestModuleB/build/classes
    [javac] Note: /export/home/illsleyd/continuum/continuum-1.0.3/apps/continuum/working-directory/1/modules/integration/test-resources/SOAP12Testing/SOAP12TestModuleB/org/apache/axis2/soap12testing/handlers/SOAP12InFlowHandlerDefaultB.java uses or overrides a deprecated API.
    [javac] Note: Recompile with -Xlint:deprecation for details.
    [copy] Copying 1 file to /export/home/illsleyd/continuum/continuum-1.0.3/apps/continuum/working-directory/1/modules/integration/test-resources/SOAP12Testing/SOAP12TestModuleB/build/classes/META-INF
    [jar] Building jar: /export/home/illsleyd/continuum/continuum-1.0.3/apps/continuum/working-directory/1/modules/integration/target/Repository/modules/SOAP12TestModuleB.jar
    [delete] Deleting directory /export/home/illsleyd/continuum/continuum-1.0.3/apps/continuum/working-directory/1/modules/integration/test-resources/SOAP12Testing/SOAP12TestModuleB/build
    [echo] the files are up to date = ${jars.uptodate}
    [mkdir] Created dir: /export/home/illsleyd/continuum/continuum-1.0.3/apps/continuum/working-directory/1/modules/integration/test-resources/SOAP12Testing/SOAP12TestModuleC/build/classes
    [mkdir] Created dir: /export/home/illsleyd/continuum/continuum-1.0.3/apps/continuum/working-directory/1/modules/integration/test-resources/SOAP12Testing/SOAP12TestModuleC/build/lib
    [javac] Compiling 4 source files to /export/home/illsleyd/continuum/continuum-1.0.3/apps/continuum/working-directory/1/modules/integration/test-resources/SOAP12Testing/SOAP12TestModuleC/build/classes
    [javac] Note: /export/home/illsleyd/continuum/continuum-1.0.3/apps/continuum/working-directory/1/modules/integration/test-resources/SOAP12Testing/SOAP12TestModuleC/org/apache/axis2/soap12testing/handlers/SOAP12InFlowHandlerDefaultC.java uses or overrides a deprecated API.
    [javac] Note: Recompile with -Xlint:deprecation for details.
    [copy] Copying 1 file to /export/home/illsleyd/continuum/continuum-1.0.3/apps/continuum/working-directory/1/modules/integration/test-resources/SOAP12Testing/SOAP12TestModuleC/build/classes/META-INF
    [jar] Building jar: /export/home/illsleyd/continuum/continuum-1.0.3/apps/continuum/working-directory/1/modules/integration/target/Repository/modules/SOAP12TestModuleC.jar
    [delete] Deleting directory /export/home/illsleyd/continuum/continuum-1.0.3/apps/continuum/working-directory/1/modules/integration/test-resources/SOAP12Testing/SOAP12TestModuleC/build
    [echo] the files are up to date = ${jars.uptodate}
    [mkdir] Created dir: /export/home/illsleyd/continuum/continuum-1.0.3/apps/continuum/working-directory/1/modules/integration/test-resources/SOAP12Testing/SOAP12TestServiceB/build/classes
    [mkdir] Created dir: /export/home/illsleyd/continuum/continuum-1.0.3/apps/continuum/working-directory/1/modules/integration/test-resources/SOAP12Testing/SOAP12TestServiceB/build/lib
    [javac] Compiling 1 source file to /export/home/illsleyd/continuum/continuum-1.0.3/apps/continuum/working-directory/1/modules/integration/test-resources/SOAP12Testing/SOAP12TestServiceB/build/classes
    [copy] Copying 1 file to /export/home/illsleyd/continuum/continuum-1.0.3/apps/continuum/working-directory/1/modules/integration/test-resources/SOAP12Testing/SOAP12TestServiceB/build/classes/META-INF
    [jar] Building jar: /export/home/illsleyd/continuum/continuum-1.0.3/apps/continuum/working-directory/1/modules/integration/target/Repository/services/SOAP12TestServiceB.jar
    [delete] Deleting directory /export/home/illsleyd/continuum/continuum-1.0.3/apps/continuum/working-directory/1/modules/integration/test-resources/SOAP12Testing/SOAP12TestServiceB/build
    [echo] the files are up to date = ${jars.uptodate}
    [mkdir] Created dir: /export/home/illsleyd/continuum/continuum-1.0.3/apps/continuum/working-directory/1/modules/integration/test-resources/SOAP12Testing/SOAP12TestServiceC/build/classes
    [mkdir] Created dir: /export/home/illsleyd/continuum/continuum-1.0.3/apps/continuum/working-directory/1/modules/integration/test-resources/SOAP12Testing/SOAP12TestServiceC/build/lib
    [javac] Compiling 1 source file to /export/home/illsleyd/continuum/continuum-1.0.3/apps/continuum/working-directory/1/modules/integration/test-resources/SOAP12Testing/SOAP12TestServiceC/build/classes
    [copy] Copying 1 file to /export/home/illsleyd/continuum/continuum-1.0.3/apps/continuum/working-directory/1/modules/integration/test-resources/SOAP12Testing/SOAP12TestServiceC/build/classes/META-INF
    [jar] Building jar: /export/home/illsleyd/continuum/continuum-1.0.3/apps/continuum/working-directory/1/modules/integration/target/Repository/services/SOAP12TestServiceC.jar
    [delete] Deleting directory /export/home/illsleyd/continuum/continuum-1.0.3/apps/continuum/working-directory/1/modules/integration/test-resources/SOAP12Testing/SOAP12TestServiceC/build

    [junit] Running org.apache.axis2.addressing.AddressingFinalServiceTest
    [junit] Tests run: 4, Failures: 0, Errors: 0, Time elapsed: 7.473 sec
    [junit] Running org.apache.axis2.addressing.AddressingSubmissionServiceTest
    [junit] Tests run: 3, Failures: 0, Errors: 0, Time elapsed: 7.821 sec
    [junit] Running org.apache.axis2.addressing.MultiHopRedirectServiceTest
    [junit] Tests run: 1, Failures: 0, Errors: 0, Time elapsed: 7.337 sec
    [junit] Running org.apache.axis2.async.AsyncServiceTest
    [junit] Tests run: 1, Failures: 0, Errors: 0, Time elapsed: 7.84 sec
    [junit] Running org.apache.axis2.async.AsyncServiceWithTransportFailureTest
    [junit] Tests run: 1, Failures: 0, Errors: 0, Time elapsed: 7.794 sec
    [junit] Running org.apache.axis2.codegen.InvalidFaultWsdlTest
    [junit] Tests run: 1, Failures: 0, Errors: 0, Time elapsed: 1.727 sec
    [junit] Running org.apache.axis2.deployment.TargetResolverServiceTest
    [junit] Tests run: 1, Failures: 0, Errors: 0, Time elapsed: 7.704 sec
    [junit] Running org.apache.axis2.engine.CallUnregisteredServiceTest
    [junit] Tests run: 1, Failures: 0, Errors: 0, Time elapsed: 7.234 sec
    [junit] Running org.apache.axis2.engine.CharactersetEncodingTest
    [junit] Tests run: 11, Failures: 0, Errors: 0, Time elapsed: 8.065 sec
    [junit] Running org.apache.axis2.engine.CommonsHTTPEchoRawXMLTest
    [junit] Tests run: 2, Failures: 0, Errors: 0, Time elapsed: 7.773 sec
    [junit] Running org.apache.axis2.engine.EchoRawRuntimeProxyTest
    [junit] Tests run: 1, Failures: 0, Errors: 0, Time elapsed: 7.107 sec
    [junit] Running org.apache.axis2.engine.EchoRawXMLChunkedTest
    [junit] Tests run: 1, Failures: 0, Errors: 0, Time elapsed: 7.287 sec
    [junit] Running org.apache.axis2.engine.EchoRawXMLLoadTest
    [junit] Tests run: 1, Failures: 0, Errors: 0, Time elapsed: 7.644 sec
    [junit] Running org.apache.axis2.engine.EchoRawXMLMultipleASyncTest
    [junit] Tests run: 2, Failures: 0, Errors: 1, Time elapsed: 15.839 sec

BUILD FAILED
File...... file:/export/home/illsleyd/.maven/cache/maven-multiproject-plugin-1.5-SNAPSHOT/plugin.jelly
Element... maven:reactor
Line...... 227
Column.... 64
Unable to obtain goal [multiproject:install-callback] -- file:/export/home/illsleyd/.maven/cache/maven-test-plugin-1.8.1-SNAPSHOT/plugin.jelly:155:49: <junit> Test org.apache.axis2.engine.EchoRawXMLMultipleASyncTest failed
Total time   : 32 minutes 12 seconds 
Finished at  : Friday, March 16, 2007 10:02:51 PM GMT+00:00


****************************************************************************



---------------------------------------------------------------------
To unsubscribe, e-mail: axis-dev-unsubscribe@ws.apache.org
For additional commands, e-mail: axis-dev-help@ws.apache.org


Mime
View raw message