axis-java-dev mailing list archives

Site index · List index
Message view « Date » · « Thread »
Top « Date » · « Thread »
From "davidillsley (Continuum)" <davidills...@apache.org>
Subject [Apache Axis 2.0 - Root][continuum] BUILD FAILURE
Date Thu, 29 Mar 2007 09:54:17 GMT
Online report : http://ws.zones.apache.org:10000/continuum/servlet/continuum/target/ProjectBuild.vm/view/ProjectBuild/id/61/buildId/1647
Build statistics:
  State: Failed
  Previous State: Failed
  Started at: Thu, 29 Mar 2007 09:45:42 +0000
  Finished at: Thu, 29 Mar 2007 09:54:17 +0000
  Total time: 8m 35s
  Build Trigger: Schedule
  Exit code: 1
  Building machine hostname: ws.zones.apache.org
  Operating system : SunOS(unknown)
  Java version : 1.5.0_09(Sun Microsystems Inc.)

Changes
         amilas          add resource files to axis2-jaxbri jar file

             /webservices/axis2/trunk/java/modules/jaxbri/maven.xml
            /webservices/axis2/trunk/java/modules/jaxbri/project.xml
            /webservices/axis2/trunk/java/modules/xmlbeans/project.xml
           deepal          fixing getMyEPR();
- I found very funny thing , when I add a Constant to MessageContext then MessageContextChangeText
fails 
             /webservices/axis2/trunk/java/modules/kernel/src/org/apache/axis2/context/MessageContext.java
            /webservices/axis2/trunk/java/modules/kernel/src/org/apache/axis2/transport/http/HTTPWorker.java
            /webservices/axis2/trunk/java/modules/kernel/src/org/apache/axis2/transport/http/server/AxisHttpService.java
            /webservices/axis2/trunk/java/modules/kernel/src/org/apache/axis2/transport/http/server/DefaultHttpConnectionFactory.java
            /webservices/axis2/trunk/java/modules/kernel/test/org/apache/axis2/engine/MessageContextChangeTest.java
        
****************************************************************************
Output:
****************************************************************************
Snipped Output:
tp://schemas.xmlsoap.org/soap/envelope/"><soapenv:Header>
  <shw:Hello xmlns:shw="http://www.jcommerce.net/soap/ns/SOAPHelloWorld">
    <shw:Myname>Tony</shw:Myname>
  </shw:Hello>
 </soapenv:Header><soapenv:Body>
<shw:Address xmlns:shw="http://www.jcommerce.net/soap/ns/SOAPHelloWorld" shw:t="test">
<shw:City>GENT</shw:City>
</shw:Address>
</soapenv:Body></soapenv:Envelope><soapenv:Envelope xmlns:xsi="http://www.w3.org/2001/XMLSchema-instance"
xmlns:xsd="http://www.w3.org/2001/XMLSchema" xmlns:soapenv="http://schemas.xmlsoap.org/soap/envelope/"
xmlns="http://somewhere.com/html"><soapenv:Body>
    <echo><arg0>Hello</arg0></echo> </soapenv:Body></soapenv:Envelope><soapenv:Envelope
xmlns:xsi="http://www.w3.org/2001/XMLSchema-instance" xmlns:xsd="http://www.w3.org/2001/XMLSchema"
xmlns:soapenv="http://schemas.xmlsoap.org/soap/envelope/"><soapenv:Body>
<!-- Comment -->    <t:echo xmlns:t="http://test.org/Test"><t:arg0>Hello</t:arg0></t:echo>
</soapenv:Body></soapenv:Envelope><soapenv:Envelope xmlns:xsi="http://www.w3.org/2001/XMLSchema-instance"
xmlns:xsd="http://www.w3.org/2001/XMLSchema" xmlns:soapenv="http://schemas.xmlsoap.org/soap/envelope/"><soapenv:Header>
<!-- Comment -->  <shw:Hello xmlns:shw="http://www.jcommerce.net/soap/ns/SOAPHelloWorld">
<!-- Comment -->    <shw:Myname><!-- Comment -->Tony</shw:Myname>
  </shw:Hello>
 </soapenv:Header><soapenv:Body>
<!-- Comment -->    <t:echo xmlns:t="http://test.org/Test"><t:arg0>Hello</t:arg0></t:echo>
</soapenv:Body></soapenv:Envelope>[surefire] Tests run: 16, Failures: 0, Errors:
0, Time elapsed: 0.029 sec
[surefire] Running org.apache.axis2.saaj.SOAPElementTest
[surefire] Tests run: 18, Failures: 0, Errors: 0, Time elapsed: 0.011 sec
[surefire] Running org.apache.axis2.saaj.SOAPFactoryTest
Create a DOMElement
[surefire] Tests run: 9, Failures: 0, Errors: 0, Time elapsed: 0.007 sec
[surefire] Running org.apache.axis2.saaj.SAAJResultTest
[surefire] Tests run: 1, Failures: 0, Errors: 0, Time elapsed: 0.003 sec
[surefire] Running org.apache.axis2.saaj.SOAPFaultDetailTest
[surefire] Tests run: 1, Failures: 0, Errors: 0, Time elapsed: 0.005 sec
[INFO] [jar:jar]
[INFO] Building jar: /export/home/illsleyd/continuum/continuum-1.0.3/apps/continuum/working-directory/61/modules/saaj/target/axis2-saaj-SNAPSHOT.jar
[INFO] [install:install]
[INFO] Installing /export/home/illsleyd/continuum/continuum-1.0.3/apps/continuum/working-directory/61/modules/saaj/target/axis2-saaj-SNAPSHOT.jar
to /export/home/illsleyd/.m2/repository/org/apache/axis2/axis2-saaj/SNAPSHOT/axis2-saaj-SNAPSHOT.jar
[INFO] ----------------------------------------------------------------------------
[INFO] Building Apache Axis 2.0 - JAXWS API
[INFO]    task-segment: [clean, install]
[INFO] ----------------------------------------------------------------------------
[INFO] [clean:clean]
[INFO] Deleting directory /export/home/illsleyd/continuum/continuum-1.0.3/apps/continuum/working-directory/61/modules/jaxws-api/target
[INFO] Deleting directory /export/home/illsleyd/continuum/continuum-1.0.3/apps/continuum/working-directory/61/modules/jaxws-api/target/classes
[INFO] Deleting directory /export/home/illsleyd/continuum/continuum-1.0.3/apps/continuum/working-directory/61/modules/jaxws-api/target/test-classes
[INFO] [resources:resources]
[INFO] Using default encoding to copy filtered resources.
[INFO] [compiler:compile]
[INFO] Compiling 52 source files to /export/home/illsleyd/continuum/continuum-1.0.3/apps/continuum/working-directory/61/modules/jaxws-api/target/classes
[INFO] [resources:testResources]
[INFO] Using default encoding to copy filtered resources.
[INFO] [compiler:testCompile]
[INFO] No sources to compile
[INFO] [surefire:test]
[INFO] Tests are skipped.
[INFO] [jar:jar]
[INFO] Building jar: /export/home/illsleyd/continuum/continuum-1.0.3/apps/continuum/working-directory/61/modules/jaxws-api/target/axis2-jaxws-api-SNAPSHOT.jar
[INFO] [install:install]
[INFO] Installing /export/home/illsleyd/continuum/continuum-1.0.3/apps/continuum/working-directory/61/modules/jaxws-api/target/axis2-jaxws-api-SNAPSHOT.jar
to /export/home/illsleyd/.m2/repository/org/apache/axis2/axis2-jaxws-api/SNAPSHOT/axis2-jaxws-api-SNAPSHOT.jar
[INFO] ----------------------------------------------------------------------------
[INFO] Building Apache Axis 2.0 - Metadata
[INFO]    task-segment: [clean, install]
[INFO] ----------------------------------------------------------------------------
[INFO] [clean:clean]
[INFO] Deleting directory /export/home/illsleyd/continuum/continuum-1.0.3/apps/continuum/working-directory/61/modules/metadata/target
[INFO] Deleting directory /export/home/illsleyd/continuum/continuum-1.0.3/apps/continuum/working-directory/61/modules/metadata/target/classes
[INFO] Deleting directory /export/home/illsleyd/continuum/continuum-1.0.3/apps/continuum/working-directory/61/modules/metadata/target/test-classes
[INFO] [resources:resources]
[INFO] Using default encoding to copy filtered resources.
[INFO] [compiler:compile]
[INFO] Compiling 144 source files to /export/home/illsleyd/continuum/continuum-1.0.3/apps/continuum/working-directory/61/modules/metadata/target/classes
[INFO] [antrun:run {execution: gen-ts}]
[INFO] Executing tasks
    [mkdir] Created dir: /export/home/illsleyd/continuum/continuum-1.0.3/apps/continuum/working-directory/61/modules/metadata/target/schema
    [mkdir] Created dir: /export/home/illsleyd/continuum/continuum-1.0.3/apps/continuum/working-directory/61/modules/metadata/target/schema/src
    [mkdir] Created dir: /export/home/illsleyd/continuum/continuum-1.0.3/apps/continuum/working-directory/61/modules/metadata/target/schema/classes
     [echo] Generating JAX-B classes from XSDs
     [echo] Generating java from ProxyDocLitWrapped.wsdl
[INFO] Executed tasks
[INFO] [resources:testResources]
[INFO] Using default encoding to copy filtered resources.
[INFO] [build-helper:add-test-source {execution: add-test-source}]
[INFO] Test Source directory: /export/home/illsleyd/continuum/continuum-1.0.3/apps/continuum/working-directory/61/modules/metadata/target/schema/src
added.
[INFO] [compiler:testCompile]
[INFO] Compiling 42 source files to /export/home/illsleyd/continuum/continuum-1.0.3/apps/continuum/working-directory/61/modules/metadata/target/test-classes
[INFO] ------------------------------------------------------------------------
[ERROR] BUILD FAILURE
[INFO] ------------------------------------------------------------------------
[INFO] Compilation failure

/export/home/illsleyd/continuum/continuum-1.0.3/apps/continuum/working-directory/61/modules/metadata/test/org/apache/axis2/jaxws/description/AnnotationProviderImplDescriptionTests.java:[21,22]
package javax.xml.soap does not exist

/export/home/illsleyd/continuum/continuum-1.0.3/apps/continuum/working-directory/61/modules/metadata/test/org/apache/axis2/jaxws/description/AnnotationProviderImplDescriptionTests.java:[176,48]
cannot find symbol
symbol: class SOAPMessage
class BasicProviderTestImpl implements Provider<SOAPMessage> {

/export/home/illsleyd/continuum/continuum-1.0.3/apps/continuum/working-directory/61/modules/metadata/test/org/apache/axis2/jaxws/description/AnnotationProviderImplDescriptionTests.java:[178,30]
cannot find symbol
symbol  : class SOAPMessage
location: class org.apache.axis2.jaxws.description.BasicProviderTestImpl

/export/home/illsleyd/continuum/continuum-1.0.3/apps/continuum/working-directory/61/modules/metadata/test/org/apache/axis2/jaxws/description/AnnotationProviderImplDescriptionTests.java:[178,11]
cannot find symbol
symbol  : class SOAPMessage
location: class org.apache.axis2.jaxws.description.BasicProviderTestImpl

/export/home/illsleyd/continuum/continuum-1.0.3/apps/continuum/working-directory/61/modules/metadata/test/org/apache/axis2/jaxws/description/AnnotationProviderImplDescriptionTests.java:[228,55]
cannot find symbol
symbol: class SOAPMessage
class NoWebServiceProviderTestImpl implements Provider<SOAPMessage> {

/export/home/illsleyd/continuum/continuum-1.0.3/apps/continuum/working-directory/61/modules/metadata/test/org/apache/axis2/jaxws/description/AnnotationProviderImplDescriptionTests.java:[230,30]
cannot find symbol
symbol  : class SOAPMessage
location: class org.apache.axis2.jaxws.description.NoWebServiceProviderTestImpl

/export/home/illsleyd/continuum/continuum-1.0.3/apps/continuum/working-directory/61/modules/metadata/test/org/apache/axis2/jaxws/description/AnnotationProviderImplDescriptionTests.java:[230,11]
cannot find symbol
symbol  : class SOAPMessage
location: class org.apache.axis2.jaxws.description.NoWebServiceProviderTestImpl

/export/home/illsleyd/continuum/continuum-1.0.3/apps/continuum/working-directory/61/modules/metadata/test/org/apache/axis2/jaxws/description/AnnotationProviderImplDescriptionTests.java:[243,59]
cannot find symbol
symbol: class SOAPMessage
class BothWebServiceAnnotationTestImpl implements Provider<SOAPMessage> {

/export/home/illsleyd/continuum/continuum-1.0.3/apps/continuum/working-directory/61/modules/metadata/test/org/apache/axis2/jaxws/description/AnnotationProviderImplDescriptionTests.java:[245,30]
cannot find symbol
symbol  : class SOAPMessage
location: class org.apache.axis2.jaxws.description.BothWebServiceAnnotationTestImpl

/export/home/illsleyd/continuum/continuum-1.0.3/apps/continuum/working-directory/61/modules/metadata/test/org/apache/axis2/jaxws/description/AnnotationProviderImplDescriptionTests.java:[245,11]
cannot find symbol
symbol  : class SOAPMessage
location: class org.apache.axis2.jaxws.description.BothWebServiceAnnotationTestImpl


[INFO] ------------------------------------------------------------------------
[INFO] For more information, run Maven with the -e switch
[INFO] ------------------------------------------------------------------------
[INFO] Total time: 8 minutes 30 seconds
[INFO] Finished at: Thu Mar 29 09:54:15 GMT+00:00 2007
[INFO] Final Memory: 33M/1012M
[INFO] ------------------------------------------------------------------------

****************************************************************************



---------------------------------------------------------------------
To unsubscribe, e-mail: axis-cvs-unsubscribe@ws.apache.org
For additional commands, e-mail: axis-cvs-help@ws.apache.org


Mime
View raw message