axis-java-dev mailing list archives

Site index · List index
Message view « Date » · « Thread »
Top « Date » · « Thread »
From "davidillsley (Continuum)" <davidills...@apache.org>
Subject [continuum] BUILD FAILURE: Axis2
Date Wed, 07 Mar 2007 08:44:54 GMT
Online report : http://localhost:8080/continuum/servlet/continuum/target/ProjectBuild.vm/view/ProjectBuild/id/1/buildId/1256
Build statistics:
  State: Failed
  Previous State: Failed
  Started at: Wed, 7 Mar 2007 08:13:38 +0000
  Finished at: Wed, 7 Mar 2007 08:44:29 +0000
  Total time: 30m 51s
  Build Trigger: Schedule
  Exit code: 70
  Building machine hostname: ws.zones.apache.org
  Operating system : SunOS(unknown)
  Java version : 1.5.0_09(Sun Microsystems Inc.)

Changes
         amilas          change the test case

             /webservices/axis2/trunk/java/modules/adb-codegen/test/org/apache/axis2/schema/restriction/SimpleRestrictionTest.java
           amilas          Add a sufix to make the fake name uniqu

             /webservices/axis2/trunk/java/modules/adb-codegen/src/org/apache/axis2/schema/SchemaCompiler.java
        
****************************************************************************
Output:
****************************************************************************
 __  __
|  \/  |__ _Apache__ ___
| |\/| / _` \ V / -_) ' \  ~ intelligent projects ~
|_|  |_\__,_|\_/\___|_||_|  v. 1.1-beta-3

DEPRECATED: the default goal should be specified in the <build> section of project.xml instead of maven.xml
DEPRECATED: the default goal should be specified in the <build> section of project.xml instead of maven.xml
Trying to get missing/snapshot dependencies required by Apache Axis2:
Attempting to download maven-test-plugin-1.8.1-SNAPSHOT.jar.
Skipping download as local copy is up to date!
Attempting to download maven-multiproject-plugin-1.5-SNAPSHOT.jar.
Skipping download as local copy is up to date!
Attempting to download maven-jar-plugin-1.8-SNAPSHOT.jar.
Skipping download as local copy is up to date!
Attempting to download maven-plugin-plugin-1.8-SNAPSHOT.jar.
Skipping download as local copy is up to date!
    [echo] Current Java Version is: 1.5
    [echo] 
            JDK 1.5 detected, including the following modules:
            modules/metadata/project.xml,modules/jaxbri/project.xml,modules/jaxws/project.xml,modules/jaxws-api/project.xml,#modules/clustering/project.xml
        
build:start:

clean:
modules:clean:
modules:reactor:init:
plugin:download-artifact:

    [echo] Adding to modules.reactor.includes: modules/adb-codegen/project.xml
    [echo] Adding to modules.reactor.includes: modules/adb/project.xml
    [echo] Adding to modules.reactor.includes: modules/addressing/project.xml
    [echo] Adding to modules.reactor.includes: modules/clustering/project.xml
    [echo] Adding to modules.reactor.includes: modules/codegen/project.xml
    [echo] Adding to modules.reactor.includes: modules/integration/project.xml
    [echo] Adding to modules.reactor.includes: modules/java2wsdl/project.xml
    [echo] Adding to modules.reactor.includes: modules/jaxbri/project.xml
    [echo] Adding to modules.reactor.includes: modules/jaxws-api/project.xml
    [echo] Adding to modules.reactor.includes: modules/jaxws/project.xml
    [echo] Adding to modules.reactor.includes: modules/jibx/project.xml
    [echo] Adding to modules.reactor.includes: modules/json/project.xml
    [echo] Adding to modules.reactor.includes: modules/kernel/project.xml
    [echo] Adding to modules.reactor.includes: modules/metadata/project.xml
    [echo] Adding to modules.reactor.includes: modules/mex/project.xml
    [echo] Adding to modules.reactor.includes: modules/mtompolicy/project.xml
    [echo] Adding to modules.reactor.includes: modules/ping/project.xml
    [echo] Adding to modules.reactor.includes: modules/saaj-api/project.xml
    [echo] Adding to modules.reactor.includes: modules/saaj/project.xml
    [echo] Adding to modules.reactor.includes: modules/samples/project.xml
    [echo] Adding to modules.reactor.includes: modules/soapmonitor/project.xml
    [echo] Adding to modules.reactor.includes: modules/spring/project.xml
    [echo] Adding to modules.reactor.includes: modules/tool/project.xml
    [echo] Adding to modules.reactor.includes: modules/webapp/project.xml
    [echo] Adding to modules.reactor.includes: modules/xmlbeans/project.xml

    [echo] +----------------------------------------
    [echo] | Cleaning: modules/adb-codegen
    [echo] +----------------------------------------
    [delete] Deleting directory /export/home/illsleyd/continuum/continuum-1.0.3/apps/continuum/working-directory/1/modules/adb-codegen/target
    [echo] 
    [echo] +----------------------------------------
    [echo] | Cleaning: modules/adb
    [echo] +----------------------------------------
    [delete] Deleting directory /export/home/illsleyd/continuum/continuum-1.0.3/apps/continuum/working-directory/1/modules/adb/target
    [echo] 
    [echo] +----------------------------------------
    [echo] | Cleaning: modules/addressing
    [echo] +----------------------------------------
    [delete] Deleting directory /export/home/illsleyd/continuum/continuum-1.0.3/apps/continuum/working-directory/1/modules/addressing/target
    [echo] 
    [echo] +----------------------------------------
    [echo] | Cleaning: modules/clustering
    [echo] +----------------------------------------
    [echo] 
    [echo] +----------------------------------------
    [echo] | Cleaning: modules/codegen
    [echo] +----------------------------------------
    [delete] Deleting directory /export/home/illsleyd/continuum/continuum-1.0.3/apps/continuum/working-directory/1/modules/codegen/target
    [echo] 
    [echo] +----------------------------------------
    [echo] | Cleaning: modules/integration
    [echo] +----------------------------------------
    [delete] Deleting directory /export/home/illsleyd/continuum/continuum-1.0.3/apps/continuum/working-directory/1/modules/integration/target
    [echo] 
    [echo] +----------------------------------------
    [echo] | Cleaning: modules/java2wsdl
    [echo] +----------------------------------------
    [delete] Deleting directory /export/home/illsleyd/continuum/continuum-1.0.3/apps/continuum/working-directory/1/modules/java2wsdl/target
    [echo] 
    [echo] +----------------------------------------
    [echo] | Cleaning: modules/jaxbri
    [echo] +----------------------------------------
    [delete] Deleting directory /export/home/illsleyd/continuum/continuum-1.0.3/apps/continuum/working-directory/1/modules/jaxbri/target
    [echo] 
    [echo] +----------------------------------------
    [echo] | Cleaning: modules/jaxws-api
    [echo] +----------------------------------------
    [delete] Deleting directory /export/home/illsleyd/continuum/continuum-1.0.3/apps/continuum/working-directory/1/modules/jaxws-api/target
    [echo] 
    [echo] +----------------------------------------
    [echo] | Cleaning: modules/jaxws
    [echo] +----------------------------------------
    [delete] Deleting directory /export/home/illsleyd/continuum/continuum-1.0.3/apps/continuum/working-directory/1/modules/jaxws/target
    [echo] 
    [echo] +----------------------------------------
    [echo] | Cleaning: modules/jibx
    [echo] +----------------------------------------
    [echo] 
    [echo] +----------------------------------------
    [echo] | Cleaning: modules/json
    [echo] +----------------------------------------
    [echo] 
    [echo] +----------------------------------------
    [echo] | Cleaning: modules/kernel
    [echo] +----------------------------------------
    [delete] Deleting directory /export/home/illsleyd/continuum/continuum-1.0.3/apps/continuum/working-directory/1/modules/kernel/target
    [echo] 
    [echo] +----------------------------------------
    [echo] | Cleaning: modules/metadata
    [echo] +----------------------------------------
    [delete] Deleting directory /export/home/illsleyd/continuum/continuum-1.0.3/apps/continuum/working-directory/1/modules/metadata/target
    [echo] 
    [echo] +----------------------------------------
    [echo] | Cleaning: modules/mex
    [echo] +----------------------------------------
    [echo] 
    [echo] +----------------------------------------
    [echo] | Cleaning: modules/mtompolicy
    [echo] +----------------------------------------
    [echo] 
    [echo] +----------------------------------------
    [echo] | Cleaning: modules/ping
    [echo] +----------------------------------------
    [echo] 
    [echo] +----------------------------------------
    [echo] | Cleaning: modules/saaj-api
    [echo] +----------------------------------------
    [delete] Deleting directory /export/home/illsleyd/continuum/continuum-1.0.3/apps/continuum/working-directory/1/modules/saaj-api/target
    [echo] 
    [echo] +----------------------------------------
    [echo] | Cleaning: modules/saaj
    [echo] +----------------------------------------
    [delete] Deleting directory /export/home/illsleyd/continuum/continuum-1.0.3/apps/continuum/working-directory/1/modules/saaj/target
    [echo] 
    [echo] +----------------------------------------
    [echo] | Cleaning: modules/samples
    [echo] +----------------------------------------
    [delete] Deleting directory /export/home/illsleyd/continuum/continuum-1.0.3/apps/continuum/working-directory/1/modules/samples/target
    [echo] 
    [echo] +----------------------------------------
    [echo] | Cleaning: modules/soapmonitor
    [echo] +----------------------------------------
    [echo] 
    [echo] +----------------------------------------
    [echo] | Cleaning: modules/spring
    [echo] +----------------------------------------
    [delete] Deleting directory /export/home/illsleyd/continuum/continuum-1.0.3/apps/continuum/working-directory/1/modules/spring/target
    [echo] 
    [echo] +----------------------------------------
    [echo] | Cleaning: modules/tool
    [echo] +----------------------------------------
    [delete] Deleting directory /export/home/illsleyd/continuum/continuum-1.0.3/apps/continuum/working-directory/1/modules/tool/target
    [echo] 
    [echo] +----------------------------------------
    [echo] | Cleaning: modules/webapp
    [echo] +----------------------------------------
    [echo] 
    [echo] +----------------------------------------
    [echo] | Cleaning: modules/xmlbeans
    [echo] +----------------------------------------
    [delete] Deleting directory /export/home/illsleyd/continuum/continuum-1.0.3/apps/continuum/working-directory/1/modules/xmlbeans/target
    [echo] 
    [echo] +----------------------------------------
    [echo] | Cleaning: target and etc/target
    [echo] +----------------------------------------


jar:
multiproject:install:
multiproject:projects-init:
    [echo] Gathering project list
Starting the reactor...
Our processing order:
Apache Axis 2.0 - Java2WSDL
Apache Axis 2.0 - Kernel
Apache Axis 2.0 - Data Binding
Apache Axis 2.0 - Code Generation
Apache Axis 2.0 - ADB Codegen
Apache Axis 2.0 - Addressing
Apache Axis 2.0 - Samples
Apache Axis 2.0 - spring
Apache Axis 2.0 - XMLBeans Data Binding
Apache Axis 2.0 - Tools
Apache Axis 2.0 - Integration
Apache Axis 2.0 - JAXB-RI Data Binding
Apache Axis 2.0 - SAAJ API
Apache Axis 2.0 - JAXWS API
Apache Axis 2.0 - SAAJ
Apache Axis 2.0 - Metadata
Apache Axis 2.0 - JAX-WS
Apache Axis 2.0 - JiBX Data Binding
Apache Axis 2.0 - JSON
Apache Axis 2.0 - Metadata Exchange
Apache Axis 2.0 - MTOM Policy
Apache Axis 2.0 - ping
Apache Axis 2.0 - soapmonitor
+----------------------------------------
| Gathering project list Apache Axis 2.0 - Java2WSDL
| Memory: 14M/38M
+----------------------------------------
+----------------------------------------
| Gathering project list Apache Axis 2.0 - Kernel
| Memory: 14M/38M
+----------------------------------------
+----------------------------------------
| Gathering project list Apache Axis 2.0 - Data Binding
| Memory: 14M/38M
+----------------------------------------
+----------------------------------------
| Gathering project list Apache Axis 2.0 - Code Generation
| Memory: 14M/38M
+----------------------------------------
+----------------------------------------
| Gathering project list Apache Axis 2.0 - ADB Codegen
| Memory: 14M/38M
+----------------------------------------
+----------------------------------------
| Gathering project list Apache Axis 2.0 - Addressing
| Memory: 14M/38M
+----------------------------------------
+----------------------------------------
| Gathering project list Apache Axis 2.0 - Samples
| Memory: 14M/38M
+----------------------------------------
+----------------------------------------
| Gathering project list Apache Axis 2.0 - spring
| Memory: 14M/38M
+----------------------------------------
+----------------------------------------
| Gathering project list Apache Axis 2.0 - XMLBeans Data Binding
| Memory: 14M/38M
+----------------------------------------
+----------------------------------------
| Gathering project list Apache Axis 2.0 - Tools
| Memory: 14M/38M
+----------------------------------------
+----------------------------------------
| Gathering project list Apache Axis 2.0 - Integration
| Memory: 14M/38M
+----------------------------------------
+----------------------------------------
| Gathering project list Apache Axis 2.0 - JAXB-RI Data Binding
| Memory: 14M/38M
+----------------------------------------
+----------------------------------------
| Gathering project list Apache Axis 2.0 - SAAJ API
| Memory: 14M/38M
+----------------------------------------
+----------------------------------------
| Gathering project list Apache Axis 2.0 - JAXWS API
| Memory: 14M/38M
+----------------------------------------
+----------------------------------------
| Gathering project list Apache Axis 2.0 - SAAJ
| Memory: 14M/38M
+----------------------------------------
+----------------------------------------
| Gathering project list Apache Axis 2.0 - Metadata
| Memory: 14M/38M
+----------------------------------------
+----------------------------------------
| Gathering project list Apache Axis 2.0 - JAX-WS
| Memory: 14M/38M
+----------------------------------------
+----------------------------------------
| Gathering project list Apache Axis 2.0 - JiBX Data Binding
| Memory: 14M/38M
+----------------------------------------
+----------------------------------------
| Gathering project list Apache Axis 2.0 - JSON
| Memory: 14M/38M
+----------------------------------------
+----------------------------------------
| Gathering project list Apache Axis 2.0 - Metadata Exchange
| Memory: 14M/38M
+----------------------------------------
+----------------------------------------
| Gathering project list Apache Axis 2.0 - MTOM Policy
| Memory: 14M/38M
+----------------------------------------
+----------------------------------------
| Gathering project list Apache Axis 2.0 - ping
| Memory: 14M/38M
+----------------------------------------
+----------------------------------------
| Gathering project list Apache Axis 2.0 - soapmonitor
| Memory: 14M/38M
+----------------------------------------

multiproject:goal:
Starting the reactor...
Our processing order:
Apache Axis 2.0 - Java2WSDL
Apache Axis 2.0 - Kernel
Apache Axis 2.0 - Data Binding
Apache Axis 2.0 - Code Generation
Apache Axis 2.0 - ADB Codegen
Apache Axis 2.0 - Addressing
Apache Axis 2.0 - Samples
Apache Axis 2.0 - spring
Apache Axis 2.0 - XMLBeans Data Binding
Apache Axis 2.0 - Tools
Apache Axis 2.0 - Integration
Apache Axis 2.0 - JAXB-RI Data Binding
Apache Axis 2.0 - SAAJ API
Apache Axis 2.0 - JAXWS API
Apache Axis 2.0 - SAAJ
Apache Axis 2.0 - Metadata
Apache Axis 2.0 - JAX-WS
Apache Axis 2.0 - JiBX Data Binding
Apache Axis 2.0 - JSON
Apache Axis 2.0 - Metadata Exchange
Apache Axis 2.0 - MTOM Policy
Apache Axis 2.0 - ping
Apache Axis 2.0 - soapmonitor
+----------------------------------------
| Executing multiproject:install-callback Apache Axis 2.0 - Java2WSDL
| Memory: 14M/38M
+----------------------------------------
DEPRECATED: the default goal should be specified in the <build> section of project.xml instead of maven.xml
DEPRECATED: the default goal should be specified in the <build> section of project.xml instead of maven.xml
Trying to get missing/snapshot dependencies required by Apache Axis 2.0 - Java2WSDL:
Attempting to download axiom-api-SNAPSHOT.jar.
4/125K
8/125K
12/125K
16/125K
20/125K
24/125K
28/125K
32/125K
36/125K
40/125K
44/125K
48/125K
52/125K
56/125K
60/125K
64/125K
68/125K
72/125K
76/125K
80/125K
84/125K
88/125K
92/125K
96/125K
100/125K
104/125K
108/125K
112/125K
116/125K
120/125K
124/125K
125/125K
125K downloaded
Error retrieving artifact from [http://people.apache.org/repo/m1-snapshot-repository/]: org.apache.maven.verifier.ChecksumVerificationException: Error retrieving checksum file for /org.apache.ws.commons.axiom/jars/axiom-api-SNAPSHOT.jar
Skipping download as local copy is up to date!
Attempting to download axiom-impl-SNAPSHOT.jar.
4/109K
8/109K
12/109K
16/109K
20/109K
24/109K
28/109K
32/109K
36/109K
40/109K
44/109K
48/109K
52/109K
56/109K
60/109K
64/109K
68/109K
72/109K
76/109K
80/109K
84/109K
88/109K
92/109K
96/109K
100/109K
104/109K
108/109K
109/109K
109K downloaded
Error retrieving artifact from [http://people.apache.org/repo/m1-snapshot-repository/]: org.apache.maven.verifier.ChecksumVerificationException: Error retrieving checksum file for /org.apache.ws.commons.axiom/jars/axiom-impl-SNAPSHOT.jar
Skipping download as local copy is up to date!
build:start:

multiproject:install-callback:
    [echo] Running jar:install for Apache Axis 2.0 - Java2WSDL
java:prepare-filesystem:
    [mkdir] Created dir: /export/home/illsleyd/continuum/continuum-1.0.3/apps/continuum/working-directory/1/modules/java2wsdl/target/classes
Running post goal: java:prepare-filesystem

java:compile:
    [echo] Compiling to /export/home/illsleyd/continuum/continuum-1.0.3/apps/continuum/working-directory/1/modules/java2wsdl/target/classes
    [javac] Compiling 23 source files to /export/home/illsleyd/continuum/continuum-1.0.3/apps/continuum/working-directory/1/modules/java2wsdl/target/classes

java:jar-resources:
Copying 2 files to /export/home/illsleyd/continuum/continuum-1.0.3/apps/continuum/working-directory/1/modules/java2wsdl/target/classes/META-INF

test:test:
    [echo] No tests to run.

jar:jar:
    [jar] Building jar: /export/home/illsleyd/continuum/continuum-1.0.3/apps/continuum/working-directory/1/modules/java2wsdl/target/axis2-java2wsdl-SNAPSHOT.jar

jar:install:
    [echo] Installing...
Uploading to org.apache.axis2/jars/axis2-java2wsdl-SNAPSHOT.jar: 
.................... (56K)
Uploading to org.apache.axis2/poms/axis2-java2wsdl-SNAPSHOT.pom: 
.................... (14K)

+----------------------------------------
| Executing multiproject:install-callback Apache Axis 2.0 - Kernel
| Memory: 14M/37M
+----------------------------------------
DEPRECATED: the default goal should be specified in the <build> section of project.xml instead of maven.xml
DEPRECATED: the default goal should be specified in the <build> section of project.xml instead of maven.xml

build:end:

Trying to get missing/snapshot dependencies required by Apache Axis 2.0 - Kernel:
Attempting to download axis2-java2wsdl-SNAPSHOT.jar.
Skipping download as local copy is up to date!
Attempting to download neethi-SNAPSHOT.jar.
4/28K
8/28K
12/28K
16/28K
20/28K
24/28K
28/28K
28/28K
28K downloaded
*** CHECKSUM FAILED - Checksum failed on download: local = 'ffc4e6fddec014bb593c3bd607a0b1c4'; remote = 'a5f6ab5ac86b311b5d70d061668bae01' - RETRYING
4/28K
8/28K
12/28K
16/28K
20/28K
24/28K
28/28K
28/28K
28K downloaded
Error retrieving artifact from [http://people.apache.org/repo/m1-snapshot-repository/]: org.apache.maven.verifier.ChecksumVerificationException: Checksum failed on download: local = 'ffc4e6fddec014bb593c3bd607a0b1c4'; remote = 'a5f6ab5ac86b311b5d70d061668bae01'
Attempting to download woden-1.0-incubating-SNAPSHOT.jar.
4/303K
8/303K
12/303K
16/303K
20/303K
24/303K
28/303K
32/303K
36/303K
40/303K
44/303K
48/303K
52/303K
56/303K
60/303K
64/303K
68/303K
72/303K
76/303K
80/303K
84/303K
88/303K
92/303K
92/303K
96/303K
100/303K
104/303K
106/303K
110/303K
113/303K
117/303K
120/303K
124/303K
128/303K
132/303K
136/303K
139/303K
143/303K
144/303K
148/303K
152/303K
156/303K
160/303K
164/303K
168/303K
172/303K
176/303K
180/303K
184/303K
188/303K
192/303K
196/303K
200/303K
204/303K
208/303K
212/303K
216/303K
220/303K
224/303K
228/303K
232/303K
236/303K
240/303K
244/303K
248/303K
252/303K
256/303K
260/303K
264/303K
268/303K
272/303K
276/303K
280/303K
284/303K
288/303K
292/303K
296/303K
300/303K
303/303K
303K downloaded
*** CHECKSUM FAILED - Checksum failed on download: local = '30b5d498d537bfdaf28ee3b94eb5640a'; remote = '7a04ef17f62048b96d91a0585605e5a7' - RETRYING
4/303K
8/303K
12/303K
16/303K
20/303K
24/303K
28/303K
32/303K
36/303K
40/303K
44/303K
48/303K
52/303K
56/303K
60/303K
64/303K
68/303K
72/303K
76/303K
80/303K
84/303K
88/303K
92/303K
96/303K
100/303K
104/303K
108/303K
112/303K
116/303K
120/303K
124/303K
128/303K
132/303K
136/303K
140/303K
144/303K
148/303K
152/303K
156/303K
160/303K
164/303K
168/303K
172/303K
176/303K
180/303K
184/303K
188/303K
192/303K
196/303K
200/303K
204/303K
208/303K
212/303K
216/303K
220/303K
224/303K
228/303K
232/303K
236/303K
240/303K
244/303K
248/303K
252/303K
256/303K
260/303K
264/303K
268/303K
272/303K
276/303K
280/303K
284/303K
288/303K
292/303K
296/303K
300/303K
303/303K
303K downloaded
Error retrieving artifact from [http://people.apache.org/repo/m1-snapshot-repository/]: org.apache.maven.verifier.ChecksumVerificationException: Checksum failed on download: local = '30b5d498d537bfdaf28ee3b94eb5640a'; remote = '7a04ef17f62048b96d91a0585605e5a7'
build:start:

multiproject:install-callback:
    [echo] Running jar:install for Apache Axis 2.0 - Kernel
java:prepare-filesystem:
    [mkdir] Created dir: /export/home/illsleyd/continuum/continuum-1.0.3/apps/continuum/working-directory/1/modules/kernel/target/classes
Running post goal: java:prepare-filesystem

java:compile:
    [echo] Compiling to /export/home/illsleyd/continuum/continuum-1.0.3/apps/continuum/working-directory/1/modules/kernel/target/classes
    [javac] Compiling 325 source files to /export/home/illsleyd/continuum/continuum-1.0.3/apps/continuum/working-directory/1/modules/kernel/target/classes
    [javac] /export/home/illsleyd/continuum/continuum-1.0.3/apps/continuum/working-directory/1/modules/kernel/src/org/apache/axis2/transport/http/MultipartFormDataFormatter.java:46: warning: unmappable character for encoding ASCII
    [javac]  * <name>Fr??jus</name>
    [javac]            ^
    [javac] /export/home/illsleyd/continuum/continuum-1.0.3/apps/continuum/working-directory/1/modules/kernel/src/org/apache/axis2/transport/http/MultipartFormDataFormatter.java:46: warning: unmappable character for encoding ASCII
    [javac]  * <name>Fr??jus</name>
    [javac]             ^
    [javac] /export/home/illsleyd/continuum/continuum-1.0.3/apps/continuum/working-directory/1/modules/kernel/src/org/apache/axis2/transport/http/MultipartFormDataFormatter.java:69: warning: unmappable character for encoding ASCII
    [javac]  * <name>Fr??jus</name>
    [javac]            ^
    [javac] /export/home/illsleyd/continuum/continuum-1.0.3/apps/continuum/working-directory/1/modules/kernel/src/org/apache/axis2/transport/http/MultipartFormDataFormatter.java:69: warning: unmappable character for encoding ASCII
    [javac]  * <name>Fr??jus</name>
    [javac]             ^
    [javac] Note: Some input files use or override a deprecated API.
    [javac] Note: Recompile with -Xlint:deprecation for details.
    [javac] 4 warnings

java:jar-resources:
Copying 1 file to /export/home/illsleyd/continuum/continuum-1.0.3/apps/continuum/working-directory/1/modules/kernel/target/classes
Copying 2 files to /export/home/illsleyd/continuum/continuum-1.0.3/apps/continuum/working-directory/1/modules/kernel/target/classes
Copying 2 files to /export/home/illsleyd/continuum/continuum-1.0.3/apps/continuum/working-directory/1/modules/kernel/target/classes/META-INF

test:test:
java:prepare-filesystem:
Running post goal: java:prepare-filesystem

java:compile:
    [echo] Compiling to /export/home/illsleyd/continuum/continuum-1.0.3/apps/continuum/working-directory/1/modules/kernel/target/classes
    [javac] Compiling 1 source file to /export/home/illsleyd/continuum/continuum-1.0.3/apps/continuum/working-directory/1/modules/kernel/target/classes

java:jar-resources:

test:prepare-filesystem:
    [mkdir] Created dir: /export/home/illsleyd/continuum/continuum-1.0.3/apps/continuum/working-directory/1/modules/kernel/target/test-classes
    [mkdir] Created dir: /export/home/illsleyd/continuum/continuum-1.0.3/apps/continuum/working-directory/1/modules/kernel/target/test-reports

test:test-resources:
Copying 59 files to /export/home/illsleyd/continuum/continuum-1.0.3/apps/continuum/working-directory/1/modules/kernel/target/test-classes/../test-resources

test:compile:
    [javac] Compiling 93 source files to /export/home/illsleyd/continuum/continuum-1.0.3/apps/continuum/working-directory/1/modules/kernel/target/test-classes
    [javac] Note: Some input files use or override a deprecated API.
    [javac] Note: Recompile with -Xlint:deprecation for details.
Running post goal: test:compile
    [echo] the files are up to date = ${jars.uptodate}
    [mkdir] Created dir: /export/home/illsleyd/continuum/continuum-1.0.3/apps/continuum/working-directory/1/modules/kernel/test-resources/deployment/service2/build/classes
    [mkdir] Created dir: /export/home/illsleyd/continuum/continuum-1.0.3/apps/continuum/working-directory/1/modules/kernel/test-resources/deployment/service2/build/lib
    [copy] Copying 1 file to /export/home/illsleyd/continuum/continuum-1.0.3/apps/continuum/working-directory/1/modules/kernel/test-resources/deployment/service2/build/classes/META-INF
    [mkdir] Created dir: /export/home/illsleyd/continuum/continuum-1.0.3/apps/continuum/working-directory/1/modules/kernel/target/test-resources/deployment/services
    [jar] Building jar: /export/home/illsleyd/continuum/continuum-1.0.3/apps/continuum/working-directory/1/modules/kernel/target/test-resources/deployment/services/service2.jar
    [delete] Deleting directory /export/home/illsleyd/continuum/continuum-1.0.3/apps/continuum/working-directory/1/modules/kernel/test-resources/deployment/service2/build
    [echo] the files are up to date = ${jars.uptodate}
    [mkdir] Created dir: /export/home/illsleyd/continuum/continuum-1.0.3/apps/continuum/working-directory/1/modules/kernel/test-resources/deployment/echo/build/classes
    [mkdir] Created dir: /export/home/illsleyd/continuum/continuum-1.0.3/apps/continuum/working-directory/1/modules/kernel/test-resources/deployment/echo/build/lib
    [copy] Copying 1 file to /export/home/illsleyd/continuum/continuum-1.0.3/apps/continuum/working-directory/1/modules/kernel/test-resources/deployment/echo/build/classes/META-INF
    [mkdir] Created dir: /export/home/illsleyd/continuum/continuum-1.0.3/apps/continuum/working-directory/1/modules/kernel/target/echo
    [jar] Building jar: /export/home/illsleyd/continuum/continuum-1.0.3/apps/continuum/working-directory/1/modules/kernel/target/echo/echo.aar
    [delete] Deleting directory /export/home/illsleyd/continuum/continuum-1.0.3/apps/continuum/working-directory/1/modules/kernel/test-resources/deployment/echo/build
    [echo] the files are up to date = ${jars.uptodate}
    [mkdir] Created dir: /export/home/illsleyd/continuum/continuum-1.0.3/apps/continuum/working-directory/1/modules/kernel/test-resources/deployment/invalidservice/build/classes
    [mkdir] Created dir: /export/home/illsleyd/continuum/continuum-1.0.3/apps/continuum/working-directory/1/modules/kernel/test-resources/deployment/invalidservice/build/lib
    [copy] Copying 1 file to /export/home/illsleyd/continuum/continuum-1.0.3/apps/continuum/working-directory/1/modules/kernel/test-resources/deployment/invalidservice/build/classes/META-INF
    [mkdir] Created dir: /export/home/illsleyd/continuum/continuum-1.0.3/apps/continuum/working-directory/1/modules/kernel/target/test-resources/InvalidDeployment/services
    [jar] Building jar: /export/home/illsleyd/continuum/continuum-1.0.3/apps/continuum/working-directory/1/modules/kernel/target/test-resources/InvalidDeployment/services/invalidService.jar
    [delete] Deleting directory /export/home/illsleyd/continuum/continuum-1.0.3/apps/continuum/working-directory/1/modules/kernel/test-resources/deployment/invalidservice/build
    [echo] the files are up to date = ${jars.uptodate}
    [mkdir] Created dir: /export/home/illsleyd/continuum/continuum-1.0.3/apps/continuum/working-directory/1/modules/kernel/test-resources/deployment/module1/build/classes
    [mkdir] Created dir: /export/home/illsleyd/continuum/continuum-1.0.3/apps/continuum/working-directory/1/modules/kernel/test-resources/deployment/module1/build/lib
    [copy] Copying 1 file to /export/home/illsleyd/continuum/continuum-1.0.3/apps/continuum/working-directory/1/modules/kernel/test-resources/deployment/module1/build/classes/META-INF
    [mkdir] Created dir: /export/home/illsleyd/continuum/continuum-1.0.3/apps/continuum/working-directory/1/modules/kernel/target/test-resources/deployment/modules
    [jar] Building jar: /export/home/illsleyd/continuum/continuum-1.0.3/apps/continuum/working-directory/1/modules/kernel/target/test-resources/deployment/modules/module1.mar
    [delete] Deleting directory /export/home/illsleyd/continuum/continuum-1.0.3/apps/continuum/working-directory/1/modules/kernel/test-resources/deployment/module1/build
    [echo] the files are up to date = ${jars.uptodate}
    [mkdir] Created dir: /export/home/illsleyd/continuum/continuum-1.0.3/apps/continuum/working-directory/1/modules/kernel/test-resources/deployment/serviceModule/build/classes
    [mkdir] Created dir: /export/home/illsleyd/continuum/continuum-1.0.3/apps/continuum/working-directory/1/modules/kernel/test-resources/deployment/serviceModule/build/lib
    [copy] Copying 1 file to /export/home/illsleyd/continuum/continuum-1.0.3/apps/continuum/working-directory/1/modules/kernel/test-resources/deployment/serviceModule/build/classes/META-INF
    [mkdir] Created dir: /export/home/illsleyd/continuum/continuum-1.0.3/apps/continuum/working-directory/1/modules/kernel/target/test-resources/InvalidDeployment/modules
    [jar] Building jar: /export/home/illsleyd/continuum/continuum-1.0.3/apps/continuum/working-directory/1/modules/kernel/target/test-resources/InvalidDeployment/modules/serviceModule.jar
    [delete] Deleting directory /export/home/illsleyd/continuum/continuum-1.0.3/apps/continuum/working-directory/1/modules/kernel/test-resources/deployment/serviceModule/build
    [mkdir] Created dir: /export/home/illsleyd/continuum/continuum-1.0.3/apps/continuum/working-directory/1/modules/kernel/target/test-resources/java2sec/more
    [mkdir] Created dir: /export/home/illsleyd/continuum/continuum-1.0.3/apps/continuum/working-directory/1/modules/kernel/target/test-resources/java2sec/less
    [jar] Building jar: /export/home/illsleyd/continuum/continuum-1.0.3/apps/continuum/working-directory/1/modules/kernel/target/test-resources/java2sec/more/MorePermission.jar
    [delete] Deleting directory /export/home/illsleyd/continuum/continuum-1.0.3/apps/continuum/working-directory/1/modules/kernel/target/test-classes/org/apache/axis2/java/security/driver
    [delete] Deleting directory /export/home/illsleyd/continuum/continuum-1.0.3/apps/continuum/working-directory/1/modules/kernel/target/test-classes/org/apache/axis2/java/security/more
    [delete] Deleting directory /export/home/illsleyd/continuum/continuum-1.0.3/apps/continuum/working-directory/1/modules/kernel/target/test-classes/org/apache/axis2/java/security/action
    [delete] Deleting directory /export/home/illsleyd/continuum/continuum-1.0.3/apps/continuum/working-directory/1/modules/kernel/target/test-classes/org/apache/axis2/java/security/interf
    [jar] Building jar: /export/home/illsleyd/continuum/continuum-1.0.3/apps/continuum/working-directory/1/modules/kernel/target/test-resources/java2sec/less/LessPermission.jar
    [delete] Deleting directory /export/home/illsleyd/continuum/continuum-1.0.3/apps/continuum/working-directory/1/modules/kernel/target/test-classes/org/apache/axis2/java/security/less

    [junit] Running org.apache.axis2.addressing.AddressingHelperTest
    [junit] Tests run: 6, Failures: 0, Errors: 0, Time elapsed: 0.401 sec
    [junit] Running org.apache.axis2.addressing.EndpointReferenceHelperTest
    [junit] Tests run: 2, Failures: 0, Errors: 0, Time elapsed: 0.406 sec
    [junit] Running org.apache.axis2.addressing.EndpointReferenceTypeTest
    [junit] Tests run: 5, Failures: 0, Errors: 0, Time elapsed: 0.628 sec
    [junit] Running org.apache.axis2.addressing.miheaders.RelatesToTest
    [junit] Tests run: 3, Failures: 0, Errors: 0, Time elapsed: 0.369 sec
    [junit] Running org.apache.axis2.addressing.wsdl.WSDL11ActionHelperTest
    [junit] Tests run: 8, Failures: 0, Errors: 0, Time elapsed: 0.935 sec
    [junit] Running org.apache.axis2.context.ContextHierarchyTest
    [junit] Tests run: 2, Failures: 0, Errors: 0, Time elapsed: 0.756 sec
    [junit] Running org.apache.axis2.context.OperationContextTest
    [junit] Tests run: 1, Failures: 0, Errors: 0, Time elapsed: 0.686 sec
    [junit] Running org.apache.axis2.deployment.AddingObserverTest
    [junit] Tests run: 1, Failures: 0, Errors: 0, Time elapsed: 0.837 sec
    [junit] Running org.apache.axis2.deployment.AxisMessageTest
    [junit] Tests run: 1, Failures: 0, Errors: 0, Time elapsed: 1.324 sec
    [junit] Running org.apache.axis2.deployment.BadModuleTest
    [junit] Tests run: 1, Failures: 0, Errors: 0, Time elapsed: 0.675 sec
    [junit] Running org.apache.axis2.deployment.BuildERWithDeploymentTest
    [junit] Tests run: 1, Failures: 0, Errors: 0, Time elapsed: 1.285 sec
    [junit] Running org.apache.axis2.deployment.BuilderSelectorDeploymentTest
    [junit] Tests run: 2, Failures: 0, Errors: 0, Time elapsed: 0.872 sec
    [junit] Running org.apache.axis2.deployment.DeploymentTotalTest
    [junit] Tests run: 1, Failures: 0, Errors: 0, Time elapsed: 1.239 sec
    [junit] Running org.apache.axis2.deployment.MessageFormatterDeploymentTest
    [junit] Tests run: 2, Failures: 0, Errors: 0, Time elapsed: 1.343 sec
    [junit] Running org.apache.axis2.deployment.ModifiedConfigFileTest
    [junit] Tests run: 1, Failures: 0, Errors: 0, Time elapsed: 0.744 sec
    [junit] Running org.apache.axis2.deployment.ModuleDisengagementTest
    [junit] Tests run: 7, Failures: 0, Errors: 0, Time elapsed: 1.347 sec
    [junit] Running org.apache.axis2.deployment.ModuleversionTest
    [junit] Tests run: 2, Failures: 0, Errors: 0, Time elapsed: 0.744 sec
    [junit] Running org.apache.axis2.deployment.OperationExcludeTest
    [junit] Tests run: 1, Failures: 0, Errors: 0, Time elapsed: 1.358 sec
    [junit] Running org.apache.axis2.deployment.SameServiceAddingTest
    [junit] Tests run: 1, Failures: 0, Errors: 0, Time elapsed: 0.819 sec
    [junit] Running org.apache.axis2.deployment.ServiceGroupTest
    [junit] Tests run: 1, Failures: 0, Errors: 0, Time elapsed: 1.417 sec
    [junit] Running org.apache.axis2.deployment.SystemPhasesremovedTest
    [junit] Tests run: 1, Failures: 0, Errors: 0, Time elapsed: 0.758 sec
    [junit] Running org.apache.axis2.deployment.TransportDeploymentTest
    [junit] Tests run: 1, Failures: 0, Errors: 0, Time elapsed: 1.102 sec
    [junit] Running org.apache.axis2.description.RegistryTest
    [junit] Tests run: 5, Failures: 0, Errors: 0, Time elapsed: 0.642 sec
    [junit] Running org.apache.axis2.description.WSDLToAllServicesBuilderTest
    [junit] Tests run: 2, Failures: 0, Errors: 0, Time elapsed: 4.004 sec
    [junit] Running org.apache.axis2.dispatchers.ActionBasedOperationDispatchTest
    [junit] Tests run: 1, Failures: 0, Errors: 0, Time elapsed: 0.732 sec
    [junit] Running org.apache.axis2.dispatchers.RelatesToBasedOperationDispatcherTest
    [junit] Tests run: 1, Failures: 0, Errors: 0, Time elapsed: 0.747 sec
    [junit] Running org.apache.axis2.dispatchers.RelatesToBasedServiceDispatcherTest
    [junit] Tests run: 1, Failures: 0, Errors: 0, Time elapsed: 0.748 sec
    [junit] Running org.apache.axis2.dispatchers.RequestURIBasedOperationDispatcherTest
    [junit] Tests run: 1, Failures: 0, Errors: 0, Time elapsed: 0.774 sec
    [junit] Running org.apache.axis2.dispatchers.RequestURIBasedServiceDispatcherTest
    [junit] Tests run: 1, Failures: 0, Errors: 0, Time elapsed: 0.499 sec
    [junit] Running org.apache.axis2.dispatchers.SOAPMessageBodyBasedOperationDispatcherTest
    [junit] Tests run: 1, Failures: 0, Errors: 0, Time elapsed: 0.895 sec
    [junit] Running org.apache.axis2.dispatchers.SOAPMessageBodyBasedServiceDispatcherTest
    [junit] Tests run: 1, Failures: 0, Errors: 0, Time elapsed: 0.528 sec
    [junit] Running org.apache.axis2.engine.EnginePausingTest
    [junit] Tests run: 1, Failures: 0, Errors: 0, Time elapsed: 0.782 sec
    [junit] Running org.apache.axis2.engine.MessageContextChangeTest
    [junit] Tests run: 1, Failures: 0, Errors: 0, Time elapsed: 0.437 sec
    [junit] Running org.apache.axis2.engine.MessageContextSaveATest
    [junit] Tests run: 4, Failures: 0, Errors: 0, Time elapsed: 0.882 sec
    [junit] Running org.apache.axis2.engine.MessageContextSaveBTest
    [junit] Tests run: 1, Failures: 0, Errors: 0, Time elapsed: 0.732 sec
    [junit] Running org.apache.axis2.engine.MessageContextSaveCTest
    [junit] Tests run: 2, Failures: 0, Errors: 0, Time elapsed: 0.982 sec
    [junit] Running org.apache.axis2.engine.MessageContextSelfManagedDataTest
    [junit] Tests run: 10, Failures: 0, Errors: 0, Time elapsed: 1.4 sec
    [junit] Running org.apache.axis2.engine.MessageContextTest
    [junit] Tests run: 1, Failures: 0, Errors: 0, Time elapsed: 0.522 sec
    [junit] Running org.apache.axis2.engine.ModuleConfigTest
    [junit] Tests run: 2, Failures: 0, Errors: 0, Time elapsed: 1.118 sec
    [junit] Running org.apache.axis2.engine.ModuleEngageTest
    [junit] Tests run: 1, Failures: 0, Errors: 0, Time elapsed: 1.2 sec
    [junit] Running org.apache.axis2.engine.ObjectSaveTest
    [junit] Tests run: 5, Failures: 0, Errors: 0, Time elapsed: 0.787 sec
    [junit] Running org.apache.axis2.engine.OperationContextSaveTest
    [junit] Tests run: 1, Failures: 0, Errors: 0, Time elapsed: 0.694 sec
    [junit] Running org.apache.axis2.engine.OptionsSaveTest
    [junit] Tests run: 1, Failures: 0, Errors: 0, Time elapsed: 1.054 sec
    [junit] Running org.apache.axis2.engine.ParameterAddTest
    [junit] Tests run: 4, Failures: 0, Errors: 0, Time elapsed: 0.736 sec
    [junit] Running org.apache.axis2.engine.SOAPActionBasedDispatcherTest
    [junit] Tests run: 4, Failures: 0, Errors: 0, Time elapsed: 0.748 sec
    [junit] Running org.apache.axis2.java.security.driver.Java2SecTest
    [junit] Tests run: 9, Failures: 0, Errors: 0, Time elapsed: 0.401 sec
    [junit] Running org.apache.axis2.misc.MiscTest
    [junit] Tests run: 1, Failures: 0, Errors: 0, Time elapsed: 0.345 sec
    [junit] Running org.apache.axis2.phaserule.AddingHandlerToEachPhaseTest
    [junit] Tests run: 3, Failures: 0, Errors: 0, Time elapsed: 0.385 sec
    [junit] Running org.apache.axis2.phaserule.BeforeAfterTest
    [junit] Tests run: 1, Failures: 0, Errors: 0, Time elapsed: 0.395 sec
    [junit] Running org.apache.axis2.phaserule.BeforeTest
    [junit] Tests run: 1, Failures: 0, Errors: 0, Time elapsed: 0.497 sec
    [junit] Running org.apache.axis2.phaserule.BeforeWithNoFirstHandlerTest
    [junit] Tests run: 1, Failures: 0, Errors: 0, Time elapsed: 0.45 sec
    [junit] Running org.apache.axis2.phaserule.InvalidPhaseFirstRulesTest
    [junit] Tests run: 1, Failures: 0, Errors: 0, Time elapsed: 0.446 sec
    [junit] Running org.apache.axis2.phaserule.InvalidPhaseFirstTest
    [junit] Tests run: 1, Failures: 0, Errors: 0, Time elapsed: 0.444 sec
    [junit] Running org.apache.axis2.phaserule.InvalidPhaseLastRuleTest
    [junit] Tests run: 1, Failures: 0, Errors: 0, Time elapsed: 0.439 sec
    [junit] Running org.apache.axis2.phaserule.InvalidPhaseRuleTest
    [junit] Tests run: 2, Failures: 0, Errors: 0, Time elapsed: 0.421 sec
    [junit] Running org.apache.axis2.phaserule.InvalidPhaselastTest
    [junit] Tests run: 1, Failures: 0, Errors: 0, Time elapsed: 0.439 sec
    [junit] Running org.apache.axis2.phaserule.PhaseFirstTest
    [junit] Tests run: 1, Failures: 0, Errors: 0, Time elapsed: 0.389 sec
    [junit] Running org.apache.axis2.phaserule.PhaseLastTest
    [junit] Tests run: 1, Failures: 0, Errors: 0, Time elapsed: 0.392 sec
    [junit] Running org.apache.axis2.phaserule.PhaseRuleTest
    [junit] Tests run: 1, Failures: 0, Errors: 0, Time elapsed: 0.417 sec
    [junit] Running org.apache.axis2.phaserule.PreDispatchPhaseRuleTest
    [junit] Tests run: 1, Failures: 0, Errors: 0, Time elapsed: 0.382 sec
    [junit] Running org.apache.axis2.phaserule.SingleHandlerPhaseTest
    [junit] Tests run: 1, Failures: 0, Errors: 0, Time elapsed: 0.435 sec
    [junit] Running org.apache.axis2.transport.tcp.TCPTransportTest
    [junit] Tests run: 1, Failures: 0, Errors: 0, Time elapsed: 0.328 sec
    [junit] Running org.apache.axis2.util.ThreadContextMigratorTest
    [junit] Tests run: 2, Failures: 0, Errors: 0, Time elapsed: 0.431 sec

jar:jar:
    [copy] Copying 1 file to /export/home/illsleyd/continuum/continuum-1.0.3/apps/continuum/working-directory/1/modules/kernel/target/classes/org/apache/axis2/i18n
    [jar] Building jar: /export/home/illsleyd/continuum/continuum-1.0.3/apps/continuum/working-directory/1/modules/kernel/target/axis2-kernel-SNAPSHOT.jar

jar:install:
    [echo] Installing...
Uploading to org.apache.axis2/jars/axis2-kernel-SNAPSHOT.jar: 
.................... (859K)
Uploading to org.apache.axis2/poms/axis2-kernel-SNAPSHOT.pom: 
.................... (15K)

+----------------------------------------
| Executing multiproject:install-callback Apache Axis 2.0 - Data Binding
| Memory: 33M/42M
+----------------------------------------
DEPRECATED: the default goal should be specified in the <build> section of project.xml instead of maven.xml
DEPRECATED: the default goal should be specified in the <build> section of project.xml instead of maven.xml

build:end:

Trying to get missing/snapshot dependencies required by Apache Axis 2.0 - Data Binding:
Attempting to download axiom-dom-SNAPSHOT.jar.
4/131K
8/131K
12/131K
16/131K
20/131K
24/131K
28/131K
32/131K
36/131K
40/131K
44/131K
48/131K
52/131K
56/131K
60/131K
64/131K
68/131K
72/131K
76/131K
80/131K
84/131K
88/131K
92/131K
96/131K
100/131K
104/131K
108/131K
112/131K
116/131K
120/131K
120/131K
124/131K
128/131K
131/131K
131K downloaded
Error retrieving artifact from [http://people.apache.org/repo/m1-snapshot-repository/]: org.apache.maven.verifier.ChecksumVerificationException: Error retrieving checksum file for /org.apache.ws.commons.axiom/jars/axiom-dom-SNAPSHOT.jar
Skipping download as local copy is up to date!
Attempting to download axis2-kernel-SNAPSHOT.jar.
Skipping download as local copy is up to date!
build:start:

multiproject:install-callback:
    [echo] Running jar:install for Apache Axis 2.0 - Data Binding
java:prepare-filesystem:
    [mkdir] Created dir: /export/home/illsleyd/continuum/continuum-1.0.3/apps/continuum/working-directory/1/modules/adb/target/classes
Running post goal: java:prepare-filesystem

java:compile:
    [echo] Compiling to /export/home/illsleyd/continuum/continuum-1.0.3/apps/continuum/working-directory/1/modules/adb/target/classes
    [javac] Compiling 66 source files to /export/home/illsleyd/continuum/continuum-1.0.3/apps/continuum/working-directory/1/modules/adb/target/classes

java:jar-resources:
Copying 1 file to /export/home/illsleyd/continuum/continuum-1.0.3/apps/continuum/working-directory/1/modules/adb/target/classes
Copying 2 files to /export/home/illsleyd/continuum/continuum-1.0.3/apps/continuum/working-directory/1/modules/adb/target/classes/META-INF

test:test:
java:prepare-filesystem:
Running post goal: java:prepare-filesystem

java:compile:
    [echo] Compiling to /export/home/illsleyd/continuum/continuum-1.0.3/apps/continuum/working-directory/1/modules/adb/target/classes

java:jar-resources:

test:prepare-filesystem:
    [mkdir] Created dir: /export/home/illsleyd/continuum/continuum-1.0.3/apps/continuum/working-directory/1/modules/adb/target/test-classes
    [mkdir] Created dir: /export/home/illsleyd/continuum/continuum-1.0.3/apps/continuum/working-directory/1/modules/adb/target/test-reports

test:test-resources:
Copying 1 file to /export/home/illsleyd/continuum/continuum-1.0.3/apps/continuum/working-directory/1/modules/adb/target/test-classes
Copying 1 file to /export/home/illsleyd/continuum/continuum-1.0.3/apps/continuum/working-directory/1/modules/adb/target/test-classes

test:compile:
    [javac] Compiling 9 source files to /export/home/illsleyd/continuum/continuum-1.0.3/apps/continuum/working-directory/1/modules/adb/target/test-classes

    [junit] Running org.apache.axis2.databinding.ADBSOAPModelBuilderTest
    [junit] Tests run: 5, Failures: 0, Errors: 0, Time elapsed: 0.758 sec
    [junit] Running org.apache.axis2.databinding.utils.NamedStaxOMBuilderTest
    [junit] Tests run: 2, Failures: 0, Errors: 0, Time elapsed: 0.511 sec
    [junit] Running org.apache.axis2.databinding.utils.SimpleArrayReaderStateMachineTest
    [junit] Tests run: 4, Failures: 0, Errors: 0, Time elapsed: 0.478 sec
    [junit] Running org.apache.axis2.databinding.utils.SimpleElementReaderStateMachineTest
    [junit] Tests run: 3, Failures: 0, Errors: 0, Time elapsed: 0.581 sec
    [junit] Running org.apache.axis2.databinding.utils.reader.ADBXMLStreamReaderTest
    [junit] Tests run: 15, Failures: 0, Errors: 0, Time elapsed: 1.153 sec

jar:jar:
    [jar] Building jar: /export/home/illsleyd/continuum/continuum-1.0.3/apps/continuum/working-directory/1/modules/adb/target/axis2-adb-SNAPSHOT.jar

jar:install:
    [echo] Installing...
Uploading to org.apache.axis2/jars/axis2-adb-SNAPSHOT.jar: 
.................... (146K)
Uploading to org.apache.axis2/poms/axis2-adb-SNAPSHOT.pom: 
.................... (14K)

+----------------------------------------
| Executing multiproject:install-callback Apache Axis 2.0 - Code Generation
| Memory: 38M/42M
+----------------------------------------
DEPRECATED: the default goal should be specified in the <build> section of project.xml instead of maven.xml
DEPRECATED: the default goal should be specified in the <build> section of project.xml instead of maven.xml

build:end:

Trying to get missing/snapshot dependencies required by Apache Axis 2.0 - Code Generation:
Attempting to download axis2-adb-SNAPSHOT.jar.
Skipping download as local copy is up to date!
build:start:

multiproject:install-callback:
    [echo] Running jar:install for Apache Axis 2.0 - Code Generation
java:prepare-filesystem:
    [mkdir] Created dir: /export/home/illsleyd/continuum/continuum-1.0.3/apps/continuum/working-directory/1/modules/codegen/target/classes
Running post goal: java:prepare-filesystem

java:compile:
    [echo] Compiling to /export/home/illsleyd/continuum/continuum-1.0.3/apps/continuum/working-directory/1/modules/codegen/target/classes
    [javac] Compiling 69 source files to /export/home/illsleyd/continuum/continuum-1.0.3/apps/continuum/working-directory/1/modules/codegen/target/classes

java:jar-resources:
Copying 33 files to /export/home/illsleyd/continuum/continuum-1.0.3/apps/continuum/working-directory/1/modules/codegen/target/classes
Copying 2 files to /export/home/illsleyd/continuum/continuum-1.0.3/apps/continuum/working-directory/1/modules/codegen/target/classes/META-INF
Running post goal: java:jar-resources

test:test:
java:prepare-filesystem:
Running post goal: java:prepare-filesystem

java:compile:
    [echo] Compiling to /export/home/illsleyd/continuum/continuum-1.0.3/apps/continuum/working-directory/1/modules/codegen/target/classes

java:jar-resources:
Running post goal: java:jar-resources

test:prepare-filesystem:
    [mkdir] Created dir: /export/home/illsleyd/continuum/continuum-1.0.3/apps/continuum/working-directory/1/modules/codegen/target/test-classes
    [mkdir] Created dir: /export/home/illsleyd/continuum/continuum-1.0.3/apps/continuum/working-directory/1/modules/codegen/target/test-reports

test:test-resources:
Copying 6 files to /export/home/illsleyd/continuum/continuum-1.0.3/apps/continuum/working-directory/1/modules/codegen/target/test-classes
Copying 31 files to /export/home/illsleyd/continuum/continuum-1.0.3/apps/continuum/working-directory/1/modules/codegen/target/test-classes

test:compile:
    [javac] Compiling 2 source files to /export/home/illsleyd/continuum/continuum-1.0.3/apps/continuum/working-directory/1/modules/codegen/target/test-classes

    [junit] Running org.apache.axis2.wsdl.WSDLServiceBuilderTest
    [junit] Tests run: 1, Failures: 0, Errors: 0, Time elapsed: 3.935 sec
    [junit] Running org.apache.axis2.wsdl.codegen.extension.SchemaUnwrapperExtensionTest
    [junit] Tests run: 4, Failures: 0, Errors: 0, Time elapsed: 0.846 sec

jar:jar:
    [jar] Building jar: /export/home/illsleyd/continuum/continuum-1.0.3/apps/continuum/working-directory/1/modules/codegen/target/axis2-codegen-SNAPSHOT.jar

jar:install:
    [echo] Installing...
Uploading to org.apache.axis2/jars/axis2-codegen-SNAPSHOT.jar: 
.................... (179K)
Uploading to org.apache.axis2/poms/axis2-codegen-SNAPSHOT.pom: 
.................... (17K)

+----------------------------------------
| Executing multiproject:install-callback Apache Axis 2.0 - ADB Codegen
| Memory: 20M/43M
+----------------------------------------
DEPRECATED: the default goal should be specified in the <build> section of project.xml instead of maven.xml
DEPRECATED: the default goal should be specified in the <build> section of project.xml instead of maven.xml

build:end:

Trying to get missing/snapshot dependencies required by Apache Axis 2.0 - ADB Codegen:
Attempting to download axis2-codegen-SNAPSHOT.jar.
Skipping download as local copy is up to date!
build:start:

multiproject:install-callback:
    [echo] Running jar:install for Apache Axis 2.0 - ADB Codegen
java:prepare-filesystem:
    [mkdir] Created dir: /export/home/illsleyd/continuum/continuum-1.0.3/apps/continuum/working-directory/1/modules/adb-codegen/target/classes
Running post goal: java:prepare-filesystem

java:compile:
    [echo] Compiling to /export/home/illsleyd/continuum/continuum-1.0.3/apps/continuum/working-directory/1/modules/adb-codegen/target/classes
    [javac] Compiling 17 source files to /export/home/illsleyd/continuum/continuum-1.0.3/apps/continuum/working-directory/1/modules/adb-codegen/target/classes

java:jar-resources:
Copying 8 files to /export/home/illsleyd/continuum/continuum-1.0.3/apps/continuum/working-directory/1/modules/adb-codegen/target/classes
Copying 2 files to /export/home/illsleyd/continuum/continuum-1.0.3/apps/continuum/working-directory/1/modules/adb-codegen/target/classes/META-INF

test:test:
java:prepare-filesystem:
Running post goal: java:prepare-filesystem

java:compile:
    [echo] Compiling to /export/home/illsleyd/continuum/continuum-1.0.3/apps/continuum/working-directory/1/modules/adb-codegen/target/classes

java:jar-resources:

test:prepare-filesystem:
    [mkdir] Created dir: /export/home/illsleyd/continuum/continuum-1.0.3/apps/continuum/working-directory/1/modules/adb-codegen/target/test-classes
    [mkdir] Created dir: /export/home/illsleyd/continuum/continuum-1.0.3/apps/continuum/working-directory/1/modules/adb-codegen/target/test-reports

test:test-resources:
Copying 37 files to /export/home/illsleyd/continuum/continuum-1.0.3/apps/continuum/working-directory/1/modules/adb-codegen/target/test-classes
Copying 8 files to /export/home/illsleyd/continuum/continuum-1.0.3/apps/continuum/working-directory/1/modules/adb-codegen/target/test-classes

test:compile:
    [mkdir] Created dir: /export/home/illsleyd/continuum/continuum-1.0.3/apps/continuum/working-directory/1/modules/adb-codegen/target/schema
    [mkdir] Created dir: /export/home/illsleyd/continuum/continuum-1.0.3/apps/continuum/working-directory/1/modules/adb-codegen/target/schema/src
    [mkdir] Created dir: /export/home/illsleyd/continuum/continuum-1.0.3/apps/continuum/working-directory/1/modules/adb-codegen/target/schema/classes
    [echo] Compiling simple_maxOccurs2.xsd
    [echo] Compiling anonymous_complexType.xsd
    [echo] Compiling simple_choice.xsd
    [echo] Compiling simple_particle_all.xsd
    [echo] Compiling simple_maxOccurs.xsd
    [echo] Compiling simple_anytype.xsd
    [echo] Compiling simple-minoccurs0.xsd
    [echo] Compiling complex-minoccurs0.xsd
    [echo] Compiling simple-recursive-datatypes.xsd
    [echo] Compiling mixed_minoccus0.xsd
    [echo] Compiling complete.xsd
    [echo] Compiling simpleExtension.xsd
    [echo] Compiling union.xsd
    [echo] Compiling all.xsd
    [echo] Compiling enumeration.xsd
    [echo] Compiling restrictions.xsd
    [echo] Compiling choice.xsd
    [echo] Compiling list.xsd
    [echo] Compiling element_references.xsd
    [echo] Compiling innersequence_choice.xsd
    [javac] Compiling 196 source files to /export/home/illsleyd/continuum/continuum-1.0.3/apps/continuum/working-directory/1/modules/adb-codegen/target/schema/classes
    [javac] Note: Some input files use unchecked or unsafe operations.
    [javac] Note: Recompile with -Xlint:unchecked for details.
    [javac] Compiling 81 source files to /export/home/illsleyd/continuum/continuum-1.0.3/apps/continuum/working-directory/1/modules/adb-codegen/target/test-classes

    [junit] Running org.apache.axis2.schema.all.AllTest
    [junit] Tests run: 1, Failures: 0, Errors: 0, Time elapsed: 0.601 sec
    [junit] Running org.apache.axis2.schema.choice.ChiceTest
    [junit] Tests run: 1, Failures: 0, Errors: 0, Time elapsed: 0.623 sec
    [junit] Running org.apache.axis2.schema.compile.AnonymousComplexTypeTest
    [junit] Tests run: 1, Failures: 0, Errors: 0, Time elapsed: 3.074 sec
    [junit] Running org.apache.axis2.schema.compile.ComplexAllTest
    [junit] Tests run: 1, Failures: 0, Errors: 0, Time elapsed: 3.765 sec
    [junit] Running org.apache.axis2.schema.compile.ComplexExtensionTest
    [junit] Tests run: 1, Failures: 0, Errors: 0, Time elapsed: 3.472 sec
    [junit] Running org.apache.axis2.schema.compile.ImportTest
    [junit] Tests run: 1, Failures: 0, Errors: 0, Time elapsed: 3.396 sec
    [junit] Running org.apache.axis2.schema.compile.RecursiveCompileTest
    [junit] Tests run: 1, Failures: 0, Errors: 0, Time elapsed: 3.523 sec
    [junit] Running org.apache.axis2.schema.compile.SimpleAnyAttribTest
    [junit] Tests run: 1, Failures: 0, Errors: 0, Time elapsed: 3.401 sec
    [junit] Running org.apache.axis2.schema.compile.SimpleAnyTest
    [junit] Tests run: 1, Failures: 0, Errors: 0, Time elapsed: 3.016 sec
    [junit] Running org.apache.axis2.schema.compile.SimpleAnyTypeTest
    [junit] Tests run: 1, Failures: 0, Errors: 0, Time elapsed: 3.186 sec
    [junit] Running org.apache.axis2.schema.compile.SimpleAttributeTest
    [junit] Tests run: 1, Failures: 0, Errors: 0, Time elapsed: 3.104 sec
    [junit] Running org.apache.axis2.schema.compile.SimpleChoiceTest
    [junit] Tests run: 1, Failures: 0, Errors: 0, Time elapsed: 3.294 sec
    [junit] Running org.apache.axis2.schema.compile.SimpleContentExtensionTest
    [junit] Tests run: 1, Failures: 0, Errors: 0, Time elapsed: 3.352 sec
    [junit] Running org.apache.axis2.schema.compile.SimpleElementReferenceTest
    [junit] Tests run: 1, Failures: 0, Errors: 0, Time elapsed: 3.336 sec
    [junit] Running org.apache.axis2.schema.compile.SimpleElementTest
    [junit] Tests run: 1, Failures: 0, Errors: 0, Time elapsed: 4.072 sec
    [junit] Running org.apache.axis2.schema.compile.SimpleParticleAllTest
    [junit] Tests run: 1, Failures: 0, Errors: 0, Time elapsed: 3.094 sec
    [junit] Running org.apache.axis2.schema.compile.SimpleRestrictionTest
    [junit] Tests run: 1, Failures: 0, Errors: 0, Time elapsed: 3.644 sec
    [junit] Running org.apache.axis2.schema.compile.SimpleSequence2Test
    [junit] Tests run: 1, Failures: 0, Errors: 0, Time elapsed: 3.103 sec
    [junit] Running org.apache.axis2.schema.compile.SimpleSequenceTest
    [junit] Tests run: 1, Failures: 0, Errors: 0, Time elapsed: 3.085 sec
    [junit] Running org.apache.axis2.schema.compile.XmlMaxOccurs2Test
    [junit] Tests run: 1, Failures: 0, Errors: 0, Time elapsed: 3.5 sec
    [junit] Running org.apache.axis2.schema.compile.XmlmaxOccursTest
    [junit] Tests run: 1, Failures: 0, Errors: 0, Time elapsed: 3.161 sec
    [junit] Running org.apache.axis2.schema.compile.simple.SimpleTypeAllCompileTest
    [junit] Tests run: 1, Failures: 0, Errors: 0, Time elapsed: 3.807 sec
    [junit] Running org.apache.axis2.schema.enumeration.EnumerationTest
    [junit] Tests run: 1, Failures: 0, Errors: 0, Time elapsed: 0.576 sec
    [junit] Running org.apache.axis2.schema.extension.ComplexExtenstionTest
    [junit] Tests run: 1, Failures: 0, Errors: 0, Time elapsed: 0.614 sec
    [junit] Running org.apache.axis2.schema.extension.SimpleExtensionTest
    [junit] Tests run: 1, Failures: 0, Errors: 0, Time elapsed: 0.703 sec
    [junit] Running org.apache.axis2.schema.innerChoice.InnerChoiceTest
    [junit] Tests run: 5, Failures: 0, Errors: 0, Time elapsed: 0.614 sec
    [junit] Running org.apache.axis2.schema.list.ListTest
    [junit] Tests run: 5, Failures: 0, Errors: 0, Time elapsed: 0.686 sec
    [junit] Running org.apache.axis2.schema.populate.derived.DerivedTypeBytePopulateTest
    [junit] Tests run: 1, Failures: 0, Errors: 0, Time elapsed: 0.705 sec
    [junit] Running org.apache.axis2.schema.populate.derived.DerivedTypeIntPopulateTest
    [junit] Tests run: 1, Failures: 0, Errors: 0, Time elapsed: 0.865 sec
    [junit] Running org.apache.axis2.schema.populate.derived.DerivedTypeIntegerPopulateTest
    [junit] Tests run: 1, Failures: 0, Errors: 0, Time elapsed: 0.996 sec
    [junit] Running org.apache.axis2.schema.populate.derived.DerivedTypeLongPopulateTest
    [junit] Tests run: 1, Failures: 0, Errors: 0, Time elapsed: 1.187 sec
    [junit] Running org.apache.axis2.schema.populate.derived.DerivedTypeNegativeIntegerPopulateTest
    [junit] Tests run: 1, Failures: 0, Errors: 0, Time elapsed: 0.693 sec
    [junit] Running org.apache.axis2.schema.populate.derived.DerivedTypeNonNegativeIntegerPopulateTest
    [junit] Tests run: 1, Failures: 0, Errors: 0, Time elapsed: 0.778 sec
    [junit] Running org.apache.axis2.schema.populate.derived.DerivedTypeNonPositiveIntegerPopulateTest
    [junit] Tests run: 1, Failures: 0, Errors: 0, Time elapsed: 0.703 sec
    [junit] Running org.apache.axis2.schema.populate.derived.DerivedTypePositveIntegerPopulateTest
    [junit] Tests run: 1, Failures: 0, Errors: 0, Time elapsed: 0.678 sec
    [junit] Running org.apache.axis2.schema.populate.derived.DerivedTypeShortPopulateTest
    [junit] Tests run: 1, Failures: 0, Errors: 0, Time elapsed: 0.767 sec
    [junit] Running org.apache.axis2.schema.populate.derived.DerivedTypeUnsignedBytePopulateTest
    [junit] Tests run: 1, Failures: 0, Errors: 0, Time elapsed: 0.708 sec
    [junit] Running org.apache.axis2.schema.populate.derived.DerivedTypeUnsignedIntPopulateTest
    [junit] Tests run: 1, Failures: 0, Errors: 0, Time elapsed: 0.903 sec
    [junit] Running org.apache.axis2.schema.populate.derived.DerivedTypeUnsignedLongPopulateTest
    [junit] Tests run: 1, Failures: 0, Errors: 0, Time elapsed: 0.712 sec
    [junit] Running org.apache.axis2.schema.populate.derived.DerivedTypeUnsignedShortPopulateTest
    [junit] Tests run: 1, Failures: 0, Errors: 0, Time elapsed: 0.727 sec
    [junit] Running org.apache.axis2.schema.populate.other.ADBInOutTest
    [junit] Tests run: 2, Failures: 0, Errors: 0, Time elapsed: 0.53 sec
    [junit] Running org.apache.axis2.schema.populate.other.PopulateAnonComplexTypeTest
    [junit] Tests run: 1, Failures: 0, Errors: 0, Time elapsed: 0.579 sec
    [junit] Running org.apache.axis2.schema.populate.other.PopulateAnyTypeTest
    [junit] Tests run: 1, Failures: 0, Errors: 0, Time elapsed: 0.595 sec
    [junit] Running org.apache.axis2.schema.populate.other.PopulateArrayInArrayTest
    [junit] Tests run: 1, Failures: 0, Errors: 0, Time elapsed: 0.535 sec
    [junit] Running org.apache.axis2.schema.populate.other.PopulateArrayTest
    [junit] Tests run: 1, Failures: 0, Errors: 0, Time elapsed: 0.581 sec
    [junit] Running org.apache.axis2.schema.populate.other.PopulateChoiceTest
    [junit] Tests run: 1, Failures: 0, Errors: 0, Time elapsed: 0.607 sec
    [junit] Running org.apache.axis2.schema.populate.other.PopulateComplexMinOccurs0Test
    [junit] Tests run: 4, Failures: 0, Errors: 0, Time elapsed: 0.866 sec
    [junit] Running org.apache.axis2.schema.populate.other.PopulateMinOccurs0Test
    [junit] Tests run: 3, Failures: 0, Errors: 0, Time elapsed: 0.577 sec
    [junit] Running org.apache.axis2.schema.populate.other.PopulateMixedMinoccurs0Test
    [junit] Tests run: 2, Failures: 0, Errors: 0, Time elapsed: 0.526 sec
    [junit] Running org.apache.axis2.schema.populate.other.PopulateParticleAllTest
    [junit] Tests run: 1, Failures: 0, Errors: 0, Time elapsed: 0.524 sec
    [junit] Running org.apache.axis2.schema.populate.other.PopulateRecursiveTest
    [junit] Tests run: 1, Failures: 0, Errors: 0, Time elapsed: 0.524 sec
    [junit] Running org.apache.axis2.schema.populate.simple.SimpleTypeAnyURIPopulateTest
    [junit] Tests run: 1, Failures: 0, Errors: 0, Time elapsed: 0.528 sec
    [junit] Running org.apache.axis2.schema.populate.simple.SimpleTypeBase64BinPopulateTest
    [junit] Tests run: 1, Failures: 0, Errors: 0, Time elapsed: 0.604 sec
    [junit] Running org.apache.axis2.schema.populate.simple.SimpleTypeBooleanPopulateTest
    [junit] Tests run: 1, Failures: 0, Errors: 0, Time elapsed: 0.657 sec
    [junit] Running org.apache.axis2.schema.populate.simple.SimpleTypeDatePopulateTest
    [junit] Tests run: 1, Failures: 0, Errors: 0, Time elapsed: 0.577 sec
    [junit] Running org.apache.axis2.schema.populate.simple.SimpleTypeDateTimePopulateTest
    [junit] Tests run: 1, Failures: 0, Errors: 0, Time elapsed: 0.53 sec
    [junit] Running org.apache.axis2.schema.populate.simple.SimpleTypeDayPopulateTest
    [junit] Tests run: 1, Failures: 0, Errors: 0, Time elapsed: 0.504 sec
    [junit] Running org.apache.axis2.schema.populate.simple.SimpleTypeDoublePopulateTest
    [junit] Tests run: 1, Failures: 0, Errors: 0, Time elapsed: 0.545 sec
    [junit] Running org.apache.axis2.schema.populate.simple.SimpleTypeDurationPopulateTest
    [junit] Tests run: 1, Failures: 0, Errors: 0, Time elapsed: 0.547 sec
    [junit] Running org.apache.axis2.schema.populate.simple.SimpleTypeFloatPopulateTest
    [junit] Tests run: 1, Failures: 0, Errors: 0, Time elapsed: 0.522 sec
    [junit] Running org.apache.axis2.schema.populate.simple.SimpleTypeHexBinaryPopulateTest
    [junit] Tests run: 1, Failures: 0, Errors: 0, Time elapsed: 0.519 sec
    [junit] Running org.apache.axis2.schema.populate.simple.SimpleTypeMonthDayPopulateTest
    [junit] Tests run: 1, Failures: 0, Errors: 0, Time elapsed: 0.864 sec
    [junit] Running org.apache.axis2.schema.populate.simple.SimpleTypeQNamePopulateTest
    [junit] Tests run: 1, Failures: 0, Errors: 0, Time elapsed: 0.616 sec
    [junit] Running org.apache.axis2.schema.populate.simple.SimpleTypeTimePopulateTest
    [junit] Tests run: 1, Failures: 0, Errors: 0, Time elapsed: 0.772 sec
    [junit] Running org.apache.axis2.schema.populate.simple.SimpleTypegMonthPopulateTest
    [junit] Tests run: 1, Failures: 0, Errors: 0, Time elapsed: 0.545 sec
    [junit] Running org.apache.axis2.schema.populate.simple.SimpleTypegYearMonthPopulateTest
    [junit] Tests run: 1, Failures: 0, Errors: 0, Time elapsed: 0.527 sec
    [junit] Running org.apache.axis2.schema.populate.simple.SimpleTypegYearPopulateTest
    [junit] Tests run: 1, Failures: 0, Errors: 0, Time elapsed: 0.525 sec
    [junit] Running org.apache.axis2.schema.references.ElementReferenceTest
    [junit] Tests run: 2, Failures: 0, Errors: 0, Time elapsed: 0.662 sec
    [junit] Running org.apache.axis2.schema.restriction.ComplexRestrictionTest
    [junit] Tests run: 1, Failures: 0, Errors: 0, Time elapsed: 0.318 sec
    [junit] Running org.apache.axis2.schema.restriction.SimpleRestrictionTest
    [junit] Tests run: 5, Failures: 0, Errors: 0, Time elapsed: 0.732 sec
    [junit] Running org.apache.axis2.schema.testsuite.AnyElementsTest
    [junit] Tests run: 3, Failures: 0, Errors: 0, Time elapsed: 0.861 sec
    [junit] Running org.apache.axis2.schema.testsuite.CustomElementsTest
    [junit] Tests run: 3, Failures: 0, Errors: 0, Time elapsed: 0.624 sec
    [junit] Running org.apache.axis2.schema.testsuite.IntElementsTest
    [junit] Tests run: 3, Failures: 0, Errors: 0, Time elapsed: 0.718 sec
    [junit] Running org.apache.axis2.schema.testsuite.OuterElementsTest
    [junit] Tests run: 5, Failures: 0, Errors: 0, Time elapsed: 0.757 sec
    [junit] Running org.apache.axis2.schema.testsuite.StringElementsTest
    [junit] Tests run: 3, Failures: 0, Errors: 0, Time elapsed: 0.74 sec
    [junit] Running org.apache.axis2.schema.testsuite.XsdAnyElementsTest
    [junit] Tests run: 3, Failures: 0, Errors: 0, Time elapsed: 0.703 sec
    [junit] Running org.apache.axis2.schema.union.UnionTest
    [junit] Tests run: 4, Failures: 0, Errors: 0, Time elapsed: 0.656 sec

jar:jar:
    [jar] Building jar: /export/home/illsleyd/continuum/continuum-1.0.3/apps/continuum/working-directory/1/modules/adb-codegen/target/axis2-adb-codegen-SNAPSHOT.jar

jar:install:
    [echo] Installing...
Uploading to org.apache.axis2/jars/axis2-adb-codegen-SNAPSHOT.jar: 
.................... (121K)
Uploading to org.apache.axis2/poms/axis2-adb-codegen-SNAPSHOT.pom: 
.................... (15K)

+----------------------------------------
| Executing multiproject:install-callback Apache Axis 2.0 - Addressing
| Memory: 29M/59M
+----------------------------------------
DEPRECATED: the default goal should be specified in the <build> section of project.xml instead of maven.xml
DEPRECATED: the default goal should be specified in the <build> section of project.xml instead of maven.xml

build:end:

build:start:

multiproject:install-callback:
    [echo] Running jar:install for Apache Axis 2.0 - Addressing
java:prepare-filesystem:
    [mkdir] Created dir: /export/home/illsleyd/continuum/continuum-1.0.3/apps/continuum/working-directory/1/modules/addressing/target/classes
Running post goal: java:prepare-filesystem

java:compile:
    [echo] Compiling to /export/home/illsleyd/continuum/continuum-1.0.3/apps/continuum/working-directory/1/modules/addressing/target/classes
    [javac] Compiling 9 source files to /export/home/illsleyd/continuum/continuum-1.0.3/apps/continuum/working-directory/1/modules/addressing/target/classes
Running post goal: java:compile
    [mkdir] Created dir: /export/home/illsleyd/continuum/continuum-1.0.3/apps/continuum/working-directory/1/modules/addressing/target/classes/META-INF
    [copy] Copying 1 file to /export/home/illsleyd/continuum/continuum-1.0.3/apps/continuum/working-directory/1/modules/addressing/target/classes/META-INF
    [copy] Copying 1 file to /export/home/illsleyd/continuum/continuum-1.0.3/apps/continuum/working-directory/1/modules/addressing/target/classes/META-INF
    [copy] Copying 1 file to /export/home/illsleyd/continuum/continuum-1.0.3/apps/continuum/working-directory/1/modules/addressing/target/classes/META-INF
    [copy] Copying 1 file to /export/home/illsleyd/continuum/continuum-1.0.3/apps/continuum/working-directory/1/modules/addressing/target
    [mkdir] Created dir: /export/home/illsleyd/continuum/continuum-1.0.3/apps/continuum/working-directory/1/modules/addressing/target/modules
    [jar] Building jar: /export/home/illsleyd/continuum/continuum-1.0.3/apps/continuum/working-directory/1/modules/addressing/target/addressing-SNAPSHOT.mar
    [copy] Copying 1 file to /export/home/illsleyd/continuum/continuum-1.0.3/apps/continuum/working-directory/1/modules/addressing/target/modules
    [copy] Copying 1 file to /export/home/illsleyd/.maven/repository/org.apache.axis2/mars

java:jar-resources:
Copying 1 file to /export/home/illsleyd/continuum/continuum-1.0.3/apps/continuum/working-directory/1/modules/addressing/target/classes

test:test:
java:prepare-filesystem:
Running post goal: java:prepare-filesystem

java:compile:
    [echo] Compiling to /export/home/illsleyd/continuum/continuum-1.0.3/apps/continuum/working-directory/1/modules/addressing/target/classes
Running post goal: java:compile
    [copy] Copying 1 file to /export/home/illsleyd/continuum/continuum-1.0.3/apps/continuum/working-directory/1/modules/addressing/target/classes/META-INF
    [copy] Copying 1 file to /export/home/illsleyd/continuum/continuum-1.0.3/apps/continuum/working-directory/1/modules/addressing/target/classes/META-INF
    [jar] Building jar: /export/home/illsleyd/continuum/continuum-1.0.3/apps/continuum/working-directory/1/modules/addressing/target/addressing-SNAPSHOT.mar
    [copy] Copying 1 file to /export/home/illsleyd/continuum/continuum-1.0.3/apps/continuum/working-directory/1/modules/addressing/target/modules
    [copy] Copying 1 file to /export/home/illsleyd/.maven/repository/org.apache.axis2/mars

java:jar-resources:

test:prepare-filesystem:
    [mkdir] Created dir: /export/home/illsleyd/continuum/continuum-1.0.3/apps/continuum/working-directory/1/modules/addressing/target/test-classes
    [mkdir] Created dir: /export/home/illsleyd/continuum/continuum-1.0.3/apps/continuum/working-directory/1/modules/addressing/target/test-reports

test:test-resources:
Copying 35 files to /export/home/illsleyd/continuum/continuum-1.0.3/apps/continuum/working-directory/1/modules/addressing/target/test-classes
Copying 2 files to /export/home/illsleyd/continuum/continuum-1.0.3/apps/continuum/working-directory/1/modules/addressing/target/test-classes

test:compile:
    [javac] Compiling 8 source files to /export/home/illsleyd/continuum/continuum-1.0.3/apps/continuum/working-directory/1/modules/addressing/target/test-classes
    [javac] Note: /export/home/illsleyd/continuum/continuum-1.0.3/apps/continuum/working-directory/1/modules/addressing/test/org/apache/axis2/handlers/addressing/AddressingOutHandlerTest.java uses or overrides a deprecated API.
    [javac] Note: Recompile with -Xlint:deprecation for details.

    [junit] Running org.apache.axis2.addressing.AddressingFaultsTest
    [junit] Tests run: 6, Failures: 0, Errors: 0, Time elapsed: 0.407 sec
    [junit] Running org.apache.axis2.handlers.addressing.AddressingFinalInHandlerTest
    [junit] Tests run: 17, Failures: 0, Errors: 0, Time elapsed: 0.854 sec
    [junit] Running org.apache.axis2.handlers.addressing.AddressingInFaultHandlerTest
    [junit] Tests run: 4, Failures: 0, Errors: 0, Time elapsed: 0.902 sec
    [junit] Running org.apache.axis2.handlers.addressing.AddressingOutHandlerTest
    [junit] Tests run: 6, Failures: 0, Errors: 0, Time elapsed: 1.518 sec
    [junit] Running org.apache.axis2.handlers.addressing.AddressingSubmissionInHandlerTest
    [junit] Tests run: 14, Failures: 0, Errors: 0, Time elapsed: 0.862 sec
    [junit] Running org.apache.axis2.handlers.addressing.AddressingValidationHandlerTest
    [junit] Tests run: 4, Failures: 0, Errors: 0, Time elapsed: 1.263 sec

jar:jar:
    [jar] Building jar: /export/home/illsleyd/continuum/continuum-1.0.3/apps/continuum/working-directory/1/modules/addressing/target/axis2-addressing-SNAPSHOT.jar

jar:install:
    [echo] Installing...
Uploading to org.apache.axis2/jars/axis2-addressing-SNAPSHOT.jar: 
.................... (38K)
Uploading to org.apache.axis2/poms/axis2-addressing-SNAPSHOT.pom: 
.................... (15K)

+----------------------------------------
| Executing multiproject:install-callback Apache Axis 2.0 - Samples
| Memory: 28M/60M
+----------------------------------------
DEPRECATED: the default goal should be specified in the <build> section of project.xml instead of maven.xml
DEPRECATED: the default goal should be specified in the <build> section of project.xml instead of maven.xml

build:end:

Trying to get missing/snapshot dependencies required by Apache Axis 2.0 - Samples:
Attempting to download axis2-addressing-SNAPSHOT.jar.
Skipping download as local copy is up to date!
build:start:

multiproject:install-callback:
    [echo] Running jar:install for Apache Axis 2.0 - Samples
java:prepare-filesystem:
    [mkdir] Created dir: /export/home/illsleyd/continuum/continuum-1.0.3/apps/continuum/working-directory/1/modules/samples/target/classes
Running post goal: java:prepare-filesystem

java:compile:
    [echo] Compiling to /export/home/illsleyd/continuum/continuum-1.0.3/apps/continuum/working-directory/1/modules/samples/target/classes
    [javac] Compiling 5 source files to /export/home/illsleyd/continuum/continuum-1.0.3/apps/continuum/working-directory/1/modules/samples/target/classes

java:jar-resources:
Copying 2 files to /export/home/illsleyd/continuum/continuum-1.0.3/apps/continuum/working-directory/1/modules/samples/target/classes/META-INF

test:test:
java:prepare-filesystem:
Running post goal: java:prepare-filesystem

java:compile:
Overriding previous definition of reference to samples.src.path
    [echo] Compiling to /export/home/illsleyd/continuum/continuum-1.0.3/apps/continuum/working-directory/1/modules/samples/target/classes

java:jar-resources:

test:prepare-filesystem:
    [mkdir] Created dir: /export/home/illsleyd/continuum/continuum-1.0.3/apps/continuum/working-directory/1/modules/samples/target/test-classes
    [mkdir] Created dir: /export/home/illsleyd/continuum/continuum-1.0.3/apps/continuum/working-directory/1/modules/samples/target/test-reports

test:test-resources:

test:compile:

Running post goal: test:test
create-samples:
    [mkdir] Created dir: /export/home/illsleyd/continuum/continuum-1.0.3/apps/continuum/working-directory/1/modules/samples/target/samples/userguide
    [mkdir] Created dir: /export/home/illsleyd/continuum/continuum-1.0.3/apps/continuum/working-directory/1/modules/samples/target/samples/wsdl
    [copy] Copying 2 files to /export/home/illsleyd/continuum/continuum-1.0.3/apps/continuum/working-directory/1/modules/samples/target/samples/wsdl
userguide:
    [mkdir] Created dir: /export/home/illsleyd/continuum/continuum-1.0.3/apps/continuum/working-directory/1/modules/samples/target/samples/userguide/src
    [copy] Copying 22 files to /export/home/illsleyd/continuum/continuum-1.0.3/apps/continuum/working-directory/1/modules/samples/target/samples/userguide/src
    [jar] Building MANIFEST-only jar: /export/home/illsleyd/continuum/continuum-1.0.3/apps/continuum/working-directory/1/modules/samples/target/samples/userguide/sample.jar

googleSpellcheck:
    [mkdir] Created dir: /export/home/illsleyd/continuum/continuum-1.0.3/apps/continuum/working-directory/1/modules/samples/target/googlespellcheck
    [jar] Building MANIFEST-only jar: /export/home/illsleyd/continuum/continuum-1.0.3/apps/continuum/working-directory/1/modules/samples/target/googlespellcheck/googleSpellcheck.jar

yahooRESTSearch:
    [mkdir] Created dir: /export/home/illsleyd/continuum/continuum-1.0.3/apps/continuum/working-directory/1/modules/samples/target/yahoorestsearch
    [jar] Building jar: /export/home/illsleyd/continuum/continuum-1.0.3/apps/continuum/working-directory/1/modules/samples/target/yahoorestsearch/yahooRESTSearch.jar

version:
    [mkdir] Created dir: /export/home/illsleyd/continuum/continuum-1.0.3/apps/continuum/working-directory/1/modules/samples/target/version
    [jar] Building jar: /export/home/illsleyd/continuum/continuum-1.0.3/apps/continuum/working-directory/1/modules/samples/target/version/version.jar
    [copy] Copying 1 file to /export/home/illsleyd/continuum/continuum-1.0.3/apps/continuum/working-directory/1/modules/samples/target/toWar/services

groovy:
    [mkdir] Created dir: /export/home/illsleyd/continuum/continuum-1.0.3/apps/continuum/working-directory/1/modules/samples/target/groovy
    [copy] Copying 1 file to /export/home/illsleyd/continuum/continuum-1.0.3/apps/continuum/working-directory/1/modules/samples/target/classes/sample/groovy
    [mkdir] Created dir: /export/home/illsleyd/continuum/continuum-1.0.3/apps/continuum/working-directory/1/modules/samples/target/classes/sample/groovy/lib
    [mkdir] Created dir: /export/home/illsleyd/continuum/continuum-1.0.3/apps/continuum/working-directory/1/modules/samples/target/classes/sample/groovy/META-INF
    [mkdir] Created dir: /export/home/illsleyd/continuum/continuum-1.0.3/apps/continuum/working-directory/1/modules/samples/target/classes/sample/groovy/sample
    [mkdir] Created dir: /export/home/illsleyd/continuum/continuum-1.0.3/apps/continuum/working-directory/1/modules/samples/target/classes/sample/groovy/sample/groovy
    [copy] Copying 1 file to /export/home/illsleyd/continuum/continuum-1.0.3/apps/continuum/working-directory/1/modules/samples/target/classes/sample/groovy/sample/groovy
    [copy] Copying 1 file to /export/home/illsleyd/continuum/continuum-1.0.3/apps/continuum/working-directory/1/modules/samples/target/classes/sample/groovy/META-INF
    [delete] Deleting: /export/home/illsleyd/continuum/continuum-1.0.3/apps/continuum/working-directory/1/modules/samples/target/classes/sample/groovy/GroovyReceiver.class
    [copy] Copying 1 file to /export/home/illsleyd/continuum/continuum-1.0.3/apps/continuum/working-directory/1/modules/samples/target/classes/sample/groovy/lib
    [jar] Building jar: /export/home/illsleyd/continuum/continuum-1.0.3/apps/continuum/working-directory/1/modules/samples/target/groovy/groovyService.aar



jar:jar:
    [jar] Building jar: /export/home/illsleyd/continuum/continuum-1.0.3/apps/continuum/working-directory/1/modules/samples/target/axis2-samples-SNAPSHOT.jar

jar:install:
    [echo] Installing...
Uploading to org.apache.axis2/jars/axis2-samples-SNAPSHOT.jar: 
.................... (1623K)
Uploading to org.apache.axis2/poms/axis2-samples-SNAPSHOT.pom: 
.................... (16K)

+----------------------------------------
| Executing multiproject:install-callback Apache Axis 2.0 - spring
| Memory: 29M/60M
+----------------------------------------
DEPRECATED: the default goal should be specified in the <build> section of project.xml instead of maven.xml
DEPRECATED: the default goal should be specified in the <build> section of project.xml instead of maven.xml

build:end:

build:start:

multiproject:install-callback:
    [echo] Running jar:install for Apache Axis 2.0 - spring
java:prepare-filesystem:
    [mkdir] Created dir: /export/home/illsleyd/continuum/continuum-1.0.3/apps/continuum/working-directory/1/modules/spring/target/classes
Running post goal: java:prepare-filesystem

java:compile:
    [echo] Compiling to /export/home/illsleyd/continuum/continuum-1.0.3/apps/continuum/working-directory/1/modules/spring/target/classes
    [javac] Compiling 3 source files to /export/home/illsleyd/continuum/continuum-1.0.3/apps/continuum/working-directory/1/modules/spring/target/classes

java:jar-resources:
Copying 2 files to /export/home/illsleyd/continuum/continuum-1.0.3/apps/continuum/working-directory/1/modules/spring/target/classes/META-INF

test:test:
    [echo] No tests to run.

jar:jar:
    [jar] Building jar: /export/home/illsleyd/continuum/continuum-1.0.3/apps/continuum/working-directory/1/modules/spring/target/axis2-spring-SNAPSHOT.jar

jar:install:
    [echo] Installing...
Uploading to org.apache.axis2/jars/axis2-spring-SNAPSHOT.jar: 
.................... (9K)
Uploading to org.apache.axis2/poms/axis2-spring-SNAPSHOT.pom: 
.................... (14K)

+----------------------------------------
| Executing multiproject:install-callback Apache Axis 2.0 - XMLBeans Data Binding
| Memory: 48M/60M
+----------------------------------------
DEPRECATED: the default goal should be specified in the <build> section of project.xml instead of maven.xml
DEPRECATED: the default goal should be specified in the <build> section of project.xml instead of maven.xml

build:end:

build:start:

multiproject:install-callback:
    [echo] Running jar:install for Apache Axis 2.0 - XMLBeans Data Binding
java:prepare-filesystem:
    [mkdir] Created dir: /export/home/illsleyd/continuum/continuum-1.0.3/apps/continuum/working-directory/1/modules/xmlbeans/target/classes
Running post goal: java:prepare-filesystem

java:compile:
    [echo] Compiling to /export/home/illsleyd/continuum/continuum-1.0.3/apps/continuum/working-directory/1/modules/xmlbeans/target/classes
    [javac] Compiling 2 source files to /export/home/illsleyd/continuum/continuum-1.0.3/apps/continuum/working-directory/1/modules/xmlbeans/target/classes

java:jar-resources:
Copying 1 file to /export/home/illsleyd/continuum/continuum-1.0.3/apps/continuum/working-directory/1/modules/xmlbeans/target/classes
Copying 2 files to /export/home/illsleyd/continuum/continuum-1.0.3/apps/continuum/working-directory/1/modules/xmlbeans/target/classes/META-INF

test:test:
java:prepare-filesystem:
Running post goal: java:prepare-filesystem

java:compile:
    [echo] Compiling to /export/home/illsleyd/continuum/continuum-1.0.3/apps/continuum/working-directory/1/modules/xmlbeans/target/classes

java:jar-resources:

test:prepare-filesystem:
    [mkdir] Created dir: /export/home/illsleyd/continuum/continuum-1.0.3/apps/continuum/working-directory/1/modules/xmlbeans/target/test-classes
    [mkdir] Created dir: /export/home/illsleyd/continuum/continuum-1.0.3/apps/continuum/working-directory/1/modules/xmlbeans/target/test-reports

test:test-resources:
Copying 23 files to /export/home/illsleyd/continuum/continuum-1.0.3/apps/continuum/working-directory/1/modules/xmlbeans/target/test-classes
Copying 1 file to /export/home/illsleyd/continuum/continuum-1.0.3/apps/continuum/working-directory/1/modules/xmlbeans/target/test-classes

test:compile:
    [javac] Compiling 16 source files to /export/home/illsleyd/continuum/continuum-1.0.3/apps/continuum/working-directory/1/modules/xmlbeans/target/test-classes

    [junit] Running org.apache.axis2.xmlbeans.WSDL2Java10Test
    [junit] Tests run: 1, Failures: 0, Errors: 0, Time elapsed: 22.594 sec
    [junit] Running org.apache.axis2.xmlbeans.WSDL2Java11Test
    [junit] Tests run: 1, Failures: 0, Errors: 0, Time elapsed: 26.198 sec
    [junit] Running org.apache.axis2.xmlbeans.WSDL2Java12Test
    [junit] Tests run: 1, Failures: 0, Errors: 0, Time elapsed: 4.049 sec
    [junit] Running org.apache.axis2.xmlbeans.WSDL2Java13Test
    [junit] Tests run: 1, Failures: 0, Errors: 0, Time elapsed: 0.686 sec
    [junit] Running org.apache.axis2.xmlbeans.WSDL2Java1Test
    [junit] Tests run: 1, Failures: 0, Errors: 0, Time elapsed: 20.615 sec
    [junit] Running org.apache.axis2.xmlbeans.WSDL2Java2Test
    [junit] Tests run: 1, Failures: 0, Errors: 0, Time elapsed: 1.569 sec
    [junit] Running org.apache.axis2.xmlbeans.WSDL2Java3Test
    [junit] Tests run: 1, Failures: 0, Errors: 0, Time elapsed: 16.439 sec
    [junit] Running org.apache.axis2.xmlbeans.WSDL2Java4Test
    [junit] Tests run: 1, Failures: 0, Errors: 0, Time elapsed: 19.664 sec
    [junit] Running org.apache.axis2.xmlbeans.WSDL2Java5Test
    [junit] Tests run: 1, Failures: 0, Errors: 0, Time elapsed: 25.238 sec
    [junit] Running org.apache.axis2.xmlbeans.WSDL2Java6Test
    [junit] Tests run: 1, Failures: 0, Errors: 0, Time elapsed: 20.313 sec
    [junit] Running org.apache.axis2.xmlbeans.WSDL2Java7Test
    [junit] Tests run: 1, Failures: 0, Errors: 0, Time elapsed: 17.419 sec
    [junit] Running org.apache.axis2.xmlbeans.WSDL2Java8Test
    [junit] Tests run: 1, Failures: 0, Errors: 0, Time elapsed: 24.044 sec
    [junit] Running org.apache.axis2.xmlbeans.WSDL2Java9Test
    [junit] Tests run: 1, Failures: 0, Errors: 0, Time elapsed: 21.835 sec

jar:jar:
    [jar] Building jar: /export/home/illsleyd/continuum/continuum-1.0.3/apps/continuum/working-directory/1/modules/xmlbeans/target/axis2-xmlbeans-SNAPSHOT.jar

jar:install:
    [echo] Installing...
Uploading to org.apache.axis2/jars/axis2-xmlbeans-SNAPSHOT.jar: 
.................... (22K)
Uploading to org.apache.axis2/poms/axis2-xmlbeans-SNAPSHOT.pom: 
.................... (15K)

+----------------------------------------
| Executing multiproject:install-callback Apache Axis 2.0 - Tools
| Memory: 53M/61M
+----------------------------------------
DEPRECATED: the default goal should be specified in the <build> section of project.xml instead of maven.xml
DEPRECATED: the default goal should be specified in the <build> section of project.xml instead of maven.xml

build:end:

build:start:

multiproject:install-callback:
    [echo] Running jar:install for Apache Axis 2.0 - Tools
java:prepare-filesystem:
    [mkdir] Created dir: /export/home/illsleyd/continuum/continuum-1.0.3/apps/continuum/working-directory/1/modules/tool/target/classes
Running post goal: java:prepare-filesystem

java:compile:
    [echo] Compiling to /export/home/illsleyd/continuum/continuum-1.0.3/apps/continuum/working-directory/1/modules/tool/target/classes
    [javac] Compiling 1 source file to /export/home/illsleyd/continuum/continuum-1.0.3/apps/continuum/working-directory/1/modules/tool/target/classes

java:jar-resources:
Copying 2 files to /export/home/illsleyd/continuum/continuum-1.0.3/apps/continuum/working-directory/1/modules/tool/target/classes
Copying 2 files to /export/home/illsleyd/continuum/continuum-1.0.3/apps/continuum/working-directory/1/modules/tool/target/classes/META-INF

test:test:
    [echo] No tests to run.

jar:jar:
    [jar] Building jar: /export/home/illsleyd/continuum/continuum-1.0.3/apps/continuum/working-directory/1/modules/tool/target/axis2-tools-SNAPSHOT.jar

jar:install:
    [echo] Installing...
Uploading to org.apache.axis2/jars/axis2-tools-SNAPSHOT.jar: 
.................... (9K)
Uploading to org.apache.axis2/poms/axis2-tools-SNAPSHOT.pom: 
.................... (13K)

+----------------------------------------
| Executing multiproject:install-callback Apache Axis 2.0 - Integration
| Memory: 47M/61M
+----------------------------------------
DEPRECATED: the default goal should be specified in the <build> section of project.xml instead of maven.xml
DEPRECATED: the default goal should be specified in the <build> section of project.xml instead of maven.xml

build:end:

Trying to get missing/snapshot dependencies required by Apache Axis 2.0 - Integration:
Attempting to download axis2-adb-codegen-SNAPSHOT.jar.
Skipping download as local copy is up to date!
Attempting to download axis2-samples-SNAPSHOT.jar.
Skipping download as local copy is up to date!
Attempting to download axis2-spring-SNAPSHOT.jar.
Skipping download as local copy is up to date!
Attempting to download axis2-xmlbeans-SNAPSHOT.jar.
Skipping download as local copy is up to date!
Attempting to download axis2-tools-SNAPSHOT.jar.
Skipping download as local copy is up to date!
build:start:

multiproject:install-callback:
    [echo] Running jar:install for Apache Axis 2.0 - Integration
java:prepare-filesystem:
    [mkdir] Created dir: /export/home/illsleyd/continuum/continuum-1.0.3/apps/continuum/working-directory/1/modules/integration/target/classes
Running post goal: java:prepare-filesystem

java:compile:
    [echo] Compiling to /export/home/illsleyd/continuum/continuum-1.0.3/apps/continuum/working-directory/1/modules/integration/target/classes
    [javac] Compiling 136 source files to /export/home/illsleyd/continuum/continuum-1.0.3/apps/continuum/working-directory/1/modules/integration/target/classes
    [javac] Note: /export/home/illsleyd/continuum/continuum-1.0.3/apps/continuum/working-directory/1/modules/integration/src/test/soap12testing/client/SOAPComparator.java uses or overrides a deprecated API.
    [javac] Note: Recompile with -Xlint:deprecation for details.

java:jar-resources:
Copying 1 file to /export/home/illsleyd/continuum/continuum-1.0.3/apps/continuum/working-directory/1/modules/integration/target/classes
Copying 2 files to /export/home/illsleyd/continuum/continuum-1.0.3/apps/continuum/working-directory/1/modules/integration/target/classes/META-INF

test:test:
java:prepare-filesystem:
Running post goal: java:prepare-filesystem

java:compile:
    [echo] Compiling to /export/home/illsleyd/continuum/continuum-1.0.3/apps/continuum/working-directory/1/modules/integration/target/classes
    [javac] Compiling 10 source files to /export/home/illsleyd/continuum/continuum-1.0.3/apps/continuum/working-directory/1/modules/integration/target/classes

java:jar-resources:

test:prepare-filesystem:
    [mkdir] Created dir: /export/home/illsleyd/continuum/continuum-1.0.3/apps/continuum/working-directory/1/modules/integration/target/test-classes
    [mkdir] Created dir: /export/home/illsleyd/continuum/continuum-1.0.3/apps/continuum/working-directory/1/modules/integration/target/test-reports

test:test-resources:
Copying 150 files to /export/home/illsleyd/continuum/continuum-1.0.3/apps/continuum/working-directory/1/modules/integration/target/test-classes

test:compile:
    [copy] Copying 1 file to /export/home/illsleyd/continuum/continuum-1.0.3/apps/continuum/working-directory/1/modules/integration/target/test-classes/modules
    [mkdir] Created dir: /export/home/illsleyd/continuum/continuum-1.0.3/apps/continuum/working-directory/1/modules/integration/target/wsdl
    [echo] Compiling DocumentUnwrappingTest.wsdl 
    [mkdir] Created dir: /export/home/illsleyd/continuum/continuum-1.0.3/apps/continuum/working-directory/1/modules/integration/target/wsdl/documentunwrapping
    [java] log4j:WARN No appenders could be found for logger (org.apache.axis2.description.AxisService).
    [java] log4j:WARN Please initialize the log4j system properly.
    [mkdir] Created dir: /export/home/illsleyd/continuum/continuum-1.0.3/apps/continuum/working-directory/1/modules/integration/target/wsdl/documentunwrapping/build
    [mkdir] Created dir: /export/home/illsleyd/continuum/continuum-1.0.3/apps/continuum/working-directory/1/modules/integration/target/wsdl/documentunwrapping/build/classes
    [mkdir] Created dir: /export/home/illsleyd/continuum/continuum-1.0.3/apps/continuum/working-directory/1/modules/integration/target/wsdl/documentunwrapping/build/lib
    [mkdir] Created dir: /export/home/illsleyd/continuum/continuum-1.0.3/apps/continuum/working-directory/1/modules/integration/target/wsdl/documentunwrapping/test
    [echo] Stax Availability= true
    [echo] Axis2 Availability= true
    [javac] Compiling 26 source files to /export/home/illsleyd/continuum/continuum-1.0.3/apps/continuum/working-directory/1/modules/integration/target/wsdl/documentunwrapping/build/classes
    [javac] Note: Some input files use unchecked or unsafe operations.
    [javac] Note: Recompile with -Xlint:unchecked for details.
    [copy] Copying 2 files to /export/home/illsleyd/continuum/continuum-1.0.3/apps/continuum/working-directory/1/modules/integration/target/wsdl/documentunwrapping/build/classes/META-INF
    [jar] Building jar: /export/home/illsleyd/continuum/continuum-1.0.3/apps/continuum/working-directory/1/modules/integration/target/wsdl/documentunwrapping/build/lib/DocumentUnwrappingTestService.aar
    [echo] Compiling RPCUnwrappingTest.wsdl 
    [mkdir] Created dir: /export/home/illsleyd/continuum/continuum-1.0.3/apps/continuum/working-directory/1/modules/integration/target/wsdl/rpcunwrapping
    [java] log4j:WARN No appenders could be found for logger (org.apache.axis2.description.AxisService).
    [java] log4j:WARN Please initialize the log4j system properly.
    [mkdir] Created dir: /export/home/illsleyd/continuum/continuum-1.0.3/apps/continuum/working-directory/1/modules/integration/target/wsdl/rpcunwrapping/build
    [mkdir] Created dir: /export/home/illsleyd/continuum/continuum-1.0.3/apps/continuum/working-directory/1/modules/integration/target/wsdl/rpcunwrapping/build/classes
    [mkdir] Created dir: /export/home/illsleyd/continuum/continuum-1.0.3/apps/continuum/working-directory/1/modules/integration/target/wsdl/rpcunwrapping/build/lib
    [mkdir] Created dir: /export/home/illsleyd/continuum/continuum-1.0.3/apps/continuum/working-directory/1/modules/integration/target/wsdl/rpcunwrapping/test
    [echo] Stax Availability= true
    [echo] Axis2 Availability= true
    [javac] Compiling 20 source files to /export/home/illsleyd/continuum/continuum-1.0.3/apps/continuum/working-directory/1/modules/integration/target/wsdl/rpcunwrapping/build/classes
    [javac] Note: Some input files use unchecked or unsafe operations.
    [javac] Note: Recompile with -Xlint:unchecked for details.
    [copy] Copying 2 files to /export/home/illsleyd/continuum/continuum-1.0.3/apps/continuum/working-directory/1/modules/integration/target/wsdl/rpcunwrapping/build/classes/META-INF
    [jar] Building jar: /export/home/illsleyd/continuum/continuum-1.0.3/apps/continuum/working-directory/1/modules/integration/target/wsdl/rpcunwrapping/build/lib/RPCUnwrappingServiceTest.aar
    [java] log4j:WARN No appenders could be found for logger (org.apache.axis2.description.AxisService).
    [java] log4j:WARN Please initialize the log4j system properly.
    [copy] Copying 1 file to /export/home/illsleyd/continuum/continuum-1.0.3/apps/continuum/working-directory/1/modules/integration/target/perf/src/samples/wsdl/perf
    [mkdir] Created dir: /export/home/illsleyd/continuum/continuum-1.0.3/apps/continuum/working-directory/1/modules/integration/target/perf/build
    [mkdir] Created dir: /export/home/illsleyd/continuum/continuum-1.0.3/apps/continuum/working-directory/1/modules/integration/target/perf/build/classes
    [mkdir] Created dir: /export/home/illsleyd/continuum/continuum-1.0.3/apps/continuum/working-directory/1/modules/integration/target/perf/build/lib
    [jar] Building jar: /export/home/illsleyd/continuum/continuum-1.0.3/apps/continuum/working-directory/1/modules/integration/target/perf/build/lib/XBeans-packaged.jar
    [echo] XmlBeans Availability = true
    [echo] Stax Availability= true
    [echo] Axis2 Availability= true
    [javac] Compiling 211 source files to /export/home/illsleyd/continuum/continuum-1.0.3/apps/continuum/working-directory/1/modules/integration/target/perf/build/classes
    [javac] Note: Some input files use or override a deprecated API.
    [javac] Note: Recompile with -Xlint:deprecation for details.
    [javac] Note: Some input files use unchecked or unsafe operations.
    [javac] Note: Recompile with -Xlint:unchecked for details.
    [copy] Copying 2 files to /export/home/illsleyd/continuum/continuum-1.0.3/apps/continuum/working-directory/1/modules/integration/target/perf/build/classes/META-INF
    [copy] Copying 1 file to /export/home/illsleyd/continuum/continuum-1.0.3/apps/continuum/working-directory/1/modules/integration/target/perf/build/classes/lib
    [jar] Building jar: /export/home/illsleyd/continuum/continuum-1.0.3/apps/continuum/working-directory/1/modules/integration/target/perf/build/lib/PerfPortType.aar
    [mkdir] Created dir: /export/home/illsleyd/continuum/continuum-1.0.3/apps/continuum/working-directory/1/modules/integration/target/perf/build/repo
    [mkdir] Created dir: /export/home/illsleyd/continuum/continuum-1.0.3/apps/continuum/working-directory/1/modules/integration/target/perf/build/repo/services
    [copy] Copying 1 file to /export/home/illsleyd/continuum/continuum-1.0.3/apps/continuum/working-directory/1/modules/integration/target/perf/build/repo/services
    [echo] XmlBeans Availability = true
    [echo] Stax Availability= true
    [echo] Axis2 Availability= true
    [javac] Compiling 1 source file to /export/home/illsleyd/continuum/continuum-1.0.3/apps/continuum/working-directory/1/modules/integration/target/perf/build/classes
    [javac] /export/home/illsleyd/continuum/continuum-1.0.3/apps/continuum/working-directory/1/modules/integration/target/perf/test/samples/wsdl/perf/PerfPortTypeTest.java:46: warning: non-varargs call of varargs method with inexact argument type for last parameter;
    [javac] cast to java.lang.Class for a varargs call
    [javac] cast to java.lang.Class[] for a non-varargs call and to suppress this warning
    [javac]                             creatorMethod = declaredClass.getMethod("newInstance",null);
    [javac]                                                                                   ^
    [javac] /export/home/illsleyd/continuum/continuum-1.0.3/apps/continuum/working-directory/1/modules/integration/target/perf/test/samples/wsdl/perf/PerfPortTypeTest.java:53: warning: non-varargs call of varargs method with inexact argument type for last parameter;
    [javac] cast to java.lang.Object for a varargs call
    [javac] cast to java.lang.Object[] for a non-varargs call and to suppress this warning
    [javac]                     return  (org.apache.xmlbeans.XmlObject)creatorMethod.invoke(null,null);
    [javac]                                                                                      ^
    [javac] 2 warnings
    [jar] Building jar: /export/home/illsleyd/continuum/continuum-1.0.3/apps/continuum/working-directory/1/modules/integration/target/perf/build/lib/PerfPortType-test-client.jar
    [move] Moving 1 file to /export/home/illsleyd/continuum/continuum-1.0.3/apps/continuum/working-directory/1/modules/integration/target/perf/build/lib
    [move] Moving 1 file to /export/home/illsleyd/continuum/continuum-1.0.3/apps/continuum/working-directory/1/modules/integration/target/perf/build/lib
    [java] log4j:WARN No appenders could be found for logger (org.apache.axis2.description.AxisService).
    [java] log4j:WARN Please initialize the log4j system properly.
    [copy] Copying 1 file to /export/home/illsleyd/continuum/continuum-1.0.3/apps/continuum/working-directory/1/modules/integration/target/perf2/src/samples/wsdl/perf2
    [mkdir] Created dir: /export/home/illsleyd/continuum/continuum-1.0.3/apps/continuum/working-directory/1/modules/integration/target/perf2/build
    [mkdir] Created dir: /export/home/illsleyd/continuum/continuum-1.0.3/apps/continuum/working-directory/1/modules/integration/target/perf2/build/classes
    [mkdir] Created dir: /export/home/illsleyd/continuum/continuum-1.0.3/apps/continuum/working-directory/1/modules/integration/target/perf2/build/lib
    [echo] Stax Availability= true
    [echo] Axis2 Availability= true
    [javac] Compiling 6 source files to /export/home/illsleyd/continuum/continuum-1.0.3/apps/continuum/working-directory/1/modules/integration/target/perf2/build/classes
    [javac] Note: Some input files use unchecked or unsafe operations.
    [javac] Note: Recompile with -Xlint:unchecked for details.
    [copy] Copying 2 files to /export/home/illsleyd/continuum/continuum-1.0.3/apps/continuum/working-directory/1/modules/integration/target/perf2/build/classes/META-INF
    [jar] Building jar: /export/home/illsleyd/continuum/continuum-1.0.3/apps/continuum/working-directory/1/modules/integration/target/perf2/build/lib/PerfPortType.aar
    [mkdir] Created dir: /export/home/illsleyd/continuum/continuum-1.0.3/apps/continuum/working-directory/1/modules/integration/target/perf2/build/repo
    [mkdir] Created dir: /export/home/illsleyd/continuum/continuum-1.0.3/apps/continuum/working-directory/1/modules/integration/target/perf2/build/repo/services
    [copy] Copying 1 file to /export/home/illsleyd/continuum/continuum-1.0.3/apps/continuum/working-directory/1/modules/integration/target/perf2/build/repo/services
    [echo] Stax Availability= true
    [echo] Axis2 Availability= true
    [javac] Compiling 1 source file to /export/home/illsleyd/continuum/continuum-1.0.3/apps/continuum/working-directory/1/modules/integration/target/perf2/build/classes
    [jar] Building jar: /export/home/illsleyd/continuum/continuum-1.0.3/apps/continuum/working-directory/1/modules/integration/target/perf2/build/lib/PerfPortType-test-client.jar
    [move] Moving 1 file to /export/home/illsleyd/continuum/continuum-1.0.3/apps/continuum/working-directory/1/modules/integration/target/perf2/build/lib
    [java] Time to build schema type system: 1.983 seconds
    [java] Time to generate code: 1.449 seconds
    [java] Time to compile code: 8.203 seconds
    [echo] Running codegen RPC WSDLs - take 1
    [java] log4j:WARN No appenders could be found for logger (org.apache.axis2.description.AxisService).
    [java] log4j:WARN Please initialize the log4j system properly.
    [mkdir] Created dir: /export/home/illsleyd/continuum/continuum-1.0.3/apps/continuum/working-directory/1/modules/integration/target/rpc-test1/build
    [mkdir] Created dir: /export/home/illsleyd/continuum/continuum-1.0.3/apps/continuum/working-directory/1/modules/integration/target/rpc-test1/build/classes
    [mkdir] Created dir: /export/home/illsleyd/continuum/continuum-1.0.3/apps/continuum/working-directory/1/modules/integration/target/rpc-test1/build/lib
    [mkdir] Created dir: /export/home/illsleyd/continuum/continuum-1.0.3/apps/continuum/working-directory/1/modules/integration/target/rpc-test1/test
    [echo] Stax Availability= true
    [echo] Axis2 Availability= true
    [javac] Compiling 2 source files to /export/home/illsleyd/continuum/continuum-1.0.3/apps/continuum/working-directory/1/modules/integration/target/rpc-test1/build/classes
    [javac] Note: /export/home/illsleyd/continuum/continuum-1.0.3/apps/continuum/working-directory/1/modules/integration/target/rpc-test1/src/com/example/www/ServiceNameStub.java uses unchecked or unsafe operations.
    [javac] Note: Recompile with -Xlint:unchecked for details.
    [jar] Building jar: /export/home/illsleyd/continuum/continuum-1.0.3/apps/continuum/working-directory/1/modules/integration/target/rpc-test1/build/lib/ServiceName-test-client.jar
    [echo] Running codegen RPC WSDLs - take 2
    [java] log4j:WARN No appenders could be found for logger (org.apache.axis2.description.AxisService).
    [java] log4j:WARN Please initialize the log4j system properly.
    [mkdir] Created dir: /export/home/illsleyd/continuum/continuum-1.0.3/apps/continuum/working-directory/1/modules/integration/target/rpc-test2/build
    [mkdir] Created dir: /export/home/illsleyd/continuum/continuum-1.0.3/apps/continuum/working-directory/1/modules/integration/target/rpc-test2/build/classes
    [mkdir] Created dir: /export/home/illsleyd/continuum/continuum-1.0.3/apps/continuum/working-directory/1/modules/integration/target/rpc-test2/build/lib
    [mkdir] Created dir: /export/home/illsleyd/continuum/continuum-1.0.3/apps/continuum/working-directory/1/modules/integration/target/rpc-test2/test
    [echo] Stax Availability= true
    [echo] Axis2 Availability= true
    [javac] Compiling 2 source files to /export/home/illsleyd/continuum/continuum-1.0.3/apps/continuum/working-directory/1/modules/integration/target/rpc-test2/build/classes
    [javac] Note: /export/home/illsleyd/continuum/continuum-1.0.3/apps/continuum/working-directory/1/modules/integration/target/rpc-test2/src/com/example/www/ServiceNameStub.java uses unchecked or unsafe operations.
    [javac] Note: Recompile with -Xlint:unchecked for details.
    [jar] Building jar: /export/home/illsleyd/continuum/continuum-1.0.3/apps/continuum/working-directory/1/modules/integration/target/rpc-test2/build/lib/ServiceName-test-client.jar
    [echo] Running codegen RPC WSDLs - take 3
    [java] log4j:WARN No appenders could be found for logger (org.apache.axis2.description.AxisService).
    [java] log4j:WARN Please initialize the log4j system properly.
    [mkdir] Created dir: /export/home/illsleyd/continuum/continuum-1.0.3/apps/continuum/working-directory/1/modules/integration/target/rpc-test3/build
    [mkdir] Created dir: /export/home/illsleyd/continuum/continuum-1.0.3/apps/continuum/working-directory/1/modules/integration/target/rpc-test3/build/classes
    [mkdir] Created dir: /export/home/illsleyd/continuum/continuum-1.0.3/apps/continuum/working-directory/1/modules/integration/target/rpc-test3/build/lib
    [mkdir] Created dir: /export/home/illsleyd/continuum/continuum-1.0.3/apps/continuum/working-directory/1/modules/integration/target/rpc-test3/test
    [echo] Stax Availability= true
    [echo] Axis2 Availability= true
    [javac] Compiling 2 source files to /export/home/illsleyd/continuum/continuum-1.0.3/apps/continuum/working-directory/1/modules/integration/target/rpc-test3/build/classes
    [javac] Note: /export/home/illsleyd/continuum/continuum-1.0.3/apps/continuum/working-directory/1/modules/integration/target/rpc-test3/src/com/example/www/ServiceNameStub.java uses unchecked or unsafe operations.
    [javac] Note: Recompile with -Xlint:unchecked for details.
    [jar] Building jar: /export/home/illsleyd/continuum/continuum-1.0.3/apps/continuum/working-directory/1/modules/integration/target/rpc-test3/build/lib/ServiceName-test-client.jar
    [echo] Running codegen RPC WSDLs - take 4
    [java] log4j:WARN No appenders could be found for logger (org.apache.axis2.description.AxisService).
    [java] log4j:WARN Please initialize the log4j system properly.
    [mkdir] Created dir: /export/home/illsleyd/continuum/continuum-1.0.3/apps/continuum/working-directory/1/modules/integration/target/rpc-test4/build
    [mkdir] Created dir: /export/home/illsleyd/continuum/continuum-1.0.3/apps/continuum/working-directory/1/modules/integration/target/rpc-test4/build/classes
    [mkdir] Created dir: /export/home/illsleyd/continuum/continuum-1.0.3/apps/continuum/working-directory/1/modules/integration/target/rpc-test4/build/lib
    [mkdir] Created dir: /export/home/illsleyd/continuum/continuum-1.0.3/apps/continuum/working-directory/1/modules/integration/target/rpc-test4/test
    [echo] Stax Availability= true
    [echo] Axis2 Availability= true
    [javac] Compiling 5 source files to /export/home/illsleyd/continuum/continuum-1.0.3/apps/continuum/working-directory/1/modules/integration/target/rpc-test4/build/classes
    [javac] Note: Some input files use unchecked or unsafe operations.
    [javac] Note: Recompile with -Xlint:unchecked for details.
    [copy] Copying 2 files to /export/home/illsleyd/continuum/continuum-1.0.3/apps/continuum/working-directory/1/modules/integration/target/rpc-test4/build/classes/META-INF
    [jar] Building jar: /export/home/illsleyd/continuum/continuum-1.0.3/apps/continuum/working-directory/1/modules/integration/target/rpc-test4/build/lib/ServiceName.aar
    [echo] Running codegen RPC WSDLs with helper mode -  take 1
    [java] log4j:WARN No appenders could be found for logger (org.apache.axis2.description.AxisService).
    [java] log4j:WARN Please initialize the log4j system properly.
    [mkdir] Created dir: /export/home/illsleyd/continuum/continuum-1.0.3/apps/continuum/working-directory/1/modules/integration/target/helper-test1/build
    [mkdir] Created dir: /export/home/illsleyd/continuum/continuum-1.0.3/apps/continuum/working-directory/1/modules/integration/target/helper-test1/build/classes
    [mkdir] Created dir: /export/home/illsleyd/continuum/continuum-1.0.3/apps/continuum/working-directory/1/modules/integration/target/helper-test1/build/lib
    [mkdir] Created dir: /export/home/illsleyd/continuum/continuum-1.0.3/apps/continuum/working-directory/1/modules/integration/target/helper-test1/test
    [echo] Stax Availability= true
    [echo] Axis2 Availability= true
    [javac] Compiling 8 source files to /export/home/illsleyd/continuum/continuum-1.0.3/apps/continuum/working-directory/1/modules/integration/target/helper-test1/build/classes
    [javac] Note: Some input files use unchecked or unsafe operations.
    [javac] Note: Recompile with -Xlint:unchecked for details.
    [jar] Building jar: /export/home/illsleyd/continuum/continuum-1.0.3/apps/continuum/working-directory/1/modules/integration/target/helper-test1/build/lib/ServiceName-test-client.jar
    [echo] Running codegen RPC WSDLs with helper mode -  take 2
    [java] log4j:WARN No appenders could be found for logger (org.apache.axis2.description.AxisService).
    [java] log4j:WARN Please initialize the log4j system properly.
    [mkdir] Created dir: /export/home/illsleyd/continuum/continuum-1.0.3/apps/continuum/working-directory/1/modules/integration/target/helper-test2/build
    [mkdir] Created dir: /export/home/illsleyd/continuum/continuum-1.0.3/apps/continuum/working-directory/1/modules/integration/target/helper-test2/build/classes
    [mkdir] Created dir: /export/home/illsleyd/continuum/continuum-1.0.3/apps/continuum/working-directory/1/modules/integration/target/helper-test2/build/lib
    [mkdir] Created dir: /export/home/illsleyd/continuum/continuum-1.0.3/apps/continuum/working-directory/1/modules/integration/target/helper-test2/test
    [echo] Stax Availability= true
    [echo] Axis2 Availability= true
    [javac] Compiling 8 source files to /export/home/illsleyd/continuum/continuum-1.0.3/apps/continuum/working-directory/1/modules/integration/target/helper-test2/build/classes
    [javac] Note: Some input files use unchecked or unsafe operations.
    [javac] Note: Recompile with -Xlint:unchecked for details.
    [jar] Building jar: /export/home/illsleyd/continuum/continuum-1.0.3/apps/continuum/working-directory/1/modules/integration/target/helper-test2/build/lib/ServiceName-test-client.jar
    [echo] Running codegen for Enterprise WSDL - take 1
    [java] log4j:WARN No appenders could be found for logger (org.apache.axis2.description.AxisService).
    [java] log4j:WARN Please initialize the log4j system properly.
    [mkdir] Created dir: /export/home/illsleyd/continuum/continuum-1.0.3/apps/continuum/working-directory/1/modules/integration/target/enterprise-test1/build
    [mkdir] Created dir: /export/home/illsleyd/continuum/continuum-1.0.3/apps/continuum/working-directory/1/modules/integration/target/enterprise-test1/build/classes
    [mkdir] Created dir: /export/home/illsleyd/continuum/continuum-1.0.3/apps/continuum/working-directory/1/modules/integration/target/enterprise-test1/build/lib
    [mkdir] Created dir: /export/home/illsleyd/continuum/continuum-1.0.3/apps/continuum/working-directory/1/modules/integration/target/enterprise-test1/test
    [jar] Building jar: /export/home/illsleyd/continuum/continuum-1.0.3/apps/continuum/working-directory/1/modules/integration/target/enterprise-test1/build/lib/XBeans-packaged.jar
    [echo] XmlBeans Availability = true
    [echo] Stax Availability= true
    [echo] Axis2 Availability= true
    [javac] Compiling 740 source files to /export/home/illsleyd/continuum/continuum-1.0.3/apps/continuum/working-directory/1/modules/integration/target/enterprise-test1/build/classes
    [javac] Note: Some input files use or override a deprecated API.
    [javac] Note: Recompile with -Xlint:deprecation for details.
    [javac] Note: Some input files use unchecked or unsafe operations.
    [javac] Note: Recompile with -Xlint:unchecked for details.
    [jar] Building jar: /export/home/illsleyd/continuum/continuum-1.0.3/apps/continuum/working-directory/1/modules/integration/target/enterprise-test1/build/lib/SforceService-test-client.jar
    [echo] Running codegen for Enterprise WSDL - take 2
    [java] log4j:WARN No appenders could be found for logger (org.apache.axis2.description.AxisService).
    [java] log4j:WARN Please initialize the log4j system properly.
    [mkdir] Created dir: /export/home/illsleyd/continuum/continuum-1.0.3/apps/continuum/working-directory/1/modules/integration/target/enterprise-test2/build
    [mkdir] Created dir: /export/home/illsleyd/continuum/continuum-1.0.3/apps/continuum/working-directory/1/modules/integration/target/enterprise-test2/build/classes
    [mkdir] Created dir: /export/home/illsleyd/continuum/continuum-1.0.3/apps/continuum/working-directory/1/modules/integration/target/enterprise-test2/build/lib
    [mkdir] Created dir: /export/home/illsleyd/continuum/continuum-1.0.3/apps/continuum/working-directory/1/modules/integration/target/enterprise-test2/test
    [echo] Stax Availability= true
    [echo] Axis2 Availability= true
    [javac] Compiling 10 source files to /export/home/illsleyd/continuum/continuum-1.0.3/apps/continuum/working-directory/1/modules/integration/target/enterprise-test2/build/classes
    [javac] Note: /export/home/illsleyd/continuum/continuum-1.0.3/apps/continuum/working-directory/1/modules/integration/target/enterprise-test2/src/com/sforce/soap/enterprise/SforceServiceStub.java uses unchecked or unsafe operations.
    [javac] Note: Recompile with -Xlint:unchecked for details.
    [jar] Building jar: /export/home/illsleyd/continuum/continuum-1.0.3/apps/continuum/working-directory/1/modules/integration/target/enterprise-test2/build/lib/SforceService-test-client.jar
    [echo] Running codegen for Enterprise WSDL - take 3
    [java] log4j:WARN No appenders could be found for logger (org.apache.axis2.description.AxisService).
    [java] log4j:WARN Please initialize the log4j system properly.
    [mkdir] Created dir: /export/home/illsleyd/continuum/continuum-1.0.3/apps/continuum/working-directory/1/modules/integration/target/enterprise-test3/build
    [mkdir] Created dir: /export/home/illsleyd/continuum/continuum-1.0.3/apps/continuum/working-directory/1/modules/integration/target/enterprise-test3/build/classes
    [mkdir] Created dir: /export/home/illsleyd/continuum/continuum-1.0.3/apps/continuum/working-directory/1/modules/integration/target/enterprise-test3/build/lib
    [mkdir] Created dir: /export/home/illsleyd/continuum/continuum-1.0.3/apps/continuum/working-directory/1/modules/integration/target/enterprise-test3/test
    [jar] Building jar: /export/home/illsleyd/continuum/continuum-1.0.3/apps/continuum/working-directory/1/modules/integration/target/enterprise-test3/build/lib/XBeans-packaged.jar
    [echo] XmlBeans Availability = true
    [echo] Stax Availability= true
    [echo] Axis2 Availability= true
    [javac] Compiling 742 source files to /export/home/illsleyd/continuum/continuum-1.0.3/apps/continuum/working-directory/1/modules/integration/target/enterprise-test3/build/classes
    [javac] Note: Some input files use or override a deprecated API.
    [javac] Note: Recompile with -Xlint:deprecation for details.
    [javac] Note: Some input files use unchecked or unsafe operations.
    [javac] Note: Recompile with -Xlint:unchecked for details.
    [copy] Copying 2 files to /export/home/illsleyd/continuum/continuum-1.0.3/apps/continuum/working-directory/1/modules/integration/target/enterprise-test3/build/classes/META-INF
    [copy] Copying 1 file to /export/home/illsleyd/continuum/continuum-1.0.3/apps/continuum/working-directory/1/modules/integration/target/enterprise-test3/build/classes/lib
    [jar] Building jar: /export/home/illsleyd/continuum/continuum-1.0.3/apps/continuum/working-directory/1/modules/integration/target/enterprise-test3/build/lib/SforceService.aar
    [echo] Running codegen for Enterprise WSDL - take 4
    [java] log4j:WARN No appenders could be found for logger (org.apache.axis2.description.AxisService).
    [java] log4j:WARN Please initialize the log4j system properly.
    [mkdir] Created dir: /export/home/illsleyd/continuum/continuum-1.0.3/apps/continuum/working-directory/1/modules/integration/target/enterprise-test4/build
    [mkdir] Created dir: /export/home/illsleyd/continuum/continuum-1.0.3/apps/continuum/working-directory/1/modules/integration/target/enterprise-test4/build/classes
    [mkdir] Created dir: /export/home/illsleyd/continuum/continuum-1.0.3/apps/continuum/working-directory/1/modules/integration/target/enterprise-test4/build/lib
    [mkdir] Created dir: /export/home/illsleyd/continuum/continuum-1.0.3/apps/continuum/working-directory/1/modules/integration/target/enterprise-test4/test
    [jar] Building jar: /export/home/illsleyd/continuum/continuum-1.0.3/apps/continuum/working-directory/1/modules/integration/target/enterprise-test4/build/lib/XBeans-packaged.jar
    [echo] XmlBeans Availability = true
    [echo] Stax Availability= true
    [echo] Axis2 Availability= true
    [javac] Compiling 742 source files to /export/home/illsleyd/continuum/continuum-1.0.3/apps/continuum/working-directory/1/modules/integration/target/enterprise-test4/build/classes
    [javac] Note: Some input files use or override a deprecated API.
    [javac] Note: Recompile with -Xlint:deprecation for details.
    [javac] Note: Some input files use unchecked or unsafe operations.
    [javac] Note: Recompile with -Xlint:unchecked for details.
    [copy] Copying 2 files to /export/home/illsleyd/continuum/continuum-1.0.3/apps/continuum/working-directory/1/modules/integration/target/enterprise-test4/build/classes/META-INF
    [copy] Copying 1 file to /export/home/illsleyd/continuum/continuum-1.0.3/apps/continuum/working-directory/1/modules/integration/target/enterprise-test4/build/classes/lib
    [jar] Building jar: /export/home/illsleyd/continuum/continuum-1.0.3/apps/continuum/working-directory/1/modules/integration/target/enterprise-test4/build/lib/SforceService.aar
    [echo] Running codegen for eBaySvc WSDL
    [java] log4j:WARN No appenders could be found for logger (org.apache.axis2.description.AxisService).
    [java] log4j:WARN Please initialize the log4j system properly.
    [mkdir] Created dir: /export/home/illsleyd/continuum/continuum-1.0.3/apps/continuum/working-directory/1/modules/integration/target/eBaySvc/build
    [mkdir] Created dir: /export/home/illsleyd/continuum/continuum-1.0.3/apps/continuum/working-directory/1/modules/integration/target/eBaySvc/build/classes
    [mkdir] Created dir: /export/home/illsleyd/continuum/continuum-1.0.3/apps/continuum/working-directory/1/modules/integration/target/eBaySvc/build/lib
    [echo] Stax Availability= true
    [echo] Axis2 Availability= true
    [javac] Compiling 1016 source files to /export/home/illsleyd/continuum/continuum-1.0.3/apps/continuum/working-directory/1/modules/integration/target/eBaySvc/build/classes
    [javac] Note: Some input files use unchecked or unsafe operations.
    [javac] Note: Recompile with -Xlint:unchecked for details.
    [copy] Copying 2 files to /export/home/illsleyd/continuum/continuum-1.0.3/apps/continuum/working-directory/1/modules/integration/target/eBaySvc/build/classes/META-INF
    [jar] Building jar: /export/home/illsleyd/continuum/continuum-1.0.3/apps/continuum/working-directory/1/modules/integration/target/eBaySvc/build/lib/EBayAPIInterfaceService.aar
    [echo] Running codegen for eBaySvc WSDL Back word compatibiliy
    [java] log4j:WARN No appenders could be found for logger (org.apache.axis2.description.AxisService).
    [java] log4j:WARN Please initialize the log4j system properly.
    [mkdir] Created dir: /export/home/illsleyd/continuum/continuum-1.0.3/apps/continuum/working-directory/1/modules/integration/target/eBaySvcB/build
    [mkdir] Created dir: /export/home/illsleyd/continuum/continuum-1.0.3/apps/continuum/working-directory/1/modules/integration/target/eBaySvcB/build/classes
    [mkdir] Created dir: /export/home/illsleyd/continuum/continuum-1.0.3/apps/continuum/working-directory/1/modules/integration/target/eBaySvcB/build/lib
    [echo] Stax Availability= true
    [echo] Axis2 Availability= true
    [javac] Compiling 1015 source files to /export/home/illsleyd/continuum/continuum-1.0.3/apps/continuum/working-directory/1/modules/integration/target/eBaySvcB/build/classes
    [javac] Note: Some input files use unchecked or unsafe operations.
    [javac] Note: Recompile with -Xlint:unchecked for details.
    [copy] Copying 2 files to /export/home/illsleyd/continuum/continuum-1.0.3/apps/continuum/working-directory/1/modules/integration/target/eBaySvcB/build/classes/META-INF
    [jar] Building jar: /export/home/illsleyd/continuum/continuum-1.0.3/apps/continuum/working-directory/1/modules/integration/target/eBaySvcB/build/lib/EBayAPIInterfaceService.aar
    [echo] Running codegen for eBaySvc WSDL with un wrapping 
    [java] log4j:WARN No appenders could be found for logger (org.apache.axis2.description.AxisService).
    [java] log4j:WARN Please initialize the log4j system properly.
    [mkdir] Created dir: /export/home/illsleyd/continuum/continuum-1.0.3/apps/continuum/working-directory/1/modules/integration/target/eBaySvcUW/build
    [mkdir] Created dir: /export/home/illsleyd/continuum/continuum-1.0.3/apps/continuum/working-directory/1/modules/integration/target/eBaySvcUW/build/classes
    [mkdir] Created dir: /export/home/illsleyd/continuum/continuum-1.0.3/apps/continuum/working-directory/1/modules/integration/target/eBaySvcUW/build/lib
    [echo] Stax Availability= true
    [echo] Axis2 Availability= true
    [javac] Compiling 1016 source files to /export/home/illsleyd/continuum/continuum-1.0.3/apps/continuum/working-directory/1/modules/integration/target/eBaySvcUW/build/classes
    [javac] Note: Some input files use unchecked or unsafe operations.
    [javac] Note: Recompile with -Xlint:unchecked for details.
    [copy] Copying 2 files to /export/home/illsleyd/continuum/continuum-1.0.3/apps/continuum/working-directory/1/modules/integration/target/eBaySvcUW/build/classes/META-INF
    [jar] Building jar: /export/home/illsleyd/continuum/continuum-1.0.3/apps/continuum/working-directory/1/modules/integration/target/eBaySvcUW/build/lib/EBayAPIInterfaceService.aar
    [javac] Compiling 105 source files to /export/home/illsleyd/continuum/continuum-1.0.3/apps/continuum/working-directory/1/modules/integration/target/test-classes
    [javac] Note: /export/home/illsleyd/continuum/continuum-1.0.3/apps/continuum/working-directory/1/modules/integration/test/org/apache/axis2/engine/MessageContextInjectionTest.java uses or overrides a deprecated API.
    [javac] Note: Recompile with -Xlint:deprecation for details.
Running post goal: test:compile
    [mkdir] Created dir: /export/home/illsleyd/continuum/continuum-1.0.3/apps/continuum/working-directory/1/modules/integration/target/test-resources/samples/modules
    [mkdir] Created dir: /export/home/illsleyd/continuum/continuum-1.0.3/apps/continuum/working-directory/1/modules/integration/target/test-resources/samples/conf
    [mkdir] Created dir: /export/home/illsleyd/continuum/continuum-1.0.3/apps/continuum/working-directory/1/modules/integration/target/test-resources/repository-client/modules
    [mkdir] Created dir: /export/home/illsleyd/continuum/continuum-1.0.3/apps/continuum/working-directory/1/modules/integration/target/test-resources/repository-client/conf
    [copy] Copying 1 file to /export/home/illsleyd/continuum/continuum-1.0.3/apps/continuum/working-directory/1/modules/integration/target/test-resources/samples/modules
    [copy] Copying 1 file to /export/home/illsleyd/continuum/continuum-1.0.3/apps/continuum/working-directory/1/modules/integration/target/test-resources/samples/conf
    [copy] Copying 1 file to /export/home/illsleyd/continuum/continuum-1.0.3/apps/continuum/working-directory/1/modules/integration/target/test-resources/repository-client/modules
    [copy] Copying 1 file to /export/home/illsleyd/continuum/continuum-1.0.3/apps/continuum/working-directory/1/modules/integration/target/test-resources/repository-client/conf
    [mkdir] Created dir: /export/home/illsleyd/continuum/continuum-1.0.3/apps/continuum/working-directory/1/modules/integration/target/toWar/services
    [mkdir] Created dir: /export/home/illsleyd/continuum/continuum-1.0.3/apps/continuum/working-directory/1/modules/integration/target/test-resources/chunking-enabledRepository
    [mkdir] Created dir: /export/home/illsleyd/continuum/continuum-1.0.3/apps/continuum/working-directory/1/modules/integration/target/test-resources/chunking-enabledRepository/conf
    [copy] Copying 1 file to /export/home/illsleyd/continuum/continuum-1.0.3/apps/continuum/working-directory/1/modules/integration/target/test-resources/chunking-enabledRepository/conf
    [mkdir] Created dir: /export/home/illsleyd/continuum/continuum-1.0.3/apps/continuum/working-directory/1/modules/integration/target/test-resources/chunking-disabledRepository
    [mkdir] Created dir: /export/home/illsleyd/continuum/continuum-1.0.3/apps/continuum/working-directory/1/modules/integration/target/test-resources/chunking-disabledRepository/conf
    [copy] Copying 1 file to /export/home/illsleyd/continuum/continuum-1.0.3/apps/continuum/working-directory/1/modules/integration/target/test-resources/chunking-disabledRepository/conf
    [mkdir] Created dir: /export/home/illsleyd/continuum/continuum-1.0.3/apps/continuum/working-directory/1/modules/integration/target/test-resources/jms-enabled-server-repository
    [mkdir] Created dir: /export/home/illsleyd/continuum/continuum-1.0.3/apps/continuum/working-directory/1/modules/integration/target/test-resources/jms-enabled-server-repository/conf
    [mkdir] Created dir: /export/home/illsleyd/continuum/continuum-1.0.3/apps/continuum/working-directory/1/modules/integration/target/test-resources/jms-enabled-server-repository/modules
    [copy] Copying 1 file to /export/home/illsleyd/continuum/continuum-1.0.3/apps/continuum/working-directory/1/modules/integration/target/test-resources/jms-enabled-server-repository/conf
    [copy] Copying 1 file to /export/home/illsleyd/continuum/continuum-1.0.3/apps/continuum/working-directory/1/modules/integration/target/test-resources/jms-enabled-server-repository/modules
    [mkdir] Created dir: /export/home/illsleyd/continuum/continuum-1.0.3/apps/continuum/working-directory/1/modules/integration/target/test-resources/jms-enabled-client-repository
    [mkdir] Created dir: /export/home/illsleyd/continuum/continuum-1.0.3/apps/continuum/working-directory/1/modules/integration/target/test-resources/jms-enabled-client-repository/conf
    [mkdir] Created dir: /export/home/illsleyd/continuum/continuum-1.0.3/apps/continuum/working-directory/1/modules/integration/target/test-resources/jms-enabled-client-repository/modules
    [copy] Copying 1 file to /export/home/illsleyd/continuum/continuum-1.0.3/apps/continuum/working-directory/1/modules/integration/target/test-resources/jms-enabled-client-repository/conf
    [copy] Copying 1 file to /export/home/illsleyd/continuum/continuum-1.0.3/apps/continuum/working-directory/1/modules/integration/target/test-resources/jms-enabled-client-repository/modules
    [mkdir] Created dir: /export/home/illsleyd/continuum/continuum-1.0.3/apps/continuum/working-directory/1/modules/integration/target/test-resources/mail-transport-client-enabledRepository
    [mkdir] Created dir: /export/home/illsleyd/continuum/continuum-1.0.3/apps/continuum/working-directory/1/modules/integration/target/test-resources/mail-transport-client-enabledRepository/conf
    [mkdir] Created dir: /export/home/illsleyd/continuum/continuum-1.0.3/apps/continuum/working-directory/1/modules/integration/target/test-resources/mail-transport-client-enabledRepository/modules
    [copy] Copying 1 file to /export/home/illsleyd/continuum/continuum-1.0.3/apps/continuum/working-directory/1/modules/integration/target/test-resources/mail-transport-client-enabledRepository/conf
    [copy] Copying 1 file to /export/home/illsleyd/continuum/continuum-1.0.3/apps/continuum/working-directory/1/modules/integration/target/test-resources/mail-transport-client-enabledRepository/modules
    [mkdir] Created dir: /export/home/illsleyd/continuum/continuum-1.0.3/apps/continuum/working-directory/1/modules/integration/target/test-resources/mail-transport-server-enabledRepository
    [mkdir] Created dir: /export/home/illsleyd/continuum/continuum-1.0.3/apps/continuum/working-directory/1/modules/integration/target/test-resources/mail-transport-server-enabledRepository/conf
    [mkdir] Created dir: /export/home/illsleyd/continuum/continuum-1.0.3/apps/continuum/working-directory/1/modules/integration/target/test-resources/mail-transport-server-enabledRepository/modules
    [copy] Copying 1 file to /export/home/illsleyd/continuum/continuum-1.0.3/apps/continuum/working-directory/1/modules/integration/target/test-resources/mail-transport-server-enabledRepository/conf
    [copy] Copying 1 file to /export/home/illsleyd/continuum/continuum-1.0.3/apps/continuum/working-directory/1/modules/integration/target/test-resources/mail-transport-server-enabledRepository/modules
    [mkdir] Created dir: /export/home/illsleyd/continuum/continuum-1.0.3/apps/continuum/working-directory/1/modules/integration/target/test-resources/MessageContextInjectionRepo
    [mkdir] Created dir: /export/home/illsleyd/continuum/continuum-1.0.3/apps/continuum/working-directory/1/modules/integration/target/test-resources/integrationRepo/modules
    [mkdir] Created dir: /export/home/illsleyd/continuum/continuum-1.0.3/apps/continuum/working-directory/1/modules/integration/target/test-resources/integrationRepo/conf
    [copy] Copying 1 file to /export/home/illsleyd/continuum/continuum-1.0.3/apps/continuum/working-directory/1/modules/integration/target/test-resources/integrationRepo/modules
    [copy] Copying 1 file to /export/home/illsleyd/continuum/continuum-1.0.3/apps/continuum/working-directory/1/modules/integration/target/test-resources/integrationRepo/conf
    [mkdir] Created dir: /export/home/illsleyd/continuum/continuum-1.0.3/apps/continuum/working-directory/1/modules/integration/target/test-resources/commons-http-enabledRepository
    [mkdir] Created dir: /export/home/illsleyd/continuum/continuum-1.0.3/apps/continuum/working-directory/1/modules/integration/target/test-resources/commons-http-enabledRepository/conf
    [copy] Copying 1 file to /export/home/illsleyd/continuum/continuum-1.0.3/apps/continuum/working-directory/1/modules/integration/target/test-resources/commons-http-enabledRepository/conf
    [mkdir] Created dir: /export/home/illsleyd/continuum/continuum-1.0.3/apps/continuum/working-directory/1/modules/integration/target/test-resources/MTOM-enabledRepository
    [mkdir] Created dir: /export/home/illsleyd/continuum/continuum-1.0.3/apps/continuum/working-directory/1/modules/integration/target/test-resources/MTOM-enabledRepository/conf
    [mkdir] Created dir: /export/home/illsleyd/continuum/continuum-1.0.3/apps/continuum/working-directory/1/modules/integration/target/test-resources/MTOM-enabledRepository/modules
    [copy] Copying 1 file to /export/home/illsleyd/continuum/continuum-1.0.3/apps/continuum/working-directory/1/modules/integration/target/test-resources/MTOM-enabledRepository/conf
    [copy] Copying 1 file to /export/home/illsleyd/continuum/continuum-1.0.3/apps/continuum/working-directory/1/modules/integration/target/test-resources/MTOM-enabledRepository/modules
    [mkdir] Created dir: /export/home/illsleyd/continuum/continuum-1.0.3/apps/continuum/working-directory/1/modules/integration/target/test-resources/MTOM-fileCache-enabledRepository
    [mkdir] Created dir: /export/home/illsleyd/continuum/continuum-1.0.3/apps/continuum/working-directory/1/modules/integration/target/test-resources/MTOM-fileCache-enabledRepository/conf
    [copy] Copying 1 file to /export/home/illsleyd/continuum/continuum-1.0.3/apps/continuum/working-directory/1/modules/integration/target/test-resources/MTOM-fileCache-enabledRepository/conf
    [copy] Copying 1 file to /export/home/illsleyd/continuum/continuum-1.0.3/apps/continuum/working-directory/1/modules/integration/target/test-resources/MTOM-fileCache-enabledRepository/modules
    [mkdir] Created dir: /export/home/illsleyd/continuum/continuum-1.0.3/apps/continuum/working-directory/1/modules/integration/target/test-resources/SwA-enabledRepository
    [mkdir] Created dir: /export/home/illsleyd/continuum/continuum-1.0.3/apps/continuum/working-directory/1/modules/integration/target/test-resources/SwA-enabledRepository/conf
    [copy] Copying 1 file to /export/home/illsleyd/continuum/continuum-1.0.3/apps/continuum/working-directory/1/modules/integration/target/test-resources/SwA-enabledRepository/conf
    [copy] Copying 1 file to /export/home/illsleyd/continuum/continuum-1.0.3/apps/continuum/working-directory/1/modules/integration/target/test-resources/SwA-enabledRepository/modules
    [mkdir] Created dir: /export/home/illsleyd/continuum/continuum-1.0.3/apps/continuum/working-directory/1/modules/integration/target/test-resources/SwA-fileCache-enabledRepository
    [mkdir] Created dir: /export/home/illsleyd/continuum/continuum-1.0.3/apps/continuum/working-directory/1/modules/integration/target/test-resources/SwA-fileCache-enabledRepository/conf
    [copy] Copying 1 file to /export/home/illsleyd/continuum/continuum-1.0.3/apps/continuum/working-directory/1/modules/integration/target/test-resources/SwA-fileCache-enabledRepository/conf
    [copy] Copying 1 file to /export/home/illsleyd/continuum/continuum-1.0.3/apps/continuum/working-directory/1/modules/integration/target/test-resources/SwA-fileCache-enabledRepository/modules
    [mkdir] Created dir: /export/home/illsleyd/continuum/continuum-1.0.3/apps/continuum/working-directory/1/modules/integration/target/groovyRepo
    [mkdir] Created dir: /export/home/illsleyd/continuum/continuum-1.0.3/apps/continuum/working-directory/1/modules/integration/target/groovyRepo/conf
    [mkdir] Created dir: /export/home/illsleyd/continuum/continuum-1.0.3/apps/continuum/working-directory/1/modules/integration/target/groovyRepo/services
    [mkdir] Created dir: /export/home/illsleyd/continuum/continuum-1.0.3/apps/continuum/working-directory/1/modules/integration/target/groovyRepo/modules
    [copy] Copying 1 file to /export/home/illsleyd/continuum/continuum-1.0.3/apps/continuum/working-directory/1/modules/integration/target/groovyRepo/services
    [copy] Copying 1 file to /export/home/illsleyd/continuum/continuum-1.0.3/apps/continuum/working-directory/1/modules/integration/target/groovyRepo/modules
    [copy] Copying 1 file to /export/home/illsleyd/continuum/continuum-1.0.3/apps/continuum/working-directory/1/modules/integration/target/groovyRepo/conf
    [mkdir] Created dir: /export/home/illsleyd/continuum/continuum-1.0.3/apps/continuum/working-directory/1/modules/integration/target/test-resources/spring
    [copy] Copying 1 file to /export/home/illsleyd/continuum/continuum-1.0.3/apps/continuum/working-directory/1/modules/integration/target/test-classes/spring
    [mkdir] Created dir: /export/home/illsleyd/continuum/continuum-1.0.3/apps/continuum/working-directory/1/modules/integration/target/test-resources/deployment_repo
    [mkdir] Created dir: /export/home/illsleyd/continuum/continuum-1.0.3/apps/continuum/working-directory/1/modules/integration/target/test-resources/deployment_repo/conf
    [mkdir] Created dir: /export/home/illsleyd/continuum/continuum-1.0.3/apps/continuum/working-directory/1/modules/integration/target/test-resources/deployment_repo/services
    [mkdir] Created dir: /export/home/illsleyd/continuum/continuum-1.0.3/apps/continuum/working-directory/1/modules/integration/target/test-resources/deployment_repo/modules
    [copy] Copying 1 file to /export/home/illsleyd/continuum/continuum-1.0.3/apps/continuum/working-directory/1/modules/integration/target/test-resources/deployment_repo/conf
    [copy] Copying 1 file to /export/home/illsleyd/continuum/continuum-1.0.3/apps/continuum/working-directory/1/modules/integration/target/test-resources/deployment_repo/modules
    [mkdir] Created dir: /export/home/illsleyd/continuum/continuum-1.0.3/apps/continuum/working-directory/1/modules/integration/target/Repository
    [mkdir] Created dir: /export/home/illsleyd/continuum/continuum-1.0.3/apps/continuum/working-directory/1/modules/integration/target/Repository/conf
    [mkdir] Created dir: /export/home/illsleyd/continuum/continuum-1.0.3/apps/continuum/working-directory/1/modules/integration/target/Repository/services
    [mkdir] Created dir: /export/home/illsleyd/continuum/continuum-1.0.3/apps/continuum/working-directory/1/modules/integration/target/Repository/modules
    [copy] Copying 1 file to /export/home/illsleyd/continuum/continuum-1.0.3/apps/continuum/working-directory/1/modules/integration/target/Repository/modules
    [copy] Copying 1 file to /export/home/illsleyd/continuum/continuum-1.0.3/apps/continuum/working-directory/1/modules/integration/target/Repository/conf
    [mkdir] Created dir: /export/home/illsleyd/continuum/continuum-1.0.3/apps/continuum/working-directory/1/modules/integration/target/perf2/build/repo/conf
    [mkdir] Created dir: /export/home/illsleyd/continuum/continuum-1.0.3/apps/continuum/working-directory/1/modules/integration/target/perf/build/repo/conf
    [copy] Copying 1 file to /export/home/illsleyd/continuum/continuum-1.0.3/apps/continuum/working-directory/1/modules/integration/target/perf2/build/repo/conf
    [copy] Copying 1 file to /export/home/illsleyd/continuum/continuum-1.0.3/apps/continuum/working-directory/1/modules/integration/target/perf/build/repo/conf
    [mkdir] Created dir: /export/home/illsleyd/continuum/continuum-1.0.3/apps/continuum/working-directory/1/modules/integration/target/perf2/build/repo/modules
    [copy] Copying 1 file to /export/home/illsleyd/continuum/continuum-1.0.3/apps/continuum/working-directory/1/modules/integration/target/perf2/build/repo/modules
    [mkdir] Created dir: /export/home/illsleyd/continuum/continuum-1.0.3/apps/continuum/working-directory/1/modules/integration/target/perf/build/repo/modules
    [copy] Copying 1 file to /export/home/illsleyd/continuum/continuum-1.0.3/apps/continuum/working-directory/1/modules/integration/target/perf/build/repo/modules
    [echo] the files are up to date = ${jars.uptodate}
    [mkdir] Created dir: /export/home/illsleyd/continuum/continuum-1.0.3/apps/continuum/working-directory/1/modules/integration/test-resources/SOAP12Testing/SOAP12TestModuleB/build/classes
    [mkdir] Created dir: /export/home/illsleyd/continuum/continuum-1.0.3/apps/continuum/working-directory/1/modules/integration/test-resources/SOAP12Testing/SOAP12TestModuleB/build/lib
    [javac] Compiling 4 source files to /export/home/illsleyd/continuum/continuum-1.0.3/apps/continuum/working-directory/1/modules/integration/test-resources/SOAP12Testing/SOAP12TestModuleB/build/classes
    [javac] Note: /export/home/illsleyd/continuum/continuum-1.0.3/apps/continuum/working-directory/1/modules/integration/test-resources/SOAP12Testing/SOAP12TestModuleB/org/apache/axis2/soap12testing/handlers/SOAP12InFlowHandlerDefaultB.java uses or overrides a deprecated API.
    [javac] Note: Recompile with -Xlint:deprecation for details.
    [copy] Copying 1 file to /export/home/illsleyd/continuum/continuum-1.0.3/apps/continuum/working-directory/1/modules/integration/test-resources/SOAP12Testing/SOAP12TestModuleB/build/classes/META-INF
    [jar] Building jar: /export/home/illsleyd/continuum/continuum-1.0.3/apps/continuum/working-directory/1/modules/integration/target/Repository/modules/SOAP12TestModuleB.jar
    [delete] Deleting directory /export/home/illsleyd/continuum/continuum-1.0.3/apps/continuum/working-directory/1/modules/integration/test-resources/SOAP12Testing/SOAP12TestModuleB/build
    [echo] the files are up to date = ${jars.uptodate}
    [mkdir] Created dir: /export/home/illsleyd/continuum/continuum-1.0.3/apps/continuum/working-directory/1/modules/integration/test-resources/SOAP12Testing/SOAP12TestModuleC/build/classes
    [mkdir] Created dir: /export/home/illsleyd/continuum/continuum-1.0.3/apps/continuum/working-directory/1/modules/integration/test-resources/SOAP12Testing/SOAP12TestModuleC/build/lib
    [javac] Compiling 4 source files to /export/home/illsleyd/continuum/continuum-1.0.3/apps/continuum/working-directory/1/modules/integration/test-resources/SOAP12Testing/SOAP12TestModuleC/build/classes
    [javac] Note: /export/home/illsleyd/continuum/continuum-1.0.3/apps/continuum/working-directory/1/modules/integration/test-resources/SOAP12Testing/SOAP12TestModuleC/org/apache/axis2/soap12testing/handlers/SOAP12InFlowHandlerDefaultC.java uses or overrides a deprecated API.
    [javac] Note: Recompile with -Xlint:deprecation for details.
    [copy] Copying 1 file to /export/home/illsleyd/continuum/continuum-1.0.3/apps/continuum/working-directory/1/modules/integration/test-resources/SOAP12Testing/SOAP12TestModuleC/build/classes/META-INF
    [jar] Building jar: /export/home/illsleyd/continuum/continuum-1.0.3/apps/continuum/working-directory/1/modules/integration/target/Repository/modules/SOAP12TestModuleC.jar
    [delete] Deleting directory /export/home/illsleyd/continuum/continuum-1.0.3/apps/continuum/working-directory/1/modules/integration/test-resources/SOAP12Testing/SOAP12TestModuleC/build
    [echo] the files are up to date = ${jars.uptodate}
    [mkdir] Created dir: /export/home/illsleyd/continuum/continuum-1.0.3/apps/continuum/working-directory/1/modules/integration/test-resources/SOAP12Testing/SOAP12TestServiceB/build/classes
    [mkdir] Created dir: /export/home/illsleyd/continuum/continuum-1.0.3/apps/continuum/working-directory/1/modules/integration/test-resources/SOAP12Testing/SOAP12TestServiceB/build/lib
    [javac] Compiling 1 source file to /export/home/illsleyd/continuum/continuum-1.0.3/apps/continuum/working-directory/1/modules/integration/test-resources/SOAP12Testing/SOAP12TestServiceB/build/classes
    [copy] Copying 1 file to /export/home/illsleyd/continuum/continuum-1.0.3/apps/continuum/working-directory/1/modules/integration/test-resources/SOAP12Testing/SOAP12TestServiceB/build/classes/META-INF
    [jar] Building jar: /export/home/illsleyd/continuum/continuum-1.0.3/apps/continuum/working-directory/1/modules/integration/target/Repository/services/SOAP12TestServiceB.jar
    [delete] Deleting directory /export/home/illsleyd/continuum/continuum-1.0.3/apps/continuum/working-directory/1/modules/integration/test-resources/SOAP12Testing/SOAP12TestServiceB/build
    [echo] the files are up to date = ${jars.uptodate}
    [mkdir] Created dir: /export/home/illsleyd/continuum/continuum-1.0.3/apps/continuum/working-directory/1/modules/integration/test-resources/SOAP12Testing/SOAP12TestServiceC/build/classes
    [mkdir] Created dir: /export/home/illsleyd/continuum/continuum-1.0.3/apps/continuum/working-directory/1/modules/integration/test-resources/SOAP12Testing/SOAP12TestServiceC/build/lib
    [javac] Compiling 1 source file to /export/home/illsleyd/continuum/continuum-1.0.3/apps/continuum/working-directory/1/modules/integration/test-resources/SOAP12Testing/SOAP12TestServiceC/build/classes
    [copy] Copying 1 file to /export/home/illsleyd/continuum/continuum-1.0.3/apps/continuum/working-directory/1/modules/integration/test-resources/SOAP12Testing/SOAP12TestServiceC/build/classes/META-INF
    [jar] Building jar: /export/home/illsleyd/continuum/continuum-1.0.3/apps/continuum/working-directory/1/modules/integration/target/Repository/services/SOAP12TestServiceC.jar
    [delete] Deleting directory /export/home/illsleyd/continuum/continuum-1.0.3/apps/continuum/working-directory/1/modules/integration/test-resources/SOAP12Testing/SOAP12TestServiceC/build

    [junit] Running org.apache.axis2.addressing.AddressingServiceTest
    [junit] Tests run: 3, Failures: 0, Errors: 0, Time elapsed: 7.129 sec
    [junit] Running org.apache.axis2.addressing.MultiHopRedirectServiceTest
    [junit] Tests run: 1, Failures: 0, Errors: 0, Time elapsed: 3.893 sec
    [junit] Running org.apache.axis2.async.AsyncServiceTest
    [junit] Tests run: 1, Failures: 0, Errors: 0, Time elapsed: 7.574 sec
    [junit] Running org.apache.axis2.async.AsyncServiceWithTransportFailureTest
    [junit] Tests run: 1, Failures: 0, Errors: 0, Time elapsed: 7.872 sec
    [junit] Running org.apache.axis2.codegen.InvalidFaultWsdlTest
    [junit] Tests run: 1, Failures: 0, Errors: 0, Time elapsed: 1.205 sec
    [junit] Running org.apache.axis2.deployment.TargetResolverServiceTest
    [junit] Tests run: 1, Failures: 0, Errors: 0, Time elapsed: 7.03 sec
    [junit] Running org.apache.axis2.engine.CallUnregisteredServiceTest
    [junit] Tests run: 1, Failures: 0, Errors: 0, Time elapsed: 7.044 sec
    [junit] Running org.apache.axis2.engine.CharactersetEncodingTest
    [junit] Tests run: 11, Failures: 0, Errors: 0, Time elapsed: 4.172 sec
    [junit] Running org.apache.axis2.engine.CommonsHTTPEchoRawXMLTest
    [junit] Tests run: 2, Failures: 0, Errors: 0, Time elapsed: 7.614 sec
    [junit] Running org.apache.axis2.engine.EchoRawRuntimeProxyTest
    [junit] Tests run: 1, Failures: 0, Errors: 0, Time elapsed: 6.998 sec
    [junit] Running org.apache.axis2.engine.EchoRawXMLChunkedTest
    [junit] Tests run: 1, Failures: 0, Errors: 0, Time elapsed: 6.927 sec
    [junit] Running org.apache.axis2.engine.EchoRawXMLLoadTest
    [junit] Tests run: 1, Failures: 0, Errors: 0, Time elapsed: 7.06 sec
    [junit] Running org.apache.axis2.engine.EchoRawXMLMultipleASyncTest
    [junit] Tests run: 2, Failures: 0, Errors: 0, Time elapsed: 5.698 sec
    [junit] Running org.apache.axis2.engine.EchoRawXMLMultipleSyncTest
    [junit] Tests run: 2, Failures: 0, Errors: 0, Time elapsed: 10.342 sec
    [junit] Running org.apache.axis2.engine.EchoRawXMLOnTwoChannelsSyncTest
    [junit] Tests run: 2, Failures: 0, Errors: 0, Time elapsed: 7.028 sec
    [junit] Running org.apache.axis2.engine.EchoRawXMLOnTwoChannelsTest
    [junit] Tests run: 1, Failures: 0, Errors: 0, Time elapsed: 7.627 sec
    [junit] Running org.apache.axis2.engine.EchoRawXMLTest
    [junit] Tests run: 4, Failures: 0, Errors: 0, Time elapsed: 8.243 sec
    [junit] Running org.apache.axis2.engine.FaultHandlingTest
    [junit] Tests run: 4, Failures: 0, Errors: 0, Time elapsed: 7.399 sec
    [junit] Running org.apache.axis2.engine.HandlerExecutionTest
    [junit] Tests run: 9, Failures: 0, Errors: 0, Time elapsed: 4.416 sec
    [junit] Running org.apache.axis2.engine.HandlerFailureTest
    [junit] Tests run: 1, Failures: 0, Errors: 0, Time elapsed: 6.878 sec
    [junit] Running org.apache.axis2.engine.MessageContextInjectionTest
    [junit] Tests run: 1, Failures: 0, Errors: 0, Time elapsed: 1.498 sec
    [junit] Running org.apache.axis2.engine.MessageSaveAndRestoreTest
    [junit] Tests run: 1, Failures: 0, Errors: 0, Time elapsed: 15.067 sec
    [junit] Running org.apache.axis2.engine.MessageWithServerTest
    [junit] Tests run: 1, Failures: 0, Errors: 0, Time elapsed: 6.92 sec
    [junit] Running org.apache.axis2.engine.OneWayRawXMLTest
    [junit] Tests run: 1, Failures: 0, Errors: 0, Time elapsed: 7.602 sec
    [junit] Running org.apache.axis2.engine.PausingHandlerExecutionTest
    [junit] Tests run: 1, Failures: 0, Errors: 0, Time elapsed: 19.163 sec
    [junit] Running org.apache.axis2.engine.SOAPversionTest
    [junit] Tests run: 3, Failures: 0, Errors: 0, Time elapsed: 7.113 sec
    [junit] Running org.apache.axis2.engine.ServiceCreateTest
    [junit] Tests run: 1, Failures: 0, Errors: 0, Time elapsed: 7.263 sec
    [junit] Running org.apache.axis2.engine.ServiceDispatchingTest
    [junit] Tests run: 3, Failures: 0, Errors: 0, Time elapsed: 7.117 sec
    [junit] Running org.apache.axis2.engine.ServiceFaultTest
    [junit] Tests run: 2, Failures: 0, Errors: 0, Time elapsed: 6.925 sec
    [junit] Running org.apache.axis2.engine.ServiceGroupContextTest
    [junit] Tests run: 1, Failures: 0, Errors: 0, Time elapsed: 6.866 sec
    [junit] Running org.apache.axis2.engine.ThreadingTest
    [junit] Tests run: 1, Failures: 0, Errors: 0, Time elapsed: 7.041 sec
    [junit] Running org.apache.axis2.engine.UsingTransportTest
    [junit] Tests run: 2, Failures: 0, Errors: 0, Time elapsed: 3.922 sec
    [junit] Running org.apache.axis2.engine.WSDLClientTest
    [junit] Tests run: 1, Failures: 0, Errors: 0, Time elapsed: 7.477 sec
    [junit] Running org.apache.axis2.groovy.GroovyServiceTest
    [junit] Tests run: 2, Failures: 0, Errors: 0, Time elapsed: 8.902 sec
    [junit] Running org.apache.axis2.jms.JMSEchoRawXMLOneWayTest
    [junit] Tests run: 1, Failures: 0, Errors: 0, Time elapsed: 10.361 sec
    [junit] Running org.apache.axis2.jms.JMSEchoRawXMLTest
    [junit] Tests run: 4, Failures: 0, Errors: 0, Time elapsed: 21.2 sec
    [junit] Running org.apache.axis2.mtom.EchoRawMTOMCommonsChunkingTest
    [junit] Tests run: 1, Failures: 0, Errors: 0, Time elapsed: 7.112 sec
    [junit] Running org.apache.axis2.mtom.EchoRawMTOMFaultReportTest
    [junit] Tests run: 1, Failures: 0, Errors: 0, Time elapsed: 6.912 sec
    [junit] Running org.apache.axis2.mtom.EchoRawMTOMFileCacheLoadTest
    [junit] Tests run: 1, Failures: 0, Errors: 0, Time elapsed: 7.838 sec
    [junit] Running org.apache.axis2.mtom.EchoRawMTOMFileCacheTest
    [junit] Tests run: 3, Failures: 0, Errors: 0, Time elapsed: 9.016 sec
    [junit] Running org.apache.axis2.mtom.EchoRawMTOMLoadTest
    [junit] Tests run: 1, Failures: 0, Errors: 0, Time elapsed: 4.55 sec
    [junit] Running org.apache.axis2.mtom.EchoRawMTOMStreamingTest
    [junit] Tests run: 1, Failures: 0, Errors: 0, Time elapsed: 6.894 sec
    [junit] Running org.apache.axis2.mtom.EchoRawMTOMTest
    [junit] Tests run: 3, Failures: 0, Errors: 0, Time elapsed: 8.289 sec
    [junit] Running org.apache.axis2.mtom.EchoRawMTOMToBase64Test
    [junit] Tests run: 2, Failures: 0, Errors: 0, Time elapsed: 7.89 sec
    [junit] Running org.apache.axis2.mtom.MessageSaveAndRestoreWithMTOMTest
    [junit] Tests run: 1, Failures: 0, Errors: 0, Time elapsed: 7.469 sec
    [junit] Running org.apache.axis2.om.OMAttributeTest
    [junit] Tests run: 1, Failures: 0, Errors: 0, Time elapsed: 1.58 sec
    [junit] Running org.apache.axis2.processingModel.SoapProcessingModelTest
    [junit] Tests run: 1, Failures: 0, Errors: 0, Time elapsed: 6.946 sec
    [junit] Running org.apache.axis2.rpc.MultirefTest
    [junit] Tests run: 9, Failures: 0, Errors: 0, Time elapsed: 7.754 sec
    [junit] Running org.apache.axis2.rpc.RPCCallTest
    [junit] Tests run: 22, Failures: 0, Errors: 0, Time elapsed: 52.507 sec
    [junit] Running org.apache.axis2.spring.SpringServiceTest
    [junit] Tests run: 1, Failures: 0, Errors: 0, Time elapsed: 7.121 sec
    [junit] Running org.apache.axis2.swa.EchoRawSwAFileCacheTest
    [junit] Tests run: 1, Failures: 0, Errors: 0, Time elapsed: 7.493 sec
    [junit] Running org.apache.axis2.swa.EchoRawSwATest
    [junit] Tests run: 1, Failures: 0, Errors: 0, Time elapsed: 7.302 sec
    [junit] Running org.apache.axis2.tcp.TCPEchoRawXMLTest
    [junit] Tests run: 1, Failures: 0, Errors: 0, Time elapsed: 3.455 sec
    [junit] Running org.apache.axis2.tcp.TCPTwoChannelEchoRawXMLTest
    [junit] Tests run: 1, Failures: 0, Errors: 0, Time elapsed: 3.504 sec
    [junit] Running samples.wsdl.perf.PerfPortTypeTest
    [junit] Tests run: 1, Failures: 0, Errors: 0, Time elapsed: 11.303 sec

jar:jar:
    [jar] Building jar: /export/home/illsleyd/continuum/continuum-1.0.3/apps/continuum/working-directory/1/modules/integration/target/axis2-integration-SNAPSHOT.jar

jar:install:
    [echo] Installing...
Uploading to org.apache.axis2/jars/axis2-integration-SNAPSHOT.jar: 
.................... (834K)
Uploading to org.apache.axis2/poms/axis2-integration-SNAPSHOT.pom: 
.................... (21K)

+----------------------------------------
| Executing multiproject:install-callback Apache Axis 2.0 - JAXB-RI Data Binding
| Memory: 32M/53M
+----------------------------------------
DEPRECATED: the default goal should be specified in the <build> section of project.xml instead of maven.xml
DEPRECATED: the default goal should be specified in the <build> section of project.xml instead of maven.xml

build:end:

build:start:

multiproject:install-callback:
    [echo] Running jar:install for Apache Axis 2.0 - JAXB-RI Data Binding
java:prepare-filesystem:
    [mkdir] Created dir: /export/home/illsleyd/continuum/continuum-1.0.3/apps/continuum/working-directory/1/modules/jaxbri/target/classes
Running post goal: java:prepare-filesystem

java:compile:
    [echo] Compiling to /export/home/illsleyd/continuum/continuum-1.0.3/apps/continuum/working-directory/1/modules/jaxbri/target/classes
    [javac] Compiling 1 source file to /export/home/illsleyd/continuum/continuum-1.0.3/apps/continuum/working-directory/1/modules/jaxbri/target/classes

java:jar-resources:
Copying 2 files to /export/home/illsleyd/continuum/continuum-1.0.3/apps/continuum/working-directory/1/modules/jaxbri/target/classes/META-INF

test:test:
    [echo] No tests to run.

jar:jar:
    [jar] Building jar: /export/home/illsleyd/continuum/continuum-1.0.3/apps/continuum/working-directory/1/modules/jaxbri/target/axis2-jaxbri-SNAPSHOT.jar

jar:install:
    [echo] Installing...
Uploading to org.apache.axis2/jars/axis2-jaxbri-SNAPSHOT.jar: 
.................... (7K)
Uploading to org.apache.axis2/poms/axis2-jaxbri-SNAPSHOT.pom: 
.................... (13K)

+----------------------------------------
| Executing multiproject:install-callback Apache Axis 2.0 - SAAJ API
| Memory: 28M/53M
+----------------------------------------
DEPRECATED: the default goal should be specified in the <build> section of project.xml instead of maven.xml

build:end:

build:start:

multiproject:install-callback:
    [echo] Running jar:install for Apache Axis 2.0 - SAAJ API
java:prepare-filesystem:
    [mkdir] Created dir: /export/home/illsleyd/continuum/continuum-1.0.3/apps/continuum/working-directory/1/modules/saaj-api/target/classes
Running post goal: java:prepare-filesystem

java:compile:
    [echo] Compiling to /export/home/illsleyd/continuum/continuum-1.0.3/apps/continuum/working-directory/1/modules/saaj-api/target/classes
    [javac] Compiling 29 source files to /export/home/illsleyd/continuum/continuum-1.0.3/apps/continuum/working-directory/1/modules/saaj-api/target/classes

java:jar-resources:
Copying 2 files to /export/home/illsleyd/continuum/continuum-1.0.3/apps/continuum/working-directory/1/modules/saaj-api/target/classes/META-INF

test:test:
    [echo] No tests to run.

jar:jar:
    [jar] Building jar: /export/home/illsleyd/continuum/continuum-1.0.3/apps/continuum/working-directory/1/modules/saaj-api/target/axis2-saaj-api-SNAPSHOT.jar

jar:install:
    [echo] Installing...
Uploading to org.apache.axis2/jars/axis2-saaj-api-SNAPSHOT.jar: 
.................... (28K)
Uploading to org.apache.axis2/poms/axis2-saaj-api-SNAPSHOT.pom: 
.................... (12K)

+----------------------------------------
| Executing multiproject:install-callback Apache Axis 2.0 - JAXWS API
| Memory: 25M/55M
+----------------------------------------
DEPRECATED: the default goal should be specified in the <build> section of project.xml instead of maven.xml

build:end:

Trying to get missing/snapshot dependencies required by Apache Axis 2.0 - JAXWS API:
Attempting to download axis2-saaj-api-SNAPSHOT.jar.
Skipping download as local copy is up to date!
build:start:

multiproject:install-callback:
    [echo] Running jar:install for Apache Axis 2.0 - JAXWS API
java:prepare-filesystem:
    [mkdir] Created dir: /export/home/illsleyd/continuum/continuum-1.0.3/apps/continuum/working-directory/1/modules/jaxws-api/target/classes
Running post goal: java:prepare-filesystem

java:compile:
    [echo] Compiling to /export/home/illsleyd/continuum/continuum-1.0.3/apps/continuum/working-directory/1/modules/jaxws-api/target/classes
    [javac] Compiling 52 source files to /export/home/illsleyd/continuum/continuum-1.0.3/apps/continuum/working-directory/1/modules/jaxws-api/target/classes
    [javac] Note: /export/home/illsleyd/continuum/continuum-1.0.3/apps/continuum/working-directory/1/modules/jaxws-api/src/javax/xml/ws/spi/FactoryFinder.java uses unchecked or unsafe operations.
    [javac] Note: Recompile with -Xlint:unchecked for details.

java:jar-resources:
Copying 2 files to /export/home/illsleyd/continuum/continuum-1.0.3/apps/continuum/working-directory/1/modules/jaxws-api/target/classes/META-INF

test:test:
    [echo] No tests to run.

jar:jar:
    [jar] Building jar: /export/home/illsleyd/continuum/continuum-1.0.3/apps/continuum/working-directory/1/modules/jaxws-api/target/axis2-jaxws-api-SNAPSHOT.jar

jar:install:
    [echo] Installing...
Uploading to org.apache.axis2/jars/axis2-jaxws-api-SNAPSHOT.jar: 
.................... (40K)
Uploading to org.apache.axis2/poms/axis2-jaxws-api-SNAPSHOT.pom: 
.................... (13K)

+----------------------------------------
| Executing multiproject:install-callback Apache Axis 2.0 - SAAJ
| Memory: 47M/55M
+----------------------------------------
DEPRECATED: the default goal should be specified in the <build> section of project.xml instead of maven.xml
DEPRECATED: the default goal should be specified in the <build> section of project.xml instead of maven.xml

build:end:

build:start:

multiproject:install-callback:
    [echo] Running jar:install for Apache Axis 2.0 - SAAJ
java:prepare-filesystem:
    [mkdir] Created dir: /export/home/illsleyd/continuum/continuum-1.0.3/apps/continuum/working-directory/1/modules/saaj/target/classes
Running post goal: java:prepare-filesystem

java:compile:
    [echo] Compiling to /export/home/illsleyd/continuum/continuum-1.0.3/apps/continuum/working-directory/1/modules/saaj/target/classes
    [javac] Compiling 26 source files to /export/home/illsleyd/continuum/continuum-1.0.3/apps/continuum/working-directory/1/modules/saaj/target/classes
    [javac] Note: Some input files use or override a deprecated API.
    [javac] Note: Recompile with -Xlint:deprecation for details.

java:jar-resources:
Copying 4 files to /export/home/illsleyd/continuum/continuum-1.0.3/apps/continuum/working-directory/1/modules/saaj/target/classes
Copying 2 files to /export/home/illsleyd/continuum/continuum-1.0.3/apps/continuum/working-directory/1/modules/saaj/target/classes/META-INF

test:test:
java:prepare-filesystem:
Running post goal: java:prepare-filesystem

java:compile:
    [echo] Compiling to /export/home/illsleyd/continuum/continuum-1.0.3/apps/continuum/working-directory/1/modules/saaj/target/classes

java:jar-resources:

test:prepare-filesystem:
    [mkdir] Created dir: /export/home/illsleyd/continuum/continuum-1.0.3/apps/continuum/working-directory/1/modules/saaj/target/test-classes
    [mkdir] Created dir: /export/home/illsleyd/continuum/continuum-1.0.3/apps/continuum/working-directory/1/modules/saaj/target/test-reports

test:test-resources:
Copying 9 files to /export/home/illsleyd/continuum/continuum-1.0.3/apps/continuum/working-directory/1/modules/saaj/target/test-classes

test:compile:
    [copy] Copying 1 file to /export/home/illsleyd/continuum/continuum-1.0.3/apps/continuum/working-directory/1/modules/saaj/target/test-classes/modules
    [javac] Compiling 22 source files to /export/home/illsleyd/continuum/continuum-1.0.3/apps/continuum/working-directory/1/modules/saaj/target/test-classes
Running post goal: test:compile
    [mkdir] Created dir: /export/home/illsleyd/continuum/continuum-1.0.3/apps/continuum/working-directory/1/modules/saaj/target/test-resources/saaj-repo
    [copy] Copying 1 file to /export/home/illsleyd/continuum/continuum-1.0.3/apps/continuum/working-directory/1/modules/saaj/target/test-resources/saaj-repo
    [copy] Copying 135 files to /export/home/illsleyd/continuum/continuum-1.0.3/apps/continuum/working-directory/1/modules/saaj/target

    [junit] Running org.apache.axis2.saaj.AttachmentSerializationTest
    [junit] Tests run: 1, Failures: 0, Errors: 0, Time elapsed: 0.796 sec
    [junit] Running org.apache.axis2.saaj.AttachmentTest
    [junit] Tests run: 8, Failures: 0, Errors: 0, Time elapsed: 1.337 sec
    [junit] Running org.apache.axis2.saaj.MessageFactoryTest
    [junit] Tests run: 3, Failures: 0, Errors: 0, Time elapsed: 0.805 sec
    [junit] Running org.apache.axis2.saaj.NodeTest
    [junit] Tests run: 5, Failures: 0, Errors: 0, Time elapsed: 0.518 sec
    [junit] Running org.apache.axis2.saaj.PrefixesTest
    [junit] Tests run: 3, Failures: 0, Errors: 0, Time elapsed: 1.091 sec
    [junit] Running org.apache.axis2.saaj.SAAJDetailTest
    [junit] Tests run: 2, Failures: 0, Errors: 0, Time elapsed: 0.638 sec
    [junit] Running org.apache.axis2.saaj.SAAJResultTest
    [junit] Tests run: 1, Failures: 0, Errors: 0, Time elapsed: 0.494 sec
    [junit] Running org.apache.axis2.saaj.SOAPBodyTest
    [junit] Tests run: 5, Failures: 0, Errors: 0, Time elapsed: 0.634 sec
    [junit] Running org.apache.axis2.saaj.SOAPConnectionTest
    [junit] Tests run: 4, Failures: 0, Errors: 0, Time elapsed: 0.79 sec
    [junit] Running org.apache.axis2.saaj.SOAPElementTest
    [junit] Tests run: 18, Failures: 0, Errors: 0, Time elapsed: 0.623 sec
    [junit] Running org.apache.axis2.saaj.SOAPEnvelopeTest
    [junit] Tests run: 16, Failures: 0, Errors: 0, Time elapsed: 1.067 sec
    [junit] Running org.apache.axis2.saaj.SOAPFactoryTest
    [junit] Tests run: 9, Failures: 0, Errors: 0, Time elapsed: 0.489 sec
    [junit] Running org.apache.axis2.saaj.SOAPFaultDetailTest
    [junit] Tests run: 1, Failures: 0, Errors: 0, Time elapsed: 1.023 sec
    [junit] Running org.apache.axis2.saaj.SOAPFaultTest
    [junit] Tests run: 16, Failures: 0, Errors: 0, Time elapsed: 0.634 sec
    [junit] Running org.apache.axis2.saaj.SOAPHeaderTest
    [junit] Tests run: 8, Failures: 0, Errors: 0, Time elapsed: 0.541 sec
    [junit] Running org.apache.axis2.saaj.SOAPMessageTest
    [junit] Tests run: 7, Failures: 0, Errors: 0, Time elapsed: 1.749 sec
    [junit] Running org.apache.axis2.saaj.SOAPNamespaceTest
    [junit] Tests run: 1, Failures: 0, Errors: 0, Time elapsed: 0.995 sec
    [junit] Running org.apache.axis2.saaj.SOAPPartTest
    [junit] Tests run: 3, Failures: 0, Errors: 0, Time elapsed: 0.859 sec
    [junit] Running org.apache.axis2.saaj.TextTest
    [junit] Tests run: 2, Failures: 0, Errors: 0, Time elapsed: 1.148 sec
    [junit] Running org.apache.axis2.saaj.integration.IntegrationTest
    [junit] Tests run: 3, Failures: 0, Errors: 0, Time elapsed: 7.227 sec

jar:jar:
    [jar] Building jar: /export/home/illsleyd/continuum/continuum-1.0.3/apps/continuum/working-directory/1/modules/saaj/target/axis2-saaj-SNAPSHOT.jar

jar:install:
    [echo] Installing...
Uploading to org.apache.axis2/jars/axis2-saaj-SNAPSHOT.jar: 
.................... (78K)
Uploading to org.apache.axis2/poms/axis2-saaj-SNAPSHOT.pom: 
.................... (16K)

+----------------------------------------
| Executing multiproject:install-callback Apache Axis 2.0 - Metadata
| Memory: 33M/56M
+----------------------------------------
DEPRECATED: the default goal should be specified in the <build> section of project.xml instead of maven.xml
DEPRECATED: the default goal should be specified in the <build> section of project.xml instead of maven.xml

build:end:

Trying to get missing/snapshot dependencies required by Apache Axis 2.0 - Metadata:
Attempting to download axis2-saaj-SNAPSHOT.jar.
Skipping download as local copy is up to date!
Attempting to download axis2-jaxws-api-SNAPSHOT.jar.
Skipping download as local copy is up to date!
build:start:

multiproject:install-callback:
    [echo] Running jar:install for Apache Axis 2.0 - Metadata
java:prepare-filesystem:
    [mkdir] Created dir: /export/home/illsleyd/continuum/continuum-1.0.3/apps/continuum/working-directory/1/modules/metadata/target/classes
Running post goal: java:prepare-filesystem

java:compile:
    [echo] Compiling to /export/home/illsleyd/continuum/continuum-1.0.3/apps/continuum/working-directory/1/modules/metadata/target/classes
    [javac] Compiling 80 source files to /export/home/illsleyd/continuum/continuum-1.0.3/apps/continuum/working-directory/1/modules/metadata/target/classes
    [javac] /export/home/illsleyd/continuum/continuum-1.0.3/apps/continuum/working-directory/1/modules/metadata/src/org/apache/axis2/jaxws/description/impl/FaultDescriptionImpl.java:109: warning: non-varargs call of varargs method with inexact argument type for last parameter;
    [javac] cast to java.lang.Class for a varargs call
    [javac] cast to java.lang.Class[] for a non-varargs call and to suppress this warning
    [javac]                 Method method = exceptionClass.getMethod("getFaultInfo", null);
    [javac]                                                                          ^
    [javac] Note: Some input files use or override a deprecated API.
    [javac] Note: Recompile with -Xlint:deprecation for details.
    [javac] Note: Some input files use unchecked or unsafe operations.
    [javac] Note: Recompile with -Xlint:unchecked for details.
    [javac] 1 warning

java:jar-resources:
Copying 1 file to /export/home/illsleyd/continuum/continuum-1.0.3/apps/continuum/working-directory/1/modules/metadata/target/classes
Running post goal: java:jar-resources

test:test:
java:prepare-filesystem:
Running post goal: java:prepare-filesystem

java:compile:
    [echo] Compiling to /export/home/illsleyd/continuum/continuum-1.0.3/apps/continuum/working-directory/1/modules/metadata/target/classes

java:jar-resources:
Running post goal: java:jar-resources

test:prepare-filesystem:
    [mkdir] Created dir: /export/home/illsleyd/continuum/continuum-1.0.3/apps/continuum/working-directory/1/modules/metadata/target/test-classes
    [mkdir] Created dir: /export/home/illsleyd/continuum/continuum-1.0.3/apps/continuum/working-directory/1/modules/metadata/target/test-reports

test:test-resources:
Copying 7 files to /export/home/illsleyd/continuum/continuum-1.0.3/apps/continuum/working-directory/1/modules/metadata/target/test-classes
Copying 1 file to /export/home/illsleyd/continuum/continuum-1.0.3/apps/continuum/working-directory/1/modules/metadata/target/test-classes

test:compile:
    [mkdir] Created dir: /export/home/illsleyd/continuum/continuum-1.0.3/apps/continuum/working-directory/1/modules/metadata/target/schema
    [mkdir] Created dir: /export/home/illsleyd/continuum/continuum-1.0.3/apps/continuum/working-directory/1/modules/metadata/target/schema/src
    [mkdir] Created dir: /export/home/illsleyd/continuum/continuum-1.0.3/apps/continuum/working-directory/1/modules/metadata/target/schema/classes
    [echo] Generating JAX-B classes from XSDs
    [echo] Generating java from ProxyDocLitWrapped.wsdl
    [echo] Compiling generated schema
    [javac] Compiling 14 source files to /export/home/illsleyd/continuum/continuum-1.0.3/apps/continuum/working-directory/1/modules/metadata/target/schema/classes
    [javac] Compiling 28 source files to /export/home/illsleyd/continuum/continuum-1.0.3/apps/continuum/working-directory/1/modules/metadata/target/test-classes
    [javac] Note: /export/home/illsleyd/continuum/continuum-1.0.3/apps/continuum/working-directory/1/modules/metadata/test/org/apache/axis2/jaxws/description/AnnotationServiceImplDescriptionTests.java uses or overrides a deprecated API.
    [javac] Note: Recompile with -Xlint:deprecation for details.

    [junit] Running org.apache.axis2.jaxws.description.AnnotationProviderImplDescriptionTests
    [junit] Tests run: 7, Failures: 0, Errors: 0, Time elapsed: 0.831 sec
    [junit] Running org.apache.axis2.jaxws.description.AnnotationServiceImplDescriptionTests
    [junit] Tests run: 12, Failures: 0, Errors: 0, Time elapsed: 0.924 sec
    [junit] Running org.apache.axis2.jaxws.description.AnnotationServiceImplWithDBCTests
    [junit] Tests run: 1, Failures: 0, Errors: 0, Time elapsed: 0.822 sec
    [junit] Running org.apache.axis2.jaxws.description.DocLitBareResolveOperationTests
    [junit] Tests run: 9, Failures: 0, Errors: 0, Time elapsed: 1.006 sec
    [junit] Running org.apache.axis2.jaxws.description.PartialWSDLTests
    [junit] Tests run: 2, Failures: 0, Errors: 0, Time elapsed: 1.246 sec
    [junit] Running org.apache.axis2.jaxws.description.ServiceAnnotationTests
    [junit] Tests run: 6, Failures: 0, Errors: 0, Time elapsed: 0.481 sec
    [junit] Running org.apache.axis2.jaxws.description.ValidateWSDLTests
    [junit] Tests run: 2, Failures: 0, Errors: 0, Time elapsed: 1.131 sec
    [junit] Running org.apache.axis2.jaxws.description.WrapperPackageTests
    [junit] Tests run: 2, Failures: 0, Errors: 0, Time elapsed: 0.829 sec
    [junit] Running org.apache.axis2.jaxws.description.builder.DescriptionBuilderTests
    [junit] Tests run: 4, Failures: 0, Errors: 0, Time elapsed: 0.445 sec
    [junit] Running org.apache.axis2.jaxws.description.builder.ParameterParsingTests
    [junit] Tests run: 21, Failures: 0, Errors: 0, Time elapsed: 0.44 sec
    [junit] Running org.apache.axis2.jaxws.description.builder.ReturnTypeParsingTests
    [junit] Tests run: 12, Failures: 0, Errors: 0, Time elapsed: 0.425 sec
    [junit] Running org.apache.axis2.jaxws.description.builder.converter.ReflectiveConverterTests
    [junit] Tests run: 7, Failures: 0, Errors: 0, Time elapsed: 0.469 sec
    [junit] Running org.apache.axis2.jaxws.description.impl.ParameterDescriptionImplTests
    [junit] Tests run: 5, Failures: 0, Errors: 0, Time elapsed: 0.335 sec
    [junit] Running org.apache.axis2.jaxws.description.impl.ServiceDescriptionImplTests
    [junit] Tests run: 5, Failures: 0, Errors: 0, Time elapsed: 0.442 sec
    [junit] Running org.apache.axis2.jaxws.description.impl.ServiceDescriptionImplValidationTests
    [junit] Tests run: 3, Failures: 0, Errors: 0, Time elapsed: 0.438 sec

jar:jar:
    [jar] Building jar: /export/home/illsleyd/continuum/continuum-1.0.3/apps/continuum/working-directory/1/modules/metadata/target/axis2-metadata-SNAPSHOT.jar

jar:install:
    [echo] Installing...
Uploading to org.apache.axis2/jars/axis2-metadata-SNAPSHOT.jar: 
.................... (172K)
Uploading to org.apache.axis2/poms/axis2-metadata-SNAPSHOT.pom: 
.................... (11K)

+----------------------------------------
| Executing multiproject:install-callback Apache Axis 2.0 - JAX-WS
| Memory: 25M/54M
+----------------------------------------
DEPRECATED: the default goal should be specified in the <build> section of project.xml instead of maven.xml
DEPRECATED: the default goal should be specified in the <build> section of project.xml instead of maven.xml

build:end:

Trying to get missing/snapshot dependencies required by Apache Axis 2.0 - JAX-WS:
Attempting to download axis2-metadata-SNAPSHOT.jar.
Skipping download as local copy is up to date!
build:start:

multiproject:install-callback:
    [echo] Running jar:install for Apache Axis 2.0 - JAX-WS
java:prepare-filesystem:
    [mkdir] Created dir: /export/home/illsleyd/continuum/continuum-1.0.3/apps/continuum/working-directory/1/modules/jaxws/target/classes
Running post goal: java:prepare-filesystem

java:compile:
    [echo] Compiling to /export/home/illsleyd/continuum/continuum-1.0.3/apps/continuum/working-directory/1/modules/jaxws/target/classes
    [javac] Compiling 162 source files to /export/home/illsleyd/continuum/continuum-1.0.3/apps/continuum/working-directory/1/modules/jaxws/target/classes
    [javac] /export/home/illsleyd/continuum/continuum-1.0.3/apps/continuum/working-directory/1/modules/jaxws/src/org/apache/axis2/jaxws/utility/PropertyDescriptorPlus.java:94: warning: non-varargs call of varargs method with inexact argument type for last parameter;
    [javac] cast to java.lang.Object for a varargs call
    [javac] cast to java.lang.Object[] for a non-varargs call and to suppress this warning
    [javac] 		return method.invoke(targetBean, null);
    [javac]                                                  ^
    [javac] /export/home/illsleyd/continuum/continuum-1.0.3/apps/continuum/working-directory/1/modules/jaxws/src/org/apache/axis2/jaxws/marshaller/impl/alt/MethodMarshallerUtils.java:553: warning: non-varargs call of varargs method with inexact argument type for last parameter;
    [javac] cast to java.lang.Class for a varargs call
    [javac] cast to java.lang.Class[] for a non-varargs call and to suppress this warning
    [javac]                     Method getFaultInfo = t.getClass().getMethod("getFaultInfo", null);
    [javac]                                                                                  ^
    [javac] /export/home/illsleyd/continuum/continuum-1.0.3/apps/continuum/working-directory/1/modules/jaxws/src/org/apache/axis2/jaxws/marshaller/impl/alt/MethodMarshallerUtils.java:554: warning: non-varargs call of varargs method with inexact argument type for last parameter;
    [javac] cast to java.lang.Object for a varargs call
    [javac] cast to java.lang.Object[] for a non-varargs call and to suppress this warning
    [javac]                     faultBeanObject = getFaultInfo.invoke(t, null);
    [javac]                                                              ^
    [javac] Note: Some input files use or override a deprecated API.
    [javac] Note: Recompile with -Xlint:deprecation for details.
    [javac] Note: Some input files use unchecked or unsafe operations.
    [javac] Note: Recompile with -Xlint:unchecked for details.
    [javac] 3 warnings

java:jar-resources:
Copying 2 files to /export/home/illsleyd/continuum/continuum-1.0.3/apps/continuum/working-directory/1/modules/jaxws/target/classes/META-INF

test:test:
java:prepare-filesystem:
Running post goal: java:prepare-filesystem

java:compile:
    [echo] Compiling to /export/home/illsleyd/continuum/continuum-1.0.3/apps/continuum/working-directory/1/modules/jaxws/target/classes

java:jar-resources:

test:prepare-filesystem:
    [mkdir] Created dir: /export/home/illsleyd/continuum/continuum-1.0.3/apps/continuum/working-directory/1/modules/jaxws/target/test-classes
    [mkdir] Created dir: /export/home/illsleyd/continuum/continuum-1.0.3/apps/continuum/working-directory/1/modules/jaxws/target/test-reports

test:test-resources:
Copying 46 files to /export/home/illsleyd/continuum/continuum-1.0.3/apps/continuum/working-directory/1/modules/jaxws/target/test-classes

test:compile:
    [mkdir] Created dir: /export/home/illsleyd/continuum/continuum-1.0.3/apps/continuum/working-directory/1/modules/jaxws/target/schema
    [mkdir] Created dir: /export/home/illsleyd/continuum/continuum-1.0.3/apps/continuum/working-directory/1/modules/jaxws/target/schema/src
    [mkdir] Created dir: /export/home/illsleyd/continuum/continuum-1.0.3/apps/continuum/working-directory/1/modules/jaxws/target/schema/classes
    [echo] Generating JAX-B classes from XSDs
    [echo] Generating java from soap 11
    [echo] Generating java from echo.xsd
    [echo] Generating java from stock1.xsd
    [echo] Generating java from stock2.xsd
    [echo] Generating java from samplemtom.xsd
    [echo] Generating java from ProxyDocLitWrapped.wsdl
    [echo] Generating java from ProxyDocLitnonWrapped.wsdl
    [echo] Generating java from samplemtomjpeg.wsdl
    [echo] Generating java from RPCLit.wsdl
    [echo] Generating java from gorilla_dlw.wsdl
    [echo] Generating java from SOAP12Echo.wsdl
    [echo] Generating java from AddNumbers.wsdl
    [echo] Generating java from async_doclitwr.wsdl
    [echo] Generating java from FaultyWebService.wsdl
    [echo] Generating java from FaultsService.wsdl
    [echo] Generating java from jaxbsource
    [echo] Generating java from doclit_nonwrap.wsdl for javabean endpoint support
    [echo] Generating java from doclitwrap.wsdl for javabean endpoint support
    [echo] Generating java from doclitbare.wsdl for javabean endpoint support
    [echo] Generating java from greeterTypes.xsd
    [echo] Generating java from EchoMessage.wsdl for javabean endpoint support
    [echo] Generating java from resourceinjection.wsdl for javabean endpoint Resource Injection support
    [echo] Generating java from AnyType.wsdl for javabean endpoint AnyType support
    [echo] Generating java from WSDLMultiTests.wsdl
    [echo] Generating java from Polymorphic shapes.wsdl for javabean endpoint support
    [echo] Generating java from SOAPActionTest.wsdl
    [echo] Compiling generated schema
    [javac] Compiling 223 source files to /export/home/illsleyd/continuum/continuum-1.0.3/apps/continuum/working-directory/1/modules/jaxws/target/schema/classes
    [javac] Note: Some input files use unchecked or unsafe operations.
    [javac] Note: Recompile with -Xlint:unchecked for details.
    [javac] Compiling 213 source files to /export/home/illsleyd/continuum/continuum-1.0.3/apps/continuum/working-directory/1/modules/jaxws/target/test-classes
    [javac] Note: Some input files use or override a deprecated API.
    [javac] Note: Recompile with -Xlint:deprecation for details.
    [javac] Note: Some input files use unchecked or unsafe operations.
    [javac] Note: Recompile with -Xlint:unchecked for details.
Running post goal: test:compile
    [copy] Copying 7 files to /export/home/illsleyd/continuum/continuum-1.0.3/apps/continuum/working-directory/1/modules/jaxws/target/test-classes/services/EchoService
    [copy] Copying 25 files to /export/home/illsleyd/continuum/continuum-1.0.3/apps/continuum/working-directory/1/modules/jaxws/target/test-classes/services/BasicAuthSecurityService
    [copy] Copying 26 files to /export/home/illsleyd/continuum/continuum-1.0.3/apps/continuum/working-directory/1/modules/jaxws/target/test-classes/services/StringProviderService
    [copy] Copying 25 files to /export/home/illsleyd/continuum/continuum-1.0.3/apps/continuum/working-directory/1/modules/jaxws/target/test-classes/services/StringMessageProviderService
    [copy] Copying 25 files to /export/home/illsleyd/continuum/continuum-1.0.3/apps/continuum/working-directory/1/modules/jaxws/target/test-classes/services/SourceProviderService
    [copy] Copying 25 files to /export/home/illsleyd/continuum/continuum-1.0.3/apps/continuum/working-directory/1/modules/jaxws/target/test-classes/services/SourceMessageProviderService
    [copy] Copying 25 files to /export/home/illsleyd/continuum/continuum-1.0.3/apps/continuum/working-directory/1/modules/jaxws/target/test-classes/services/SoapMessageProviderService
    [copy] Copying 32 files to /export/home/illsleyd/continuum/continuum-1.0.3/apps/continuum/working-directory/1/modules/jaxws/target/test-classes/services/JAXBProviderService
    [copy] Copying 30 files to /export/home/illsleyd/continuum/continuum-1.0.3/apps/continuum/working-directory/1/modules/jaxws/target/test-classes/services/SendImageService
    [copy] Copying 3 files to /export/home/illsleyd/continuum/continuum-1.0.3/apps/continuum/working-directory/1/modules/jaxws/target/test-classes/services/SOAP12Service
    [copy] Copying 28 files to /export/home/illsleyd/continuum/continuum-1.0.3/apps/continuum/working-directory/1/modules/jaxws/target/test-classes/services/ProxyDocLitWrapped
    [copy] Copying 28 files to /export/home/illsleyd/continuum/continuum-1.0.3/apps/continuum/working-directory/1/modules/jaxws/target/test-classes/services/ProxyDocLitnonWrapped
    [copy] Copying 29 files to /export/home/illsleyd/continuum/continuum-1.0.3/apps/continuum/working-directory/1/modules/jaxws/target/test-classes/services/RPCLit
    [copy] Copying 5 files to /export/home/illsleyd/continuum/continuum-1.0.3/apps/continuum/working-directory/1/modules/jaxws/target/test-classes/services/SOAP12EchoService
    [copy] Copying 5 files to /export/home/illsleyd/continuum/continuum-1.0.3/apps/continuum/working-directory/1/modules/jaxws/target/test-classes/services/BookStoreService
    [copy] Copying 29 files to /export/home/illsleyd/continuum/continuum-1.0.3/apps/continuum/working-directory/1/modules/jaxws/target/test-classes/services/gorilla_dlw
    [copy] Copying 3 files to /export/home/illsleyd/continuum/continuum-1.0.3/apps/continuum/working-directory/1/modules/jaxws/target/test-classes/services/XPayloadStringProvider
    [copy] Copying 3 files to /export/home/illsleyd/continuum/continuum-1.0.3/apps/continuum/working-directory/1/modules/jaxws/target/test-classes/services/XMessageStringProvider
    [copy] Copying 3 files to /export/home/illsleyd/continuum/continuum-1.0.3/apps/continuum/working-directory/1/modules/jaxws/target/test-classes/services/XPayloadSourceProvider
    [copy] Copying 3 files to /export/home/illsleyd/continuum/continuum-1.0.3/apps/continuum/working-directory/1/modules/jaxws/target/test-classes/services/XMessageSourceProvider
    [copy] Copying 3 files to /export/home/illsleyd/continuum/continuum-1.0.3/apps/continuum/working-directory/1/modules/jaxws/target/test-classes/services/XMessageDataSourceProvider
    [copy] Copying 7 files to /export/home/illsleyd/continuum/continuum-1.0.3/apps/continuum/working-directory/1/modules/jaxws/target/test-classes/services/WSGenService
    [copy] Copying 11 files to /export/home/illsleyd/continuum/continuum-1.0.3/apps/continuum/working-directory/1/modules/jaxws/target/test-classes/services/AddressBookService
    [copy] Copying 4 files to /export/home/illsleyd/continuum/continuum-1.0.3/apps/continuum/working-directory/1/modules/jaxws/target/test-classes/services/MtomSampleService
    [copy] Copying 27 files to /export/home/illsleyd/continuum/continuum-1.0.3/apps/continuum/working-directory/1/modules/jaxws/target/test-classes/services/DocLitNonWrapService
    [copy] Copying 27 files to /export/home/illsleyd/continuum/continuum-1.0.3/apps/continuum/working-directory/1/modules/jaxws/target/test-classes/services/DocLitWrapService
    [copy] Copying 28 files to /export/home/illsleyd/continuum/continuum-1.0.3/apps/continuum/working-directory/1/modules/jaxws/target/test-classes/services/AddNumbersService
    [copy] Copying 30 files to /export/home/illsleyd/continuum/continuum-1.0.3/apps/continuum/working-directory/1/modules/jaxws/target/test-classes/services/GreeterService
    [copy] Copying 32 files to /export/home/illsleyd/continuum/continuum-1.0.3/apps/continuum/working-directory/1/modules/jaxws/target/test-classes/services/AsyncService
    [copy] Copying 28 files to /export/home/illsleyd/continuum/continuum-1.0.3/apps/continuum/working-directory/1/modules/jaxws/target/test-classes/services/FaultyWebServiceService
    [copy] Copying 34 files to /export/home/illsleyd/continuum/continuum-1.0.3/apps/continuum/working-directory/1/modules/jaxws/target/test-classes/services/FaultsService
    [copy] Copying 29 files to /export/home/illsleyd/continuum/continuum-1.0.3/apps/continuum/working-directory/1/modules/jaxws/target/test-classes/services/BareDocLitService
    [copy] Copying 28 files to /export/home/illsleyd/continuum/continuum-1.0.3/apps/continuum/working-directory/1/modules/jaxws/target/test-classes/services/EchoMessageService
    [copy] Copying 27 files to /export/home/illsleyd/continuum/continuum-1.0.3/apps/continuum/working-directory/1/modules/jaxws/target/test-classes/services/ResourceInjectionService
    [copy] Copying 28 files to /export/home/illsleyd/continuum/continuum-1.0.3/apps/continuum/working-directory/1/modules/jaxws/target/test-classes/services/AnyTypeMessageService
    [copy] Copying 31 files to /export/home/illsleyd/continuum/continuum-1.0.3/apps/continuum/working-directory/1/modules/jaxws/target/test-classes/services/PolymorphicShapeService

    [junit] Running org.apache.axis2.jaxws.framework.JAXWSTest
    [junit] Tests run: 2, Failures: 1, Errors: 0, Time elapsed: 6.307 sec

BUILD FAILED
File...... file:/export/home/illsleyd/.maven/cache/maven-multiproject-plugin-1.5-SNAPSHOT/plugin.jelly
Element... maven:reactor
Line...... 227
Column.... 64
Unable to obtain goal [multiproject:install-callback] -- file:/export/home/illsleyd/.maven/cache/maven-test-plugin-1.8.1-SNAPSHOT/plugin.jelly:155:49: <junit> Test org.apache.axis2.jaxws.framework.JAXWSTest failed
Total time   : 30 minutes 47 seconds 
Finished at  : Wednesday, March 7, 2007 8:44:28 AM GMT+00:00


****************************************************************************



---------------------------------------------------------------------
To unsubscribe, e-mail: axis-dev-unsubscribe@ws.apache.org
For additional commands, e-mail: axis-dev-help@ws.apache.org


Mime
View raw message