axis-java-dev mailing list archives

Site index · List index
Message view « Date » · « Thread »
Top « Date » · « Thread »
From "davidillsley (Continuum)" <davidills...@apache.org>
Subject [continuum] BUILD FAILURE: Apache Axis 2.0 - Root
Date Tue, 13 Mar 2007 16:13:06 GMT
Online report : http://localhost:8080/continuum/servlet/continuum/target/ProjectBuild.vm/view/ProjectBuild/id/61/buildId/1371
Build statistics:
  State: Failed
  Previous State: Failed
  Started at: Tue, 13 Mar 2007 16:06:52 +0000
  Finished at: Tue, 13 Mar 2007 16:13:06 +0000
  Total time: 6m 13s
  Build Trigger: Schedule
  Exit code: 1
  Building machine hostname: ws.zones.apache.org
  Operating system : SunOS(unknown)
  Java version : 1.5.0_09(Sun Microsystems Inc.)

Changes
         davidillsley          Fix for AXIS2-2291
Added get/setFaultAction methods
Made AxisFault actually serializable simple by making the
inner class implement the interface.
             /webservices/axis2/trunk/java/modules/kernel/src/org/apache/axis2/AxisFault.java
            /webservices/axis2/trunk/java/modules/kernel/src/org/apache/axis2/util/MessageContextBuilder.java
        
****************************************************************************
Output:
****************************************************************************
[INFO] Scanning for projects...
[INFO] Reactor build order: 
[INFO]   Apache Axis 2.0 - Parent
[INFO]   Apache Axis 2.0 - tool - AAR Maven Plugin
[INFO]   Apache Axis 2.0 - Java2WSDL
[INFO]   Apache Axis 2.0 - Kernel
[INFO]   Apache Axis 2.0 - Data Binding
[INFO]   Apache Axis 2.0 - Code Generation
[INFO]   Apache Axis 2.0 - ADB Codegen
[INFO]   Apache Axis 2.0 - tool - Ant Plugin
[INFO]   Apache Axis 2.0 - tool - Intellij IDEA Plugin
[INFO]   Apache Axis 2.0 - tool - Java2WSDL Maven Plugin
[INFO]   Apache Axis 2.0 - tool - WSDL2Code Maven Plugin
[INFO]   Apache Axis 2.0 - tool - MAR Maven Plugin
[INFO]   Apache Axis 2.0 - Addressing
[INFO]   Apache Axis 2.0 - JiBX Data Binding
[INFO]   Apache Axis 2.0 - XMLBeans Data Binding
[INFO]   Apache Axis 2.0 - JSON
[INFO]   Apache Axis 2.0 - MTOM Policy
[INFO]   Apache Axis 2.0 - spring
[INFO]   Apache Axis 2.0 - JAXB-RI Data Binding
[INFO]   Apache Axis 2.0 - SAAJ API
[INFO]   Apache Axis 2.0 - JAXWS API
[INFO]   Apache Axis 2.0 - Metadata
[INFO]   Apache Axis 2.0 - SAAJ
[INFO]   Apache Axis 2.0 - JAXWS
[INFO]   Apache Axis 2.0 - Root
[INFO] ----------------------------------------------------------------------------
[INFO] Building Apache Axis 2.0 - Parent
[INFO]    task-segment: [clean, install]
[INFO] ----------------------------------------------------------------------------
[INFO] [clean:clean]
[INFO] Deleting directory /export/home/illsleyd/continuum/continuum-1.0.3/apps/continuum/working-directory/61/modules/parent/target
[INFO] Deleting directory /export/home/illsleyd/continuum/continuum-1.0.3/apps/continuum/working-directory/61/modules/parent/target/classes
[INFO] Deleting directory /export/home/illsleyd/continuum/continuum-1.0.3/apps/continuum/working-directory/61/modules/parent/target/test-classes
[INFO] [site:attach-descriptor]
[INFO] [install:install]
[INFO] Installing /export/home/illsleyd/continuum/continuum-1.0.3/apps/continuum/working-directory/61/modules/parent/pom.xml to /export/home/illsleyd/.m2/repository/org/apache/axis2/axis2-parent/SNAPSHOT/axis2-parent-SNAPSHOT.pom
[INFO] ----------------------------------------------------------------------------
[INFO] Building Apache Axis 2.0 - tool - AAR Maven Plugin
[INFO]    task-segment: [clean, install]
[INFO] ----------------------------------------------------------------------------
[INFO] [clean:clean]
[INFO] Deleting directory /export/home/illsleyd/continuum/continuum-1.0.3/apps/continuum/working-directory/61/modules/tool/axis2-aar-maven-plugin/target
[INFO] Deleting directory /export/home/illsleyd/continuum/continuum-1.0.3/apps/continuum/working-directory/61/modules/tool/axis2-aar-maven-plugin/target/classes
[INFO] Deleting directory /export/home/illsleyd/continuum/continuum-1.0.3/apps/continuum/working-directory/61/modules/tool/axis2-aar-maven-plugin/target/test-classes
[INFO] [plugin:descriptor]
[INFO] Using 2 extractors.
[INFO] Applying extractor for language: java
[INFO] Extractor for language: java found 3 mojo descriptors.
[INFO] Applying extractor for language: bsh
[INFO] Extractor for language: bsh found 0 mojo descriptors.
[INFO] [resources:resources]
[INFO] Using default encoding to copy filtered resources.
[WARNING] 
	Artifact junit:junit:jar:3.8.2:test retains local scope 'test' overriding broader scope 'compile'
	given by a dependency. If this is not intended, modify or remove the local scope.

[INFO] [compiler:compile]
[INFO] Compiling 5 source files to /export/home/illsleyd/continuum/continuum-1.0.3/apps/continuum/working-directory/61/modules/tool/axis2-aar-maven-plugin/target/classes
[INFO] [resources:testResources]
[INFO] Using default encoding to copy filtered resources.
[INFO] [compiler:testCompile]
[INFO] No sources to compile
[INFO] [surefire:test]
[INFO] Tests are skipped.
[INFO] [jar:jar]
[INFO] Building jar: /export/home/illsleyd/continuum/continuum-1.0.3/apps/continuum/working-directory/61/modules/tool/axis2-aar-maven-plugin/target/axis2-aar-maven-plugin-SNAPSHOT.jar
[INFO] [plugin:addPluginArtifactMetadata]
[INFO] [install:install]
[INFO] Installing /export/home/illsleyd/continuum/continuum-1.0.3/apps/continuum/working-directory/61/modules/tool/axis2-aar-maven-plugin/target/axis2-aar-maven-plugin-SNAPSHOT.jar to /export/home/illsleyd/.m2/repository/org/apache/axis2/maven2/axis2-aar-maven-plugin/SNAPSHOT/axis2-aar-maven-plugin-SNAPSHOT.jar
[INFO] [plugin:updateRegistry]
[INFO] ----------------------------------------------------------------------------
[INFO] Building Apache Axis 2.0 - Java2WSDL
[INFO]    task-segment: [clean, install]
[INFO] ----------------------------------------------------------------------------
[INFO] [clean:clean]
[INFO] Deleting directory /export/home/illsleyd/continuum/continuum-1.0.3/apps/continuum/working-directory/61/modules/java2wsdl/target
[INFO] Deleting directory /export/home/illsleyd/continuum/continuum-1.0.3/apps/continuum/working-directory/61/modules/java2wsdl/target/classes
[INFO] Deleting directory /export/home/illsleyd/continuum/continuum-1.0.3/apps/continuum/working-directory/61/modules/java2wsdl/target/test-classes
[INFO] [resources:resources]
[INFO] Using default encoding to copy filtered resources.
Downloading: http://ws.zones.apache.org/repository2//jaxen/jaxen/1.1-beta-10/jaxen-1.1-beta-10.pom
[WARNING] Unable to get resource from repository apache-ws-snapshots2 (http://ws.zones.apache.org/repository2/)
Downloading: http://repo1.maven.org/maven2//jaxen/jaxen/1.1-beta-10/jaxen-1.1-beta-10.pom
[WARNING] Unable to get resource from repository maven2 (http://repo1.maven.org/maven2/)
Downloading: http://repo1.maven.org/maven2/jaxen/jaxen/1.1-beta-10/jaxen-1.1-beta-10.pom
[WARNING] Unable to get resource from repository central (http://repo1.maven.org/maven2)
[WARNING] While downloading woodstox:wstx-asl:3.2.0
  This artifact has been relocated to org.codehaus.woodstox:wstx-asl:3.2.0.


[INFO] [compiler:compile]
[INFO] Compiling 23 source files to /export/home/illsleyd/continuum/continuum-1.0.3/apps/continuum/working-directory/61/modules/java2wsdl/target/classes
[INFO] [resources:testResources]
[INFO] Using default encoding to copy filtered resources.
Downloading: http://ws.zones.apache.org/repository2//org/apache/ws/commons/schema/XmlSchema/20070313.054527-26/XmlSchema-20070313.054527-26.pom
[WARNING] Unable to get resource from repository apache-ws-snapshots2 (http://ws.zones.apache.org/repository2/)
Downloading: http://repo1.maven.org/maven2//org/apache/ws/commons/schema/XmlSchema/20070313.054527-26/XmlSchema-20070313.054527-26.pom
[WARNING] Unable to get resource from repository maven2 (http://repo1.maven.org/maven2/)
Downloading: http://repo1.maven.org/maven2/org/apache/ws/commons/schema/XmlSchema/20070313.054527-26/XmlSchema-20070313.054527-26.pom
[WARNING] Unable to get resource from repository central (http://repo1.maven.org/maven2)
[INFO] [compiler:testCompile]
[INFO] No sources to compile
[INFO] [surefire:test]
[INFO] Tests are skipped.
[INFO] [jar:jar]
[INFO] Building jar: /export/home/illsleyd/continuum/continuum-1.0.3/apps/continuum/working-directory/61/modules/java2wsdl/target/axis2-java2wsdl-SNAPSHOT.jar
[INFO] [install:install]
[INFO] Installing /export/home/illsleyd/continuum/continuum-1.0.3/apps/continuum/working-directory/61/modules/java2wsdl/target/axis2-java2wsdl-SNAPSHOT.jar to /export/home/illsleyd/.m2/repository/org/apache/axis2/axis2-java2wsdl/SNAPSHOT/axis2-java2wsdl-SNAPSHOT.jar
[INFO] ----------------------------------------------------------------------------
[INFO] Building Apache Axis 2.0 - Kernel
[INFO]    task-segment: [clean, install]
[INFO] ----------------------------------------------------------------------------
[INFO] [clean:clean]
[INFO] Deleting directory /export/home/illsleyd/continuum/continuum-1.0.3/apps/continuum/working-directory/61/modules/kernel/target
[INFO] Deleting directory /export/home/illsleyd/continuum/continuum-1.0.3/apps/continuum/working-directory/61/modules/kernel/target/classes
[INFO] Deleting directory /export/home/illsleyd/continuum/continuum-1.0.3/apps/continuum/working-directory/61/modules/kernel/target/test-classes
[INFO] [resources:resources]
[INFO] Using default encoding to copy filtered resources.
[WARNING] While downloading woodstox:wstx-asl:3.2.0
  This artifact has been relocated to org.codehaus.woodstox:wstx-asl:3.2.0.


[WARNING] 
	Artifact javax.servlet:servlet-api:jar:2.3:provided retains local scope 'provided' overriding broader scope 'compile'
	given by a dependency. If this is not intended, modify or remove the local scope.

Downloading: http://ws.zones.apache.org/repository2//org/apache/neethi/neethi/2.0/neethi-2.0.pom
[WARNING] Unable to get resource from repository apache-ws-snapshots2 (http://ws.zones.apache.org/repository2/)
Downloading: http://repo1.maven.org/maven2//org/apache/neethi/neethi/2.0/neethi-2.0.pom
[WARNING] Unable to get resource from repository maven2 (http://repo1.maven.org/maven2/)
Downloading: http://repo1.maven.org/maven2/org/apache/neethi/neethi/2.0/neethi-2.0.pom
[WARNING] Unable to get resource from repository central (http://repo1.maven.org/maven2)
[INFO] [compiler:compile]
[INFO] Compiling 334 source files to /export/home/illsleyd/continuum/continuum-1.0.3/apps/continuum/working-directory/61/modules/kernel/target/classes
[INFO] [resources:testResources]
[INFO] Using default encoding to copy filtered resources.
[INFO] [antrun:run {execution: process-test-resources}]
[INFO] Executing tasks

init:
     [echo] the files are up to date = ${jars.uptodate}

compile:
    [mkdir] Created dir: /export/home/illsleyd/continuum/continuum-1.0.3/apps/continuum/working-directory/61/modules/kernel/test-resources/deployment/service2/build/classes
    [mkdir] Created dir: /export/home/illsleyd/continuum/continuum-1.0.3/apps/continuum/working-directory/61/modules/kernel/test-resources/deployment/service2/build/lib

jar:
     [copy] Copying 1 file to /export/home/illsleyd/continuum/continuum-1.0.3/apps/continuum/working-directory/61/modules/kernel/test-resources/deployment/service2/build/classes/META-INF
    [mkdir] Created dir: /export/home/illsleyd/continuum/continuum-1.0.3/apps/continuum/working-directory/61/modules/kernel/target/test-resources/deployment/services
      [jar] Building jar: /export/home/illsleyd/continuum/continuum-1.0.3/apps/continuum/working-directory/61/modules/kernel/target/test-resources/deployment/services/service2.jar
   [delete] Deleting directory /export/home/illsleyd/continuum/continuum-1.0.3/apps/continuum/working-directory/61/modules/kernel/test-resources/deployment/service2/build

init:
     [echo] the files are up to date = ${jars.uptodate}

compile:
    [mkdir] Created dir: /export/home/illsleyd/continuum/continuum-1.0.3/apps/continuum/working-directory/61/modules/kernel/test-resources/deployment/echo/build/classes
    [mkdir] Created dir: /export/home/illsleyd/continuum/continuum-1.0.3/apps/continuum/working-directory/61/modules/kernel/test-resources/deployment/echo/build/lib

jar:
     [copy] Copying 1 file to /export/home/illsleyd/continuum/continuum-1.0.3/apps/continuum/working-directory/61/modules/kernel/test-resources/deployment/echo/build/classes/META-INF
    [mkdir] Created dir: /export/home/illsleyd/continuum/continuum-1.0.3/apps/continuum/working-directory/61/modules/kernel/target/echo
      [jar] Building jar: /export/home/illsleyd/continuum/continuum-1.0.3/apps/continuum/working-directory/61/modules/kernel/target/echo/echo.aar
   [delete] Deleting directory /export/home/illsleyd/continuum/continuum-1.0.3/apps/continuum/working-directory/61/modules/kernel/test-resources/deployment/echo/build

init:
     [echo] the files are up to date = ${jars.uptodate}

compile:
    [mkdir] Created dir: /export/home/illsleyd/continuum/continuum-1.0.3/apps/continuum/working-directory/61/modules/kernel/test-resources/deployment/invalidservice/build/classes
    [mkdir] Created dir: /export/home/illsleyd/continuum/continuum-1.0.3/apps/continuum/working-directory/61/modules/kernel/test-resources/deployment/invalidservice/build/lib

jar:
     [copy] Copying 1 file to /export/home/illsleyd/continuum/continuum-1.0.3/apps/continuum/working-directory/61/modules/kernel/test-resources/deployment/invalidservice/build/classes/META-INF
    [mkdir] Created dir: /export/home/illsleyd/continuum/continuum-1.0.3/apps/continuum/working-directory/61/modules/kernel/target/test-resources/InvalidDeployment/services
      [jar] Building jar: /export/home/illsleyd/continuum/continuum-1.0.3/apps/continuum/working-directory/61/modules/kernel/target/test-resources/InvalidDeployment/services/invalidService.jar
   [delete] Deleting directory /export/home/illsleyd/continuum/continuum-1.0.3/apps/continuum/working-directory/61/modules/kernel/test-resources/deployment/invalidservice/build

init:
     [echo] the files are up to date = ${jars.uptodate}

compile:
    [mkdir] Created dir: /export/home/illsleyd/continuum/continuum-1.0.3/apps/continuum/working-directory/61/modules/kernel/test-resources/deployment/module1/build/classes
    [mkdir] Created dir: /export/home/illsleyd/continuum/continuum-1.0.3/apps/continuum/working-directory/61/modules/kernel/test-resources/deployment/module1/build/lib

jar:
     [copy] Copying 1 file to /export/home/illsleyd/continuum/continuum-1.0.3/apps/continuum/working-directory/61/modules/kernel/test-resources/deployment/module1/build/classes/META-INF
    [mkdir] Created dir: /export/home/illsleyd/continuum/continuum-1.0.3/apps/continuum/working-directory/61/modules/kernel/target/test-resources/deployment/modules
      [jar] Building jar: /export/home/illsleyd/continuum/continuum-1.0.3/apps/continuum/working-directory/61/modules/kernel/target/test-resources/deployment/modules/module1.mar
   [delete] Deleting directory /export/home/illsleyd/continuum/continuum-1.0.3/apps/continuum/working-directory/61/modules/kernel/test-resources/deployment/module1/build

init:
     [echo] the files are up to date = ${jars.uptodate}

compile:
    [mkdir] Created dir: /export/home/illsleyd/continuum/continuum-1.0.3/apps/continuum/working-directory/61/modules/kernel/test-resources/deployment/serviceModule/build/classes
    [mkdir] Created dir: /export/home/illsleyd/continuum/continuum-1.0.3/apps/continuum/working-directory/61/modules/kernel/test-resources/deployment/serviceModule/build/lib

jar:
     [copy] Copying 1 file to /export/home/illsleyd/continuum/continuum-1.0.3/apps/continuum/working-directory/61/modules/kernel/test-resources/deployment/serviceModule/build/classes/META-INF
    [mkdir] Created dir: /export/home/illsleyd/continuum/continuum-1.0.3/apps/continuum/working-directory/61/modules/kernel/target/test-resources/InvalidDeployment/modules
      [jar] Building jar: /export/home/illsleyd/continuum/continuum-1.0.3/apps/continuum/working-directory/61/modules/kernel/target/test-resources/InvalidDeployment/modules/serviceModule.jar
   [delete] Deleting directory /export/home/illsleyd/continuum/continuum-1.0.3/apps/continuum/working-directory/61/modules/kernel/test-resources/deployment/serviceModule/build
[INFO] Executed tasks
[INFO] [compiler:testCompile]
[INFO] Compiling 93 source files to /export/home/illsleyd/continuum/continuum-1.0.3/apps/continuum/working-directory/61/modules/kernel/target/test-classes
[INFO] [antrun:run {execution: test-compile}]
[INFO] Executing tasks

testsetup:
    [mkdir] Created dir: /export/home/illsleyd/continuum/continuum-1.0.3/apps/continuum/working-directory/61/modules/kernel/target/test-resources/java2sec/more
    [mkdir] Created dir: /export/home/illsleyd/continuum/continuum-1.0.3/apps/continuum/working-directory/61/modules/kernel/target/test-resources/java2sec/less
      [jar] Building jar: /export/home/illsleyd/continuum/continuum-1.0.3/apps/continuum/working-directory/61/modules/kernel/target/test-resources/java2sec/more/MorePermission.jar
   [delete] Deleting directory /export/home/illsleyd/continuum/continuum-1.0.3/apps/continuum/working-directory/61/modules/kernel/target/test-classes/org/apache/axis2/java/security/driver
   [delete] Deleting directory /export/home/illsleyd/continuum/continuum-1.0.3/apps/continuum/working-directory/61/modules/kernel/target/test-classes/org/apache/axis2/java/security/more
   [delete] Deleting directory /export/home/illsleyd/continuum/continuum-1.0.3/apps/continuum/working-directory/61/modules/kernel/target/test-classes/org/apache/axis2/java/security/action
   [delete] Deleting directory /export/home/illsleyd/continuum/continuum-1.0.3/apps/continuum/working-directory/61/modules/kernel/target/test-classes/org/apache/axis2/java/security/interf
      [jar] Building jar: /export/home/illsleyd/continuum/continuum-1.0.3/apps/continuum/working-directory/61/modules/kernel/target/test-resources/java2sec/less/LessPermission.jar
   [delete] Deleting directory /export/home/illsleyd/continuum/continuum-1.0.3/apps/continuum/working-directory/61/modules/kernel/target/test-classes/org/apache/axis2/java/security/less
[INFO] Executed tasks
[INFO] [surefire:test]
[INFO] Setting reports dir: /export/home/illsleyd/continuum/continuum-1.0.3/apps/continuum/working-directory/61/modules/kernel/target/surefire-reports

-------------------------------------------------------
 T E S T S
-------------------------------------------------------
log4j:WARN No appenders could be found for logger (org.apache.axis2.engine.Phase).
log4j:WARN Please initialize the log4j system properly.
[surefire] Running org.apache.axis2.phaserule.PhaseLastTest
[surefire] Tests run: 1, Failures: 0, Errors: 0, Time elapsed: 0.024 sec
[surefire] Running org.apache.axis2.phaserule.InvalidPhaseFirstTest
[surefire] Tests run: 1, Failures: 0, Errors: 0, Time elapsed: 0.003 sec
[surefire] Running org.apache.axis2.phaserule.BeforeWithNoFirstHandlerTest
[surefire] Tests run: 1, Failures: 0, Errors: 0, Time elapsed: 0.004 sec
[surefire] Running org.apache.axis2.phaserule.InvalidPhaseRuleTest
[surefire] Tests run: 2, Failures: 0, Errors: 0, Time elapsed: 0.018 sec
[surefire] Running org.apache.axis2.phaserule.AddingHandlerToEachPhaseTest
[surefire] Tests run: 3, Failures: 0, Errors: 0, Time elapsed: 0.004 sec
[surefire] Running org.apache.axis2.phaserule.SingleHandlerPhaseTest
[surefire] Tests run: 1, Failures: 0, Errors: 0, Time elapsed: 0.003 sec
[surefire] Running org.apache.axis2.phaserule.PreDispatchPhaseRuleTest
[surefire] Tests run: 1, Failures: 0, Errors: 0, Time elapsed: 0.003 sec
[surefire] Running org.apache.axis2.phaserule.PhaseFirstTest
[surefire] Tests run: 1, Failures: 0, Errors: 0, Time elapsed: 0.002 sec
[surefire] Running org.apache.axis2.phaserule.InvalidPhaselastTest
[surefire] Tests run: 1, Failures: 0, Errors: 0, Time elapsed: 0.002 sec
[surefire] Running org.apache.axis2.phaserule.BeforeAfterTest
[surefire] Tests run: 1, Failures: 0, Errors: 0, Time elapsed: 0.002 sec
[surefire] Running org.apache.axis2.phaserule.BeforeTest
[surefire] Tests run: 1, Failures: 0, Errors: 0, Time elapsed: 0.001 sec
[surefire] Running org.apache.axis2.phaserule.PhaseRuleTest
[surefire] Tests run: 1, Failures: 0, Errors: 0, Time elapsed: 0.002 sec
[surefire] Running org.apache.axis2.phaserule.InvalidPhaseFirstRulesTest
[surefire] Tests run: 1, Failures: 0, Errors: 0, Time elapsed: 0.003 sec
[surefire] Running org.apache.axis2.phaserule.InvalidPhaseLastRuleTest
[surefire] Tests run: 1, Failures: 0, Errors: 0, Time elapsed: 0.002 sec
[surefire] Running org.apache.axis2.deployment.SystemPhasesremovedTest
[surefire] Tests run: 1, Failures: 0, Errors: 0, Time elapsed: 0.016 sec
[surefire] Running org.apache.axis2.deployment.ModuleversionTest
[surefire] Tests run: 2, Failures: 0, Errors: 0, Time elapsed: 0.259 sec
[surefire] Running org.apache.axis2.deployment.DeploymentTotalTest
[surefire] Tests run: 1, Failures: 0, Errors: 0, Time elapsed: 0.053 sec
[surefire] Running org.apache.axis2.deployment.TransportDeploymentTest
[surefire] Tests run: 1, Failures: 0, Errors: 0, Time elapsed: 0.014 sec
[surefire] Running org.apache.axis2.deployment.BuildERWithDeploymentTest
[surefire] Tests run: 1, Failures: 0, Errors: 0, Time elapsed: 0.044 sec
[surefire] Running org.apache.axis2.deployment.ModuleDisengagementTest
[surefire] Tests run: 7, Failures: 0, Errors: 0, Time elapsed: 0.186 sec
[surefire] Running org.apache.axis2.deployment.ServiceGroupTest
[surefire] Tests run: 1, Failures: 0, Errors: 0, Time elapsed: 0.407 sec
[surefire] Running org.apache.axis2.deployment.BadModuleTest
[surefire] Tests run: 1, Failures: 0, Errors: 0, Time elapsed: 0.002 sec
[surefire] Running org.apache.axis2.deployment.MessageFormatterDeploymentTest
[surefire] Tests run: 2, Failures: 0, Errors: 0, Time elapsed: 0.05 sec
[surefire] Running org.apache.axis2.deployment.AxisMessageTest
[surefire] Tests run: 1, Failures: 0, Errors: 0, Time elapsed: 0.028 sec
[surefire] Running org.apache.axis2.deployment.ModifiedConfigFileTest
[surefire] Tests run: 1, Failures: 0, Errors: 0, Time elapsed: 0.002 sec
[surefire] Running org.apache.axis2.deployment.OperationExcludeTest
[surefire] Tests run: 1, Failures: 0, Errors: 0, Time elapsed: 0.024 sec
[surefire] Running org.apache.axis2.deployment.AddingObserverTest
[surefire] Tests run: 1, Failures: 0, Errors: 0, Time elapsed: 0.017 sec
[surefire] Running org.apache.axis2.deployment.SameServiceAddingTest
[surefire] Tests run: 1, Failures: 0, Errors: 0, Time elapsed: 0.018 sec
[surefire] Running org.apache.axis2.deployment.BuilderSelectorDeploymentTest
[surefire] Tests run: 2, Failures: 0, Errors: 0, Time elapsed: 0.02 sec
[surefire] Running org.apache.axis2.engine.MessageContextSaveCTest
MessageContextSaveCTest:testHierarchyNewContext(): *** Original OperationContext message context table ****
message context table entry:   label [Out]    message ID [urn:uuid:8368CC4F899BE8C81C1173802157646]    
message context table entry:   label [In]    message ID [urn:uuid:8368CC4F899BE8C81C1173802157642]    
MessageContextSaveCTest:testHierarchyNewContext(): - - - Save the message context from the engine - - - -
TempHandler[1]:invoke(): executedHandlers.add(1)
SaveHandler[2]:invoke(): msgContext.pause()
SaveHandler[2]:invoke(): Resetting the file to use.
SaveHandler[2]:invoke(): temp file = [mcObjTest37472.tmp]
SaveHandler[2]:invoke(): saving message context.....
SaveHandler[2]:invoke(): ....saved message context.....
SaveHandler[2]:invoke(): file size after save [15312]   temp file = [mcObjTest37472.tmp]
SaveHandler[2]:invoke(): executedHandlers.add(2)
MessageContextSaveCTest:testHierarchyNewContext(): *** Originial object graph ****
class[org.apache.axis2.context.MessageContext]  id[urn:uuid:8368CC4F899BE8C81C1173802157646]  hashcode[5475121] 
class[org.apache.axis2.context.OperationContext]  id[TestOperationA1]  hashcode[32815697] 
class[org.apache.axis2.context.ServiceContext]  id[ServiceA]  hashcode[21569784] 
class[org.apache.axis2.context.ServiceGroupContext]  id[ABCServiceGroup]  hashcode[16672519] 
class[org.apache.axis2.context.ConfigurationContext]  id[null]  hashcode[32434925] 
class[org.apache.axis2.description.InOutAxisOperation]  id[TestOperationA1]  hashcode[28336652] 
class[org.apache.axis2.description.AxisService]  id[ServiceA]  hashcode[8488759] 
class[org.apache.axis2.description.AxisServiceGroup]  id[ServiceA]  hashcode[30690025] 
class[org.apache.axis2.engine.AxisConfiguration]  id[null]  hashcode[8533528] 
MessageContextSaveCTest:testHierarchyNewContext(): - - - Restore the message context on a separate engine  - - - - - - - - - - - - - - - -
restoreMessageContext(): temp file = [mcObjTest37472.tmp]
restoreMessageContext(): restoring a message context.....
restoreMessageContext(): ....restored message context.....
MessageContextSaveCTest:testHierarchyNewContext(): *** Restored object graph ****
class[org.apache.axis2.context.MessageContext]  id[urn:uuid:8368CC4F899BE8C81C1173802157646]  hashcode[2394634] 
class[org.apache.axis2.context.OperationContext]  id[TestOperationA1]  hashcode[14859405] 
class[org.apache.axis2.context.ServiceContext]  id[ServiceA]  hashcode[29941734] 
class[org.apache.axis2.context.ServiceGroupContext]  id[ABCServiceGroup]  hashcode[14911070] 
class[org.apache.axis2.context.ConfigurationContext]  id[null]  hashcode[25856743] 
class[org.apache.axis2.description.InOutAxisOperation]  id[TestOperationA1]  hashcode[3054710] 
class[org.apache.axis2.description.AxisService]  id[ServiceA]  hashcode[10843314] 
class[org.apache.axis2.description.AxisServiceGroup]  id[ServiceA]  hashcode[9458290] 
class[org.apache.axis2.engine.AxisConfiguration]  id[null]  hashcode[18150163] 
MessageContextSaveCTest:testHierarchyNewContext(): *** Restored OperationContext message context table ****
message context table entry:   label [Out]    message ID [urn:uuid:8368CC4F899BE8C81C1173802157646]    
message context table entry:   label [In]    message ID [urn:uuid:8368CC4F899BE8C81C1173802157642]    
compareMCTable:  Return TRUE:  message context tables match
MessageContextSaveCTest:testHierarchyNewContext(): - - - Resume the restored message context - - - - - - - - - - - - - - - -
SaveHandler[2]:invoke(): Configured for no action to be performed.
TempHandler[3]:invoke(): executedHandlers.add(3)
MessageContextSaveCTest:testHierarchyNewContext(): *** Post Resumed object graph ****
class[org.apache.axis2.context.MessageContext]  id[urn:uuid:8368CC4F899BE8C81C1173802157646]  hashcode[2394634] 
class[org.apache.axis2.context.OperationContext]  id[TestOperationA1]  hashcode[14859405] 
class[org.apache.axis2.context.ServiceContext]  id[ServiceA]  hashcode[29941734] 
class[org.apache.axis2.context.ServiceGroupContext]  id[ABCServiceGroup]  hashcode[14911070] 
class[org.apache.axis2.context.ConfigurationContext]  id[null]  hashcode[25856743] 
class[org.apache.axis2.description.InOutAxisOperation]  id[TestOperationA1]  hashcode[3054710] 
class[org.apache.axis2.description.AxisService]  id[ServiceA]  hashcode[10843314] 
class[org.apache.axis2.description.AxisServiceGroup]  id[ServiceA]  hashcode[9458290] 
class[org.apache.axis2.engine.AxisConfiguration]  id[null]  hashcode[18150163] 
MessageContextSaveCTest: compareObjectGraphInfo(): name [ServiceA]  code1 [[21569784]]  !=   code2 [[29941734]]
MessageContextSaveCTest:testHierarchyReuse(): - - - Save the message context from the engine - - - -
TempHandler[1]:invoke(): executedHandlers.add(1)
SaveHandler[2]:invoke(): msgContext.pause()
SaveHandler[2]:invoke(): Resetting the file to use.
SaveHandler[2]:invoke(): temp file = [mcObjTest37473.tmp]
SaveHandler[2]:invoke(): saving message context.....
SaveHandler[2]:invoke(): ....saved message context.....
SaveHandler[2]:invoke(): file size after save [15311]   temp file = [mcObjTest37473.tmp]
SaveHandler[2]:invoke(): executedHandlers.add(2)
MessageContextSaveCTest:testHierarchyReuse(): *** Originial object graph ****
class[org.apache.axis2.context.MessageContext]  id[urn:uuid:8368CC4F899BE8C81C1173802157670]  hashcode[6457299] 
class[org.apache.axis2.context.OperationContext]  id[TestOperationA1]  hashcode[9757940] 
class[org.apache.axis2.context.ServiceContext]  id[ServiceA]  hashcode[11420600] 
class[org.apache.axis2.context.ServiceGroupContext]  id[ABCServiceGroup]  hashcode[29733598] 
class[org.apache.axis2.context.ConfigurationContext]  id[null]  hashcode[13555426] 
class[org.apache.axis2.description.InOutAxisOperation]  id[TestOperationA1]  hashcode[14610767] 
class[org.apache.axis2.description.AxisService]  id[ServiceA]  hashcode[25011554] 
class[org.apache.axis2.description.AxisServiceGroup]  id[ServiceA]  hashcode[32833315] 
class[org.apache.axis2.engine.AxisConfiguration]  id[null]  hashcode[26905665] 
MessageContextSaveCTest:testHierarchyReuse(): - - - Restore the message context on a separate engine  - - - - - - - - - - - - - - - -
restoreMessageContext(): temp file = [mcObjTest37473.tmp]
restoreMessageContext(): restoring a message context.....
restoreMessageContext(): ....restored message context.....
MessageContextSaveCTest:testHierarchyReuse(): *** Restored object graph ****
class[org.apache.axis2.context.MessageContext]  id[urn:uuid:8368CC4F899BE8C81C1173802157670]  hashcode[47104] 
class[org.apache.axis2.context.OperationContext]  id[TestOperationA1]  hashcode[19924992] 
class[org.apache.axis2.context.ServiceContext]  id[ServiceA]  hashcode[6115379] 
class[org.apache.axis2.context.ServiceGroupContext]  id[ABCServiceGroup]  hashcode[3965704] 
class[org.apache.axis2.context.ConfigurationContext]  id[null]  hashcode[12485732] 
class[org.apache.axis2.description.InOutAxisOperation]  id[TestOperationA1]  hashcode[8072489] 
class[org.apache.axis2.description.AxisService]  id[ServiceA]  hashcode[31838727] 
class[org.apache.axis2.description.AxisServiceGroup]  id[ServiceA]  hashcode[20965449] 
class[org.apache.axis2.engine.AxisConfiguration]  id[null]  hashcode[11225255] 
MessageContextSaveCTest:testHierarchyReuse(): - - - Resume the restored message context - - - - - - - - - - - - - - - -
SaveHandler[2]:invoke(): msgContext.pause()
SaveHandler[2]:invoke(): Resetting the file to use.
SaveHandler[2]:invoke(): temp file = [mcObjTest37473.tmp]
SaveHandler[2]:invoke(): saving message context.....
SaveHandler[2]:invoke(): ....saved message context.....
SaveHandler[2]:invoke(): file size after save [14662]   temp file = [mcObjTest37473.tmp]
SaveHandler[2]:invoke(): executedHandlers.add(2)
MessageContextSaveCTest:testHierarchyReuse(): *** Post Resumed object graph ****
class[org.apache.axis2.context.MessageContext]  id[urn:uuid:8368CC4F899BE8C81C1173802157670]  hashcode[47104] 
class[org.apache.axis2.context.OperationContext]  id[TestOperationA1]  hashcode[19924992] 
class[org.apache.axis2.context.ServiceContext]  id[ServiceA]  hashcode[6115379] 
class[org.apache.axis2.context.ServiceGroupContext]  id[ABCServiceGroup]  hashcode[3965704] 
class[org.apache.axis2.context.ConfigurationContext]  id[null]  hashcode[12485732] 
class[org.apache.axis2.description.InOutAxisOperation]  id[TestOperationA1]  hashcode[8072489] 
class[org.apache.axis2.description.AxisService]  id[ServiceA]  hashcode[31838727] 
class[org.apache.axis2.description.AxisServiceGroup]  id[ServiceA]  hashcode[20965449] 
class[org.apache.axis2.engine.AxisConfiguration]  id[null]  hashcode[11225255] 
[surefire] Tests run: 2, Failures: 0, Errors: 0, Time elapsed: 0.474 sec
[surefire] Running org.apache.axis2.engine.OptionsSaveTest
OptionsSaveTest:testSaveAndRestore():  BEGIN ---------------
OptionsSaveTest:testSaveAndRestore(): temp file = [optionsSave37475.tmp]
OptionsSaveTest:testSaveAndRestore(): saving .....
OptionsSaveTest:testSaveAndRestore(): ....save operation completed.....
OptionsSaveTest:testSaveAndRestore(): file size after save [3034]   temp file = [optionsSave37475.tmp]
OptionsSaveTest:testSaveAndRestore(): restoring .....
OptionsSaveTest:testSaveAndRestore(): ....restored operation completed.....
OptionsSaveTest:testSaveAndRestore():   Options equivalency [true]
OptionsSaveTest:testSaveAndRestore():  END ---------------
[surefire] Tests run: 1, Failures: 0, Errors: 0, Time elapsed: 0.012 sec
[surefire] Running org.apache.axis2.engine.EnginePausingTest
[surefire] Tests run: 1, Failures: 0, Errors: 0, Time elapsed: 0.01 sec
[surefire] Running org.apache.axis2.engine.MessageContextTest
[surefire] Tests run: 1, Failures: 0, Errors: 0, Time elapsed: 0.001 sec
[surefire] Running org.apache.axis2.engine.MessageContextSelfManagedDataTest
MessageContextSelfManagedDataTest::testSelfManagedData01()=======================================
MessageContextSelfManagedDataTest::TempHandler01[id=101].invoke()
MessageContextSelfManagedDataTest::TempHandler01[id=101].invoke(): Completed
MessageContextSelfManagedDataTest::testPause01_noExceptions()=======================================
MessageContextSelfManagedDataTest::TempHandler02[id=102].invoke()
MessageContextSelfManagedDataTest::TempHandler02[id=102].invoke():   Setting self managed data using key [102]
MessageContextSelfManagedDataTest::saveAndRestore::[TempHandler02[id=102].invoke()]   
MessageContextSelfManagedDataTest::saveAndRestore::[TempHandler02[id=102].invoke()]   temp file = [TempHandler02_37476.tmp]
MessageContextSelfManagedDataTest::saveAndRestore::[TempHandler02[id=102].invoke()]   saving message context ....
MessageContextSelfManagedDataTest::TempHandler02[id=102].serializeSelfManagedData()   count [1]
MessageContextSelfManagedDataTest::TempHandler02[id=102].serializeSelfManagedData()   count [1]: saved self managed data string length [25]
MessageContextSelfManagedDataTest::TempHandler02[id=102].serializeSelfManagedData()   count [1]: saved self managed data byte array output stream (UTF) length [33]
MessageContextSelfManagedDataTest::saveAndRestore::[TempHandler02[id=102].invoke()]   ....saved message context .....
MessageContextSelfManagedDataTest::saveAndRestore::[TempHandler02[id=102].invoke()]   restoring message context .....
MessageContextSelfManagedDataTest::TempHandler02[id=102].deserializeSelfManagedData()   count [1]
MessageContextSelfManagedDataTest::saveAndRestore::[TempHandler02[id=102].invoke()]   ....restored message context .....
MessageContextSelfManagedDataTest::TempHandler02[id=102].invoke(): Completed
MessageContextSelfManagedDataTest::testPause02_saveRestoreSelfManagedData()=======================================
MessageContextSelfManagedDataTest::TempHandler02[id=102].invoke()
MessageContextSelfManagedDataTest::TempHandler02[id=102].invoke():   Setting self managed data using key [102]
MessageContextSelfManagedDataTest::saveAndRestore::[TempHandler02[id=102].invoke()]   
MessageContextSelfManagedDataTest::saveAndRestore::[TempHandler02[id=102].invoke()]   temp file = [TempHandler02_37477.tmp]
MessageContextSelfManagedDataTest::saveAndRestore::[TempHandler02[id=102].invoke()]   saving message context ....
MessageContextSelfManagedDataTest::TempHandler02[id=102].serializeSelfManagedData()   count [1]
MessageContextSelfManagedDataTest::TempHandler02[id=102].serializeSelfManagedData()   count [1]: saved self managed data string length [25]
MessageContextSelfManagedDataTest::TempHandler02[id=102].serializeSelfManagedData()   count [1]: saved self managed data byte array output stream (UTF) length [33]
MessageContextSelfManagedDataTest::saveAndRestore::[TempHandler02[id=102].invoke()]   ....saved message context .....
MessageContextSelfManagedDataTest::saveAndRestore::[TempHandler02[id=102].invoke()]   restoring message context .....
MessageContextSelfManagedDataTest::TempHandler02[id=102].deserializeSelfManagedData()   count [1]
MessageContextSelfManagedDataTest::saveAndRestore::[TempHandler02[id=102].invoke()]   ....restored message context .....
MessageContextSelfManagedDataTest::TempHandler02[id=102].invoke(): Completed
MessageContextSelfManagedDataTest::testPause03_saveRestoreOperation()=======================================
MessageContextSelfManagedDataTest::TempHandler02[id=102].invoke()
MessageContextSelfManagedDataTest::TempHandler02[id=102].invoke():   Setting self managed data using key [102]
MessageContextSelfManagedDataTest::saveAndRestore::[TempHandler02[id=102].invoke()]   
MessageContextSelfManagedDataTest::saveAndRestore::[TempHandler02[id=102].invoke()]   temp file = [TempHandler02_37478.tmp]
MessageContextSelfManagedDataTest::saveAndRestore::[TempHandler02[id=102].invoke()]   saving message context ....
MessageContextSelfManagedDataTest::TempHandler02[id=102].serializeSelfManagedData()   count [1]
MessageContextSelfManagedDataTest::TempHandler02[id=102].serializeSelfManagedData()   count [1]: saved self managed data string length [25]
MessageContextSelfManagedDataTest::TempHandler02[id=102].serializeSelfManagedData()   count [1]: saved self managed data byte array output stream (UTF) length [33]
MessageContextSelfManagedDataTest::saveAndRestore::[TempHandler02[id=102].invoke()]   ....saved message context .....
MessageContextSelfManagedDataTest::saveAndRestore::[TempHandler02[id=102].invoke()]   restoring message context .....
MessageContextSelfManagedDataTest::TempHandler02[id=102].deserializeSelfManagedData()   count [1]
MessageContextSelfManagedDataTest::saveAndRestore::[TempHandler02[id=102].invoke()]   ....restored message context .....
MessageContextSelfManagedDataTest::TempHandler02[id=102].invoke(): Completed
MessageContextSelfManagedDataTest::testPause04_saveRestoreAxisService()=======================================
MessageContextSelfManagedDataTest::TempHandler02[id=102].invoke()
MessageContextSelfManagedDataTest::TempHandler02[id=102].invoke():   Setting self managed data using key [102]
MessageContextSelfManagedDataTest::saveAndRestore::[TempHandler02[id=102].invoke()]   
MessageContextSelfManagedDataTest::saveAndRestore::[TempHandler02[id=102].invoke()]   temp file = [TempHandler02_37479.tmp]
MessageContextSelfManagedDataTest::saveAndRestore::[TempHandler02[id=102].invoke()]   saving message context ....
MessageContextSelfManagedDataTest::TempHandler02[id=102].serializeSelfManagedData()   count [1]
MessageContextSelfManagedDataTest::TempHandler02[id=102].serializeSelfManagedData()   count [1]: saved self managed data string length [25]
MessageContextSelfManagedDataTest::TempHandler02[id=102].serializeSelfManagedData()   count [1]: saved self managed data byte array output stream (UTF) length [33]
MessageContextSelfManagedDataTest::saveAndRestore::[TempHandler02[id=102].invoke()]   ....saved message context .....
MessageContextSelfManagedDataTest::saveAndRestore::[TempHandler02[id=102].invoke()]   restoring message context .....
MessageContextSelfManagedDataTest::TempHandler02[id=102].deserializeSelfManagedData()   count [1]
MessageContextSelfManagedDataTest::saveAndRestore::[TempHandler02[id=102].invoke()]   ....restored message context .....
MessageContextSelfManagedDataTest::TempHandler02[id=102].invoke(): Completed
MessageContextSelfManagedDataTest::testPause05_saveRestoreAxisServiceGroup()=======================================
MessageContextSelfManagedDataTest::TempHandler02[id=102].invoke()
MessageContextSelfManagedDataTest::TempHandler02[id=102].invoke():   Setting self managed data using key [102]
MessageContextSelfManagedDataTest::saveAndRestore::[TempHandler02[id=102].invoke()]   
MessageContextSelfManagedDataTest::saveAndRestore::[TempHandler02[id=102].invoke()]   temp file = [TempHandler02_37480.tmp]
MessageContextSelfManagedDataTest::saveAndRestore::[TempHandler02[id=102].invoke()]   saving message context ....
MessageContextSelfManagedDataTest::TempHandler02[id=102].serializeSelfManagedData()   count [1]
MessageContextSelfManagedDataTest::TempHandler02[id=102].serializeSelfManagedData()   count [1]: saved self managed data string length [25]
MessageContextSelfManagedDataTest::TempHandler02[id=102].serializeSelfManagedData()   count [1]: saved self managed data byte array output stream (UTF) length [33]
MessageContextSelfManagedDataTest::saveAndRestore::[TempHandler02[id=102].invoke()]   ....saved message context .....
MessageContextSelfManagedDataTest::saveAndRestore::[TempHandler02[id=102].invoke()]   restoring message context .....
MessageContextSelfManagedDataTest::TempHandler02[id=102].deserializeSelfManagedData()   count [1]
MessageContextSelfManagedDataTest::saveAndRestore::[TempHandler02[id=102].invoke()]   ....restored message context .....
MessageContextSelfManagedDataTest::TempHandler02[id=102].invoke(): Completed
MessageContextSelfManagedDataTest::testPause06_saveRestorePhases()=======================================
MessageContextSelfManagedDataTest::TempHandler02[id=61].invoke()
MessageContextSelfManagedDataTest::TempHandler02[id=61].invoke():   Setting self managed data using key [61]
MessageContextSelfManagedDataTest::saveAndRestore::[TempHandler02[id=61].invoke()]   
MessageContextSelfManagedDataTest::saveAndRestore::[TempHandler02[id=61].invoke()]   temp file = [TempHandler02_37481.tmp]
MessageContextSelfManagedDataTest::saveAndRestore::[TempHandler02[id=61].invoke()]   saving message context ....
MessageContextSelfManagedDataTest::TempHandler02[id=61].serializeSelfManagedData()   count [1]
MessageContextSelfManagedDataTest::TempHandler02[id=61].serializeSelfManagedData()   count [1]: saved self managed data string length [24]
MessageContextSelfManagedDataTest::TempHandler02[id=61].serializeSelfManagedData()   count [1]: saved self managed data byte array output stream (UTF) length [32]
MessageContextSelfManagedDataTest::TempHandler03[id=62].serializeSelfManagedData()   count [1]
MessageContextSelfManagedDataTest::TempHandler03[id=62].serializeSelfManagedData()   count [1]:  No self managed data to serialize
MessageContextSelfManagedDataTest::TempHandler02[id=63].serializeSelfManagedData()   count [1]
MessageContextSelfManagedDataTest::TempHandler02[id=63].serializeSelfManagedData()   count [1]:  No self managed data to serialize
MessageContextSelfManagedDataTest::TempHandler02[id=666].serializeSelfManagedData()   count [1]
MessageContextSelfManagedDataTest::TempHandler02[id=666].serializeSelfManagedData()   count [1]:  No self managed data to serialize
MessageContextSelfManagedDataTest::TempHandler03[id=64].serializeSelfManagedData()   count [1]
MessageContextSelfManagedDataTest::TempHandler03[id=64].serializeSelfManagedData()   count [1]:  No self managed data to serialize
MessageContextSelfManagedDataTest::TempHandler02[id=65].serializeSelfManagedData()   count [1]
MessageContextSelfManagedDataTest::TempHandler02[id=65].serializeSelfManagedData()   count [1]:  No self managed data to serialize
MessageContextSelfManagedDataTest::TempHandler02[id=1000].serializeSelfManagedData()   count [1]
MessageContextSelfManagedDataTest::TempHandler02[id=1000].serializeSelfManagedData()   count [1]:  No self managed data to serialize
MessageContextSelfManagedDataTest::TempHandler03[id=66].serializeSelfManagedData()   count [1]
MessageContextSelfManagedDataTest::TempHandler03[id=66].serializeSelfManagedData()   count [1]:  No self managed data to serialize
MessageContextSelfManagedDataTest::TempHandler02[id=67].serializeSelfManagedData()   count [1]
MessageContextSelfManagedDataTest::TempHandler02[id=67].serializeSelfManagedData()   count [1]:  No self managed data to serialize
MessageContextSelfManagedDataTest::TempHandler03[id=68].serializeSelfManagedData()   count [1]
MessageContextSelfManagedDataTest::TempHandler03[id=68].serializeSelfManagedData()   count [1]:  No self managed data to serialize
MessageContextSelfManagedDataTest::saveAndRestore::[TempHandler02[id=61].invoke()]   ....saved message context .....
MessageContextSelfManagedDataTest::saveAndRestore::[TempHandler02[id=61].invoke()]   restoring message context .....
MessageContextSelfManagedDataTest::TempHandler02[id=61].deserializeSelfManagedData()   count [1]
MessageContextSelfManagedDataTest::saveAndRestore::[TempHandler02[id=61].invoke()]   ....restored message context .....
MessageContextSelfManagedDataTest::TempHandler02[id=61].invoke(): Completed
MessageContextSelfManagedDataTest::TempHandler03[id=62].invoke()
MessageContextSelfManagedDataTest::TempHandler03[id=62].invoke():   Setting self managed data using key [62]
MessageContextSelfManagedDataTest::saveAndRestore::[TempHandler03[id=62].invoke()]   
MessageContextSelfManagedDataTest::saveAndRestore::[TempHandler03[id=62].invoke()]   temp file = [TempHandler03_37482.tmp]
MessageContextSelfManagedDataTest::saveAndRestore::[TempHandler03[id=62].invoke()]   saving message context ....
MessageContextSelfManagedDataTest::TempHandler02[id=61].serializeSelfManagedData()   count [2]
MessageContextSelfManagedDataTest::TempHandler02[id=61].serializeSelfManagedData()   count [2]: saved self managed data string length [24]
MessageContextSelfManagedDataTest::TempHandler02[id=61].serializeSelfManagedData()   count [2]: saved self managed data byte array output stream (UTF) length [32]
MessageContextSelfManagedDataTest::TempHandler03[id=62].serializeSelfManagedData()   count [2]
MessageContextSelfManagedDataTest::TempHandler03[id=62].serializeSelfManagedData()   count [2]: saved self managed data byte [] length [25]
MessageContextSelfManagedDataTest::TempHandler03[id=62].serializeSelfManagedData()   count [2]: saved self managed data byte array output stream length [25]
MessageContextSelfManagedDataTest::TempHandler02[id=63].serializeSelfManagedData()   count [2]
MessageContextSelfManagedDataTest::TempHandler02[id=63].serializeSelfManagedData()   count [2]:  No self managed data to serialize
MessageContextSelfManagedDataTest::TempHandler02[id=666].serializeSelfManagedData()   count [2]
MessageContextSelfManagedDataTest::TempHandler02[id=666].serializeSelfManagedData()   count [2]:  No self managed data to serialize
MessageContextSelfManagedDataTest::TempHandler03[id=64].serializeSelfManagedData()   count [2]
MessageContextSelfManagedDataTest::TempHandler03[id=64].serializeSelfManagedData()   count [2]:  No self managed data to serialize
MessageContextSelfManagedDataTest::TempHandler02[id=65].serializeSelfManagedData()   count [2]
MessageContextSelfManagedDataTest::TempHandler02[id=65].serializeSelfManagedData()   count [2]:  No self managed data to serialize
MessageContextSelfManagedDataTest::TempHandler02[id=1000].serializeSelfManagedData()   count [2]
MessageContextSelfManagedDataTest::TempHandler02[id=1000].serializeSelfManagedData()   count [2]:  No self managed data to serialize
MessageContextSelfManagedDataTest::TempHandler03[id=66].serializeSelfManagedData()   count [2]
MessageContextSelfManagedDataTest::TempHandler03[id=66].serializeSelfManagedData()   count [2]:  No self managed data to serialize
MessageContextSelfManagedDataTest::TempHandler02[id=67].serializeSelfManagedData()   count [2]
MessageContextSelfManagedDataTest::TempHandler02[id=67].serializeSelfManagedData()   count [2]:  No self managed data to serialize
MessageContextSelfManagedDataTest::TempHandler03[id=68].serializeSelfManagedData()   count [2]
MessageContextSelfManagedDataTest::TempHandler03[id=68].serializeSelfManagedData()   count [2]:  No self managed data to serialize
MessageContextSelfManagedDataTest::saveAndRestore::[TempHandler03[id=62].invoke()]   ....saved message context .....
MessageContextSelfManagedDataTest::saveAndRestore::[TempHandler03[id=62].invoke()]   restoring message context .....
MessageContextSelfManagedDataTest::TempHandler02[id=61].deserializeSelfManagedData()   count [2]
MessageContextSelfManagedDataTest::TempHandler03[id=62].deserializeSelfManagedData()   count [1]
MessageContextSelfManagedDataTest::saveAndRestore::[TempHandler03[id=62].invoke()]   ....restored message context .....
MessageContextSelfManagedDataTest::TempHandler03[id=62].invoke(): Completed
MessageContextSelfManagedDataTest::TempHandler02[id=63].invoke()
MessageContextSelfManagedDataTest::TempHandler02[id=63].invoke():   Setting self managed data using key [63]
MessageContextSelfManagedDataTest::saveAndRestore::[TempHandler02[id=63].invoke()]   
MessageContextSelfManagedDataTest::saveAndRestore::[TempHandler02[id=63].invoke()]   temp file = [TempHandler02_37483.tmp]
MessageContextSelfManagedDataTest::saveAndRestore::[TempHandler02[id=63].invoke()]   saving message context ....
MessageContextSelfManagedDataTest::TempHandler02[id=61].serializeSelfManagedData()   count [3]
MessageContextSelfManagedDataTest::TempHandler02[id=61].serializeSelfManagedData()   count [3]: saved self managed data string length [24]
MessageContextSelfManagedDataTest::TempHandler02[id=61].serializeSelfManagedData()   count [3]: saved self managed data byte array output stream (UTF) length [32]
MessageContextSelfManagedDataTest::TempHandler03[id=62].serializeSelfManagedData()   count [3]
MessageContextSelfManagedDataTest::TempHandler03[id=62].serializeSelfManagedData()   count [3]: saved self managed data byte [] length [25]
MessageContextSelfManagedDataTest::TempHandler03[id=62].serializeSelfManagedData()   count [3]: saved self managed data byte array output stream length [25]
MessageContextSelfManagedDataTest::TempHandler02[id=63].serializeSelfManagedData()   count [3]
MessageContextSelfManagedDataTest::TempHandler02[id=63].serializeSelfManagedData()   count [3]: saved self managed data string length [24]
MessageContextSelfManagedDataTest::TempHandler02[id=63].serializeSelfManagedData()   count [3]: saved self managed data byte array output stream (UTF) length [32]
MessageContextSelfManagedDataTest::TempHandler02[id=666].serializeSelfManagedData()   count [3]
MessageContextSelfManagedDataTest::TempHandler02[id=666].serializeSelfManagedData()   count [3]:  No self managed data to serialize
MessageContextSelfManagedDataTest::TempHandler03[id=64].serializeSelfManagedData()   count [3]
MessageContextSelfManagedDataTest::TempHandler03[id=64].serializeSelfManagedData()   count [3]:  No self managed data to serialize
MessageContextSelfManagedDataTest::TempHandler02[id=65].serializeSelfManagedData()   count [3]
MessageContextSelfManagedDataTest::TempHandler02[id=65].serializeSelfManagedData()   count [3]:  No self managed data to serialize
MessageContextSelfManagedDataTest::TempHandler02[id=1000].serializeSelfManagedData()   count [3]
MessageContextSelfManagedDataTest::TempHandler02[id=1000].serializeSelfManagedData()   count [3]:  No self managed data to serialize
MessageContextSelfManagedDataTest::TempHandler03[id=66].serializeSelfManagedData()   count [3]
MessageContextSelfManagedDataTest::TempHandler03[id=66].serializeSelfManagedData()   count [3]:  No self managed data to serialize
MessageContextSelfManagedDataTest::TempHandler02[id=67].serializeSelfManagedData()   count [3]
MessageContextSelfManagedDataTest::TempHandler02[id=67].serializeSelfManagedData()   count [3]:  No self managed data to serialize
MessageContextSelfManagedDataTest::TempHandler03[id=68].serializeSelfManagedData()   count [3]
MessageContextSelfManagedDataTest::TempHandler03[id=68].serializeSelfManagedData()   count [3]:  No self managed data to serialize
MessageContextSelfManagedDataTest::saveAndRestore::[TempHandler02[id=63].invoke()]   ....saved message context .....
MessageContextSelfManagedDataTest::saveAndRestore::[TempHandler02[id=63].invoke()]   restoring message context .....
MessageContextSelfManagedDataTest::TempHandler02[id=61].deserializeSelfManagedData()   count [3]
MessageContextSelfManagedDataTest::TempHandler03[id=62].deserializeSelfManagedData()   count [2]
MessageContextSelfManagedDataTest::TempHandler02[id=63].deserializeSelfManagedData()   count [1]
MessageContextSelfManagedDataTest::saveAndRestore::[TempHandler02[id=63].invoke()]   ....restored message context .....
MessageContextSelfManagedDataTest::TempHandler02[id=63].invoke(): Completed
MessageContextSelfManagedDataTest::TempHandler02[id=666].invoke()
MessageContextSelfManagedDataTest::TempHandler02[id=666].invoke():   Setting self managed data using key [666]
MessageContextSelfManagedDataTest::saveAndRestore::[TempHandler02[id=666].invoke()]   
MessageContextSelfManagedDataTest::saveAndRestore::[TempHandler02[id=666].invoke()]   temp file = [TempHandler02_37484.tmp]
MessageContextSelfManagedDataTest::saveAndRestore::[TempHandler02[id=666].invoke()]   saving message context ....
MessageContextSelfManagedDataTest::TempHandler02[id=61].serializeSelfManagedData()   count [4]
MessageContextSelfManagedDataTest::TempHandler02[id=61].serializeSelfManagedData()   count [4]: saved self managed data string length [24]
MessageContextSelfManagedDataTest::TempHandler02[id=61].serializeSelfManagedData()   count [4]: saved self managed data byte array output stream (UTF) length [32]
MessageContextSelfManagedDataTest::TempHandler03[id=62].serializeSelfManagedData()   count [4]
MessageContextSelfManagedDataTest::TempHandler03[id=62].serializeSelfManagedData()   count [4]: saved self managed data byte [] length [25]
MessageContextSelfManagedDataTest::TempHandler03[id=62].serializeSelfManagedData()   count [4]: saved self managed data byte array output stream length [25]
MessageContextSelfManagedDataTest::TempHandler02[id=63].serializeSelfManagedData()   count [4]
MessageContextSelfManagedDataTest::TempHandler02[id=63].serializeSelfManagedData()   count [4]: saved self managed data string length [24]
MessageContextSelfManagedDataTest::TempHandler02[id=63].serializeSelfManagedData()   count [4]: saved self managed data byte array output stream (UTF) length [32]
MessageContextSelfManagedDataTest::TempHandler02[id=666].serializeSelfManagedData()   count [4]
MessageContextSelfManagedDataTest::TempHandler02[id=666].serializeSelfManagedData()   count [4]: saved self managed data string length [25]
MessageContextSelfManagedDataTest::TempHandler02[id=666].serializeSelfManagedData()   count [4]: saved self managed data byte array output stream (UTF) length [33]
MessageContextSelfManagedDataTest::TempHandler03[id=64].serializeSelfManagedData()   count [4]
MessageContextSelfManagedDataTest::TempHandler03[id=64].serializeSelfManagedData()   count [4]:  No self managed data to serialize
MessageContextSelfManagedDataTest::TempHandler02[id=65].serializeSelfManagedData()   count [4]
MessageContextSelfManagedDataTest::TempHandler02[id=65].serializeSelfManagedData()   count [4]:  No self managed data to serialize
MessageContextSelfManagedDataTest::TempHandler02[id=1000].serializeSelfManagedData()   count [4]
MessageContextSelfManagedDataTest::TempHandler02[id=1000].serializeSelfManagedData()   count [4]:  No self managed data to serialize
MessageContextSelfManagedDataTest::TempHandler03[id=66].serializeSelfManagedData()   count [4]
MessageContextSelfManagedDataTest::TempHandler03[id=66].serializeSelfManagedData()   count [4]:  No self managed data to serialize
MessageContextSelfManagedDataTest::TempHandler02[id=67].serializeSelfManagedData()   count [4]
MessageContextSelfManagedDataTest::TempHandler02[id=67].serializeSelfManagedData()   count [4]:  No self managed data to serialize
MessageContextSelfManagedDataTest::TempHandler03[id=68].serializeSelfManagedData()   count [4]
MessageContextSelfManagedDataTest::TempHandler03[id=68].serializeSelfManagedData()   count [4]:  No self managed data to serialize
MessageContextSelfManagedDataTest::saveAndRestore::[TempHandler02[id=666].invoke()]   ....saved message context .....
MessageContextSelfManagedDataTest::saveAndRestore::[TempHandler02[id=666].invoke()]   restoring message context .....
MessageContextSelfManagedDataTest::TempHandler02[id=61].deserializeSelfManagedData()   count [4]
MessageContextSelfManagedDataTest::TempHandler03[id=62].deserializeSelfManagedData()   count [3]
MessageContextSelfManagedDataTest::TempHandler02[id=63].deserializeSelfManagedData()   count [2]
MessageContextSelfManagedDataTest::TempHandler02[id=666].deserializeSelfManagedData()   count [1]
MessageContextSelfManagedDataTest::saveAndRestore::[TempHandler02[id=666].invoke()]   ....restored message context .....
MessageContextSelfManagedDataTest::TempHandler02[id=666].invoke(): Completed
MessageContextSelfManagedDataTest::TempHandler03[id=64].invoke()
MessageContextSelfManagedDataTest::TempHandler03[id=64].invoke():   Setting self managed data using key [64]
MessageContextSelfManagedDataTest::saveAndRestore::[TempHandler03[id=64].invoke()]   
MessageContextSelfManagedDataTest::saveAndRestore::[TempHandler03[id=64].invoke()]   temp file = [TempHandler03_37485.tmp]
MessageContextSelfManagedDataTest::saveAndRestore::[TempHandler03[id=64].invoke()]   saving message context ....
MessageContextSelfManagedDataTest::TempHandler02[id=61].serializeSelfManagedData()   count [5]
MessageContextSelfManagedDataTest::TempHandler02[id=61].serializeSelfManagedData()   count [5]: saved self managed data string length [24]
MessageContextSelfManagedDataTest::TempHandler02[id=61].serializeSelfManagedData()   count [5]: saved self managed data byte array output stream (UTF) length [32]
MessageContextSelfManagedDataTest::TempHandler03[id=62].serializeSelfManagedData()   count [5]
MessageContextSelfManagedDataTest::TempHandler03[id=62].serializeSelfManagedData()   count [5]: saved self managed data byte [] length [25]
MessageContextSelfManagedDataTest::TempHandler03[id=62].serializeSelfManagedData()   count [5]: saved self managed data byte array output stream length [25]
MessageContextSelfManagedDataTest::TempHandler02[id=63].serializeSelfManagedData()   count [5]
MessageContextSelfManagedDataTest::TempHandler02[id=63].serializeSelfManagedData()   count [5]: saved self managed data string length [24]
MessageContextSelfManagedDataTest::TempHandler02[id=63].serializeSelfManagedData()   count [5]: saved self managed data byte array output stream (UTF) length [32]
MessageContextSelfManagedDataTest::TempHandler02[id=666].serializeSelfManagedData()   count [5]
MessageContextSelfManagedDataTest::TempHandler02[id=666].serializeSelfManagedData()   count [5]: saved self managed data string length [25]
MessageContextSelfManagedDataTest::TempHandler02[id=666].serializeSelfManagedData()   count [5]: saved self managed data byte array output stream (UTF) length [33]
MessageContextSelfManagedDataTest::TempHandler03[id=64].serializeSelfManagedData()   count [5]
MessageContextSelfManagedDataTest::TempHandler03[id=64].serializeSelfManagedData()   count [5]: saved self managed data byte [] length [25]
MessageContextSelfManagedDataTest::TempHandler03[id=64].serializeSelfManagedData()   count [5]: saved self managed data byte array output stream length [25]
MessageContextSelfManagedDataTest::TempHandler02[id=65].serializeSelfManagedData()   count [5]
MessageContextSelfManagedDataTest::TempHandler02[id=65].serializeSelfManagedData()   count [5]:  No self managed data to serialize
MessageContextSelfManagedDataTest::TempHandler02[id=1000].serializeSelfManagedData()   count [5]
MessageContextSelfManagedDataTest::TempHandler02[id=1000].serializeSelfManagedData()   count [5]:  No self managed data to serialize
MessageContextSelfManagedDataTest::TempHandler03[id=66].serializeSelfManagedData()   count [5]
MessageContextSelfManagedDataTest::TempHandler03[id=66].serializeSelfManagedData()   count [5]:  No self managed data to serialize
MessageContextSelfManagedDataTest::TempHandler02[id=67].serializeSelfManagedData()   count [5]
MessageContextSelfManagedDataTest::TempHandler02[id=67].serializeSelfManagedData()   count [5]:  No self managed data to serialize
MessageContextSelfManagedDataTest::TempHandler03[id=68].serializeSelfManagedData()   count [5]
MessageContextSelfManagedDataTest::TempHandler03[id=68].serializeSelfManagedData()   count [5]:  No self managed data to serialize
MessageContextSelfManagedDataTest::saveAndRestore::[TempHandler03[id=64].invoke()]   ....saved message context .....
MessageContextSelfManagedDataTest::saveAndRestore::[TempHandler03[id=64].invoke()]   restoring message context .....
MessageContextSelfManagedDataTest::TempHandler02[id=61].deserializeSelfManagedData()   count [5]
MessageContextSelfManagedDataTest::TempHandler03[id=62].deserializeSelfManagedData()   count [4]
MessageContextSelfManagedDataTest::TempHandler02[id=63].deserializeSelfManagedData()   count [3]
MessageContextSelfManagedDataTest::TempHandler02[id=666].deserializeSelfManagedData()   count [2]
MessageContextSelfManagedDataTest::TempHandler03[id=64].deserializeSelfManagedData()   count [1]
MessageContextSelfManagedDataTest::saveAndRestore::[TempHandler03[id=64].invoke()]   ....restored message context .....
MessageContextSelfManagedDataTest::TempHandler03[id=64].invoke(): Completed
MessageContextSelfManagedDataTest::TempHandler02[id=65].invoke()
MessageContextSelfManagedDataTest::TempHandler02[id=65].invoke():   Setting self managed data using key [65]
MessageContextSelfManagedDataTest::saveAndRestore::[TempHandler02[id=65].invoke()]   
MessageContextSelfManagedDataTest::saveAndRestore::[TempHandler02[id=65].invoke()]   temp file = [TempHandler02_37486.tmp]
MessageContextSelfManagedDataTest::saveAndRestore::[TempHandler02[id=65].invoke()]   saving message context ....
MessageContextSelfManagedDataTest::TempHandler02[id=61].serializeSelfManagedData()   count [6]
MessageContextSelfManagedDataTest::TempHandler02[id=61].serializeSelfManagedData()   count [6]: saved self managed data string length [24]
MessageContextSelfManagedDataTest::TempHandler02[id=61].serializeSelfManagedData()   count [6]: saved self managed data byte array output stream (UTF) length [32]
MessageContextSelfManagedDataTest::TempHandler03[id=62].serializeSelfManagedData()   count [6]
MessageContextSelfManagedDataTest::TempHandler03[id=62].serializeSelfManagedData()   count [6]: saved self managed data byte [] length [25]
MessageContextSelfManagedDataTest::TempHandler03[id=62].serializeSelfManagedData()   count [6]: saved self managed data byte array output stream length [25]
MessageContextSelfManagedDataTest::TempHandler02[id=63].serializeSelfManagedData()   count [6]
MessageContextSelfManagedDataTest::TempHandler02[id=63].serializeSelfManagedData()   count [6]: saved self managed data string length [24]
MessageContextSelfManagedDataTest::TempHandler02[id=63].serializeSelfManagedData()   count [6]: saved self managed data byte array output stream (UTF) length [32]
MessageContextSelfManagedDataTest::TempHandler02[id=666].serializeSelfManagedData()   count [6]
MessageContextSelfManagedDataTest::TempHandler02[id=666].serializeSelfManagedData()   count [6]: saved self managed data string length [25]
MessageContextSelfManagedDataTest::TempHandler02[id=666].serializeSelfManagedData()   count [6]: saved self managed data byte array output stream (UTF) length [33]
MessageContextSelfManagedDataTest::TempHandler03[id=64].serializeSelfManagedData()   count [6]
MessageContextSelfManagedDataTest::TempHandler03[id=64].serializeSelfManagedData()   count [6]: saved self managed data byte [] length [25]
MessageContextSelfManagedDataTest::TempHandler03[id=64].serializeSelfManagedData()   count [6]: saved self managed data byte array output stream length [25]
MessageContextSelfManagedDataTest::TempHandler02[id=65].serializeSelfManagedData()   count [6]
MessageContextSelfManagedDataTest::TempHandler02[id=65].serializeSelfManagedData()   count [6]: saved self managed data string length [24]
MessageContextSelfManagedDataTest::TempHandler02[id=65].serializeSelfManagedData()   count [6]: saved self managed data byte array output stream (UTF) length [32]
MessageContextSelfManagedDataTest::TempHandler02[id=1000].serializeSelfManagedData()   count [6]
MessageContextSelfManagedDataTest::TempHandler02[id=1000].serializeSelfManagedData()   count [6]:  No self managed data to serialize
MessageContextSelfManagedDataTest::TempHandler03[id=66].serializeSelfManagedData()   count [6]
MessageContextSelfManagedDataTest::TempHandler03[id=66].serializeSelfManagedData()   count [6]:  No self managed data to serialize
MessageContextSelfManagedDataTest::TempHandler02[id=67].serializeSelfManagedData()   count [6]
MessageContextSelfManagedDataTest::TempHandler02[id=67].serializeSelfManagedData()   count [6]:  No self managed data to serialize
MessageContextSelfManagedDataTest::TempHandler03[id=68].serializeSelfManagedData()   count [6]
MessageContextSelfManagedDataTest::TempHandler03[id=68].serializeSelfManagedData()   count [6]:  No self managed data to serialize
MessageContextSelfManagedDataTest::saveAndRestore::[TempHandler02[id=65].invoke()]   ....saved message context .....
MessageContextSelfManagedDataTest::saveAndRestore::[TempHandler02[id=65].invoke()]   restoring message context .....
MessageContextSelfManagedDataTest::TempHandler02[id=61].deserializeSelfManagedData()   count [6]
MessageContextSelfManagedDataTest::TempHandler03[id=62].deserializeSelfManagedData()   count [5]
MessageContextSelfManagedDataTest::TempHandler02[id=63].deserializeSelfManagedData()   count [4]
MessageContextSelfManagedDataTest::TempHandler02[id=666].deserializeSelfManagedData()   count [3]
MessageContextSelfManagedDataTest::TempHandler03[id=64].deserializeSelfManagedData()   count [2]
MessageContextSelfManagedDataTest::TempHandler02[id=65].deserializeSelfManagedData()   count [1]
MessageContextSelfManagedDataTest::saveAndRestore::[TempHandler02[id=65].invoke()]   ....restored message context .....
MessageContextSelfManagedDataTest::TempHandler02[id=65].invoke(): Completed
MessageContextSelfManagedDataTest::TempHandler02[id=1000].invoke()
MessageContextSelfManagedDataTest::TempHandler02[id=1000].invoke():   Setting self managed data using key [1000]
MessageContextSelfManagedDataTest::saveAndRestore::[TempHandler02[id=1000].invoke()]   
MessageContextSelfManagedDataTest::saveAndRestore::[TempHandler02[id=1000].invoke()]   temp file = [TempHandler02_37487.tmp]
MessageContextSelfManagedDataTest::saveAndRestore::[TempHandler02[id=1000].invoke()]   saving message context ....
MessageContextSelfManagedDataTest::TempHandler02[id=61].serializeSelfManagedData()   count [7]
MessageContextSelfManagedDataTest::TempHandler02[id=61].serializeSelfManagedData()   count [7]: saved self managed data string length [24]
MessageContextSelfManagedDataTest::TempHandler02[id=61].serializeSelfManagedData()   count [7]: saved self managed data byte array output stream (UTF) length [32]
MessageContextSelfManagedDataTest::TempHandler03[id=62].serializeSelfManagedData()   count [7]
MessageContextSelfManagedDataTest::TempHandler03[id=62].serializeSelfManagedData()   count [7]: saved self managed data byte [] length [25]
MessageContextSelfManagedDataTest::TempHandler03[id=62].serializeSelfManagedData()   count [7]: saved self managed data byte array output stream length [25]
MessageContextSelfManagedDataTest::TempHandler02[id=63].serializeSelfManagedData()   count [7]
MessageContextSelfManagedDataTest::TempHandler02[id=63].serializeSelfManagedData()   count [7]: saved self managed data string length [24]
MessageContextSelfManagedDataTest::TempHandler02[id=63].serializeSelfManagedData()   count [7]: saved self managed data byte array output stream (UTF) length [32]
MessageContextSelfManagedDataTest::TempHandler02[id=666].serializeSelfManagedData()   count [7]
MessageContextSelfManagedDataTest::TempHandler02[id=666].serializeSelfManagedData()   count [7]: saved self managed data string length [25]
MessageContextSelfManagedDataTest::TempHandler02[id=666].serializeSelfManagedData()   count [7]: saved self managed data byte array output stream (UTF) length [33]
MessageContextSelfManagedDataTest::TempHandler03[id=64].serializeSelfManagedData()   count [7]
MessageContextSelfManagedDataTest::TempHandler03[id=64].serializeSelfManagedData()   count [7]: saved self managed data byte [] length [25]
MessageContextSelfManagedDataTest::TempHandler03[id=64].serializeSelfManagedData()   count [7]: saved self managed data byte array output stream length [25]
MessageContextSelfManagedDataTest::TempHandler02[id=65].serializeSelfManagedData()   count [7]
MessageContextSelfManagedDataTest::TempHandler02[id=65].serializeSelfManagedData()   count [7]: saved self managed data string length [24]
MessageContextSelfManagedDataTest::TempHandler02[id=65].serializeSelfManagedData()   count [7]: saved self managed data byte array output stream (UTF) length [32]
MessageContextSelfManagedDataTest::TempHandler02[id=1000].serializeSelfManagedData()   count [7]
MessageContextSelfManagedDataTest::TempHandler02[id=1000].serializeSelfManagedData()   count [7]: saved self managed data string length [26]
MessageContextSelfManagedDataTest::TempHandler02[id=1000].serializeSelfManagedData()   count [7]: saved self managed data byte array output stream (UTF) length [34]
MessageContextSelfManagedDataTest::TempHandler03[id=66].serializeSelfManagedData()   count [7]
MessageContextSelfManagedDataTest::TempHandler03[id=66].serializeSelfManagedData()   count [7]:  No self managed data to serialize
MessageContextSelfManagedDataTest::TempHandler02[id=67].serializeSelfManagedData()   count [7]
MessageContextSelfManagedDataTest::TempHandler02[id=67].serializeSelfManagedData()   count [7]:  No self managed data to serialize
MessageContextSelfManagedDataTest::TempHandler03[id=68].serializeSelfManagedData()   count [7]
MessageContextSelfManagedDataTest::TempHandler03[id=68].serializeSelfManagedData()   count [7]:  No self managed data to serialize
MessageContextSelfManagedDataTest::saveAndRestore::[TempHandler02[id=1000].invoke()]   ....saved message context .....
MessageContextSelfManagedDataTest::saveAndRestore::[TempHandler02[id=1000].invoke()]   restoring message context .....
MessageContextSelfManagedDataTest::TempHandler02[id=61].deserializeSelfManagedData()   count [7]
MessageContextSelfManagedDataTest::TempHandler03[id=62].deserializeSelfManagedData()   count [6]
MessageContextSelfManagedDataTest::TempHandler02[id=63].deserializeSelfManagedData()   count [5]
MessageContextSelfManagedDataTest::TempHandler02[id=666].deserializeSelfManagedData()   count [4]
MessageContextSelfManagedDataTest::TempHandler03[id=64].deserializeSelfManagedData()   count [3]
MessageContextSelfManagedDataTest::TempHandler02[id=65].deserializeSelfManagedData()   count [2]
MessageContextSelfManagedDataTest::TempHandler02[id=1000].deserializeSelfManagedData()   count [1]
MessageContextSelfManagedDataTest::saveAndRestore::[TempHandler02[id=1000].invoke()]   ....restored message context .....
MessageContextSelfManagedDataTest::TempHandler02[id=1000].invoke(): Completed
MessageContextSelfManagedDataTest::TempHandler02[id=666].invoke()
MessageContextSelfManagedDataTest::TempHandler02[id=666].invoke():   Setting self managed data using key [666]
MessageContextSelfManagedDataTest::saveAndRestore::[TempHandler02[id=666].invoke()]   
MessageContextSelfManagedDataTest::saveAndRestore::[TempHandler02[id=666].invoke()]   temp file = [TempHandler02_37488.tmp]
MessageContextSelfManagedDataTest::saveAndRestore::[TempHandler02[id=666].invoke()]   saving message context ....
MessageContextSelfManagedDataTest::TempHandler02[id=61].serializeSelfManagedData()   count [8]
MessageContextSelfManagedDataTest::TempHandler02[id=61].serializeSelfManagedData()   count [8]: saved self managed data string length [24]
MessageContextSelfManagedDataTest::TempHandler02[id=61].serializeSelfManagedData()   count [8]: saved self managed data byte array output stream (UTF) length [32]
MessageContextSelfManagedDataTest::TempHandler03[id=62].serializeSelfManagedData()   count [8]
MessageContextSelfManagedDataTest::TempHandler03[id=62].serializeSelfManagedData()   count [8]: saved self managed data byte [] length [25]
MessageContextSelfManagedDataTest::TempHandler03[id=62].serializeSelfManagedData()   count [8]: saved self managed data byte array output stream length [25]
MessageContextSelfManagedDataTest::TempHandler02[id=63].serializeSelfManagedData()   count [8]
MessageContextSelfManagedDataTest::TempHandler02[id=63].serializeSelfManagedData()   count [8]: saved self managed data string length [24]
MessageContextSelfManagedDataTest::TempHandler02[id=63].serializeSelfManagedData()   count [8]: saved self managed data byte array output stream (UTF) length [32]
MessageContextSelfManagedDataTest::TempHandler02[id=666].serializeSelfManagedData()   count [8]
MessageContextSelfManagedDataTest::TempHandler02[id=666].serializeSelfManagedData()   count [8]: saved self managed data string length [48]
MessageContextSelfManagedDataTest::TempHandler02[id=666].serializeSelfManagedData()   count [8]: saved self managed data byte array output stream (UTF) length [56]
MessageContextSelfManagedDataTest::TempHandler03[id=64].serializeSelfManagedData()   count [8]
MessageContextSelfManagedDataTest::TempHandler03[id=64].serializeSelfManagedData()   count [8]: saved self managed data byte [] length [25]
MessageContextSelfManagedDataTest::TempHandler03[id=64].serializeSelfManagedData()   count [8]: saved self managed data byte array output stream length [25]
MessageContextSelfManagedDataTest::TempHandler02[id=65].serializeSelfManagedData()   count [8]
MessageContextSelfManagedDataTest::TempHandler02[id=65].serializeSelfManagedData()   count [8]: saved self managed data string length [24]
MessageContextSelfManagedDataTest::TempHandler02[id=65].serializeSelfManagedData()   count [8]: saved self managed data byte array output stream (UTF) length [32]
MessageContextSelfManagedDataTest::TempHandler02[id=1000].serializeSelfManagedData()   count [8]
MessageContextSelfManagedDataTest::TempHandler02[id=1000].serializeSelfManagedData()   count [8]: saved self managed data string length [26]
MessageContextSelfManagedDataTest::TempHandler02[id=1000].serializeSelfManagedData()   count [8]: saved self managed data byte array output stream (UTF) length [34]
MessageContextSelfManagedDataTest::TempHandler03[id=66].serializeSelfManagedData()   count [8]
MessageContextSelfManagedDataTest::TempHandler03[id=66].serializeSelfManagedData()   count [8]:  No self managed data to serialize
MessageContextSelfManagedDataTest::TempHandler02[id=67].serializeSelfManagedData()   count [8]
MessageContextSelfManagedDataTest::TempHandler02[id=67].serializeSelfManagedData()   count [8]:  No self managed data to serialize
MessageContextSelfManagedDataTest::TempHandler03[id=68].serializeSelfManagedData()   count [8]
MessageContextSelfManagedDataTest::TempHandler03[id=68].serializeSelfManagedData()   count [8]:  No self managed data to serialize
MessageContextSelfManagedDataTest::saveAndRestore::[TempHandler02[id=666].invoke()]   ....saved message context .....
MessageContextSelfManagedDataTest::saveAndRestore::[TempHandler02[id=666].invoke()]   restoring message context .....
MessageContextSelfManagedDataTest::TempHandler02[id=61].deserializeSelfManagedData()   count [8]
MessageContextSelfManagedDataTest::TempHandler03[id=62].deserializeSelfManagedData()   count [7]
MessageContextSelfManagedDataTest::TempHandler02[id=63].deserializeSelfManagedData()   count [6]
MessageContextSelfManagedDataTest::TempHandler02[id=666].deserializeSelfManagedData()   count [5]
MessageContextSelfManagedDataTest::TempHandler03[id=64].deserializeSelfManagedData()   count [4]
MessageContextSelfManagedDataTest::TempHandler02[id=65].deserializeSelfManagedData()   count [3]
MessageContextSelfManagedDataTest::TempHandler02[id=1000].deserializeSelfManagedData()   count [2]
MessageContextSelfManagedDataTest::saveAndRestore::[TempHandler02[id=666].invoke()]   ....restored message context .....
MessageContextSelfManagedDataTest::TempHandler02[id=666].invoke(): Completed
MessageContextSelfManagedDataTest::TempHandler03[id=66].invoke()
MessageContextSelfManagedDataTest::TempHandler03[id=66].invoke():   Setting self managed data using key [66]
MessageContextSelfManagedDataTest::saveAndRestore::[TempHandler03[id=66].invoke()]   
MessageContextSelfManagedDataTest::saveAndRestore::[TempHandler03[id=66].invoke()]   temp file = [TempHandler03_37489.tmp]
MessageContextSelfManagedDataTest::saveAndRestore::[TempHandler03[id=66].invoke()]   saving message context ....
MessageContextSelfManagedDataTest::TempHandler02[id=61].serializeSelfManagedData()   count [9]
MessageContextSelfManagedDataTest::TempHandler02[id=61].serializeSelfManagedData()   count [9]: saved self managed data string length [24]
MessageContextSelfManagedDataTest::TempHandler02[id=61].serializeSelfManagedData()   count [9]: saved self managed data byte array output stream (UTF) length [32]
MessageContextSelfManagedDataTest::TempHandler03[id=62].serializeSelfManagedData()   count [9]
MessageContextSelfManagedDataTest::TempHandler03[id=62].serializeSelfManagedData()   count [9]: saved self managed data byte [] length [25]
MessageContextSelfManagedDataTest::TempHandler03[id=62].serializeSelfManagedData()   count [9]: saved self managed data byte array output stream length [25]
MessageContextSelfManagedDataTest::TempHandler02[id=63].serializeSelfManagedData()   count [9]
MessageContextSelfManagedDataTest::TempHandler02[id=63].serializeSelfManagedData()   count [9]: saved self managed data string length [24]
MessageContextSelfManagedDataTest::TempHandler02[id=63].serializeSelfManagedData()   count [9]: saved self managed data byte array output stream (UTF) length [32]
MessageContextSelfManagedDataTest::TempHandler02[id=666].serializeSelfManagedData()   count [9]
MessageContextSelfManagedDataTest::TempHandler02[id=666].serializeSelfManagedData()   count [9]: saved self managed data string length [48]
MessageContextSelfManagedDataTest::TempHandler02[id=666].serializeSelfManagedData()   count [9]: saved self managed data byte array output stream (UTF) length [56]
MessageContextSelfManagedDataTest::TempHandler03[id=64].serializeSelfManagedData()   count [9]
MessageContextSelfManagedDataTest::TempHandler03[id=64].serializeSelfManagedData()   count [9]: saved self managed data byte [] length [25]
MessageContextSelfManagedDataTest::TempHandler03[id=64].serializeSelfManagedData()   count [9]: saved self managed data byte array output stream length [25]
MessageContextSelfManagedDataTest::TempHandler02[id=65].serializeSelfManagedData()   count [9]
MessageContextSelfManagedDataTest::TempHandler02[id=65].serializeSelfManagedData()   count [9]: saved self managed data string length [24]
MessageContextSelfManagedDataTest::TempHandler02[id=65].serializeSelfManagedData()   count [9]: saved self managed data byte array output stream (UTF) length [32]
MessageContextSelfManagedDataTest::TempHandler02[id=1000].serializeSelfManagedData()   count [9]
MessageContextSelfManagedDataTest::TempHandler02[id=1000].serializeSelfManagedData()   count [9]: saved self managed data string length [26]
MessageContextSelfManagedDataTest::TempHandler02[id=1000].serializeSelfManagedData()   count [9]: saved self managed data byte array output stream (UTF) length [34]
MessageContextSelfManagedDataTest::TempHandler03[id=66].serializeSelfManagedData()   count [9]
MessageContextSelfManagedDataTest::TempHandler03[id=66].serializeSelfManagedData()   count [9]: saved self managed data byte [] length [25]
MessageContextSelfManagedDataTest::TempHandler03[id=66].serializeSelfManagedData()   count [9]: saved self managed data byte array output stream length [25]
MessageContextSelfManagedDataTest::TempHandler02[id=67].serializeSelfManagedData()   count [9]
MessageContextSelfManagedDataTest::TempHandler02[id=67].serializeSelfManagedData()   count [9]:  No self managed data to serialize
MessageContextSelfManagedDataTest::TempHandler03[id=68].serializeSelfManagedData()   count [9]
MessageContextSelfManagedDataTest::TempHandler03[id=68].serializeSelfManagedData()   count [9]:  No self managed data to serialize
MessageContextSelfManagedDataTest::saveAndRestore::[TempHandler03[id=66].invoke()]   ....saved message context .....
MessageContextSelfManagedDataTest::saveAndRestore::[TempHandler03[id=66].invoke()]   restoring message context .....
MessageContextSelfManagedDataTest::TempHandler02[id=61].deserializeSelfManagedData()   count [9]
MessageContextSelfManagedDataTest::TempHandler03[id=62].deserializeSelfManagedData()   count [8]
MessageContextSelfManagedDataTest::TempHandler02[id=63].deserializeSelfManagedData()   count [7]
MessageContextSelfManagedDataTest::TempHandler02[id=666].deserializeSelfManagedData()   count [6]
MessageContextSelfManagedDataTest::TempHandler03[id=64].deserializeSelfManagedData()   count [5]
MessageContextSelfManagedDataTest::TempHandler02[id=65].deserializeSelfManagedData()   count [4]
MessageContextSelfManagedDataTest::TempHandler02[id=1000].deserializeSelfManagedData()   count [3]
MessageContextSelfManagedDataTest::TempHandler03[id=66].deserializeSelfManagedData()   count [1]
MessageContextSelfManagedDataTest::saveAndRestore::[TempHandler03[id=66].invoke()]   ....restored message context .....
MessageContextSelfManagedDataTest::TempHandler03[id=66].invoke(): Completed
MessageContextSelfManagedDataTest::TempHandler02[id=67].invoke()
MessageContextSelfManagedDataTest::TempHandler02[id=67].invoke():   Setting self managed data using key [67]
MessageContextSelfManagedDataTest::saveAndRestore::[TempHandler02[id=67].invoke()]   
MessageContextSelfManagedDataTest::saveAndRestore::[TempHandler02[id=67].invoke()]   temp file = [TempHandler02_37490.tmp]
MessageContextSelfManagedDataTest::saveAndRestore::[TempHandler02[id=67].invoke()]   saving message context ....
MessageContextSelfManagedDataTest::TempHandler02[id=61].serializeSelfManagedData()   count [10]
MessageContextSelfManagedDataTest::TempHandler02[id=61].serializeSelfManagedData()   count [10]: saved self managed data string length [24]
MessageContextSelfManagedDataTest::TempHandler02[id=61].serializeSelfManagedData()   count [10]: saved self managed data byte array output stream (UTF) length [32]
MessageContextSelfManagedDataTest::TempHandler03[id=62].serializeSelfManagedData()   count [10]
MessageContextSelfManagedDataTest::TempHandler03[id=62].serializeSelfManagedData()   count [10]: saved self managed data byte [] length [25]
MessageContextSelfManagedDataTest::TempHandler03[id=62].serializeSelfManagedData()   count [10]: saved self managed data byte array output stream length [25]
MessageContextSelfManagedDataTest::TempHandler02[id=63].serializeSelfManagedData()   count [10]
MessageContextSelfManagedDataTest::TempHandler02[id=63].serializeSelfManagedData()   count [10]: saved self managed data string length [24]
MessageContextSelfManagedDataTest::TempHandler02[id=63].serializeSelfManagedData()   count [10]: saved self managed data byte array output stream (UTF) length [32]
MessageContextSelfManagedDataTest::TempHandler02[id=666].serializeSelfManagedData()   count [10]
MessageContextSelfManagedDataTest::TempHandler02[id=666].serializeSelfManagedData()   count [10]: saved self managed data string length [48]
MessageContextSelfManagedDataTest::TempHandler02[id=666].serializeSelfManagedData()   count [10]: saved self managed data byte array output stream (UTF) length [56]
MessageContextSelfManagedDataTest::TempHandler03[id=64].serializeSelfManagedData()   count [10]
MessageContextSelfManagedDataTest::TempHandler03[id=64].serializeSelfManagedData()   count [10]: saved self managed data byte [] length [25]
MessageContextSelfManagedDataTest::TempHandler03[id=64].serializeSelfManagedData()   count [10]: saved self managed data byte array output stream length [25]
MessageContextSelfManagedDataTest::TempHandler02[id=65].serializeSelfManagedData()   count [10]
MessageContextSelfManagedDataTest::TempHandler02[id=65].serializeSelfManagedData()   count [10]: saved self managed data string length [24]
MessageContextSelfManagedDataTest::TempHandler02[id=65].serializeSelfManagedData()   count [10]: saved self managed data byte array output stream (UTF) length [32]
MessageContextSelfManagedDataTest::TempHandler02[id=1000].serializeSelfManagedData()   count [10]
MessageContextSelfManagedDataTest::TempHandler02[id=1000].serializeSelfManagedData()   count [10]: saved self managed data string length [26]
MessageContextSelfManagedDataTest::TempHandler02[id=1000].serializeSelfManagedData()   count [10]: saved self managed data byte array output stream (UTF) length [34]
MessageContextSelfManagedDataTest::TempHandler03[id=66].serializeSelfManagedData()   count [10]
MessageContextSelfManagedDataTest::TempHandler03[id=66].serializeSelfManagedData()   count [10]: saved self managed data byte [] length [25]
MessageContextSelfManagedDataTest::TempHandler03[id=66].serializeSelfManagedData()   count [10]: saved self managed data byte array output stream length [25]
MessageContextSelfManagedDataTest::TempHandler02[id=67].serializeSelfManagedData()   count [10]
MessageContextSelfManagedDataTest::TempHandler02[id=67].serializeSelfManagedData()   count [10]: saved self managed data string length [24]
MessageContextSelfManagedDataTest::TempHandler02[id=67].serializeSelfManagedData()   count [10]: saved self managed data byte array output stream (UTF) length [32]
MessageContextSelfManagedDataTest::TempHandler03[id=68].serializeSelfManagedData()   count [10]
MessageContextSelfManagedDataTest::TempHandler03[id=68].serializeSelfManagedData()   count [10]:  No self managed data to serialize
MessageContextSelfManagedDataTest::saveAndRestore::[TempHandler02[id=67].invoke()]   ....saved message context .....
MessageContextSelfManagedDataTest::saveAndRestore::[TempHandler02[id=67].invoke()]   restoring message context .....
MessageContextSelfManagedDataTest::TempHandler02[id=61].deserializeSelfManagedData()   count [10]
MessageContextSelfManagedDataTest::TempHandler03[id=62].deserializeSelfManagedData()   count [9]
MessageContextSelfManagedDataTest::TempHandler02[id=63].deserializeSelfManagedData()   count [8]
MessageContextSelfManagedDataTest::TempHandler02[id=666].deserializeSelfManagedData()   count [7]
MessageContextSelfManagedDataTest::TempHandler03[id=64].deserializeSelfManagedData()   count [6]
MessageContextSelfManagedDataTest::TempHandler02[id=65].deserializeSelfManagedData()   count [5]
MessageContextSelfManagedDataTest::TempHandler02[id=1000].deserializeSelfManagedData()   count [4]
MessageContextSelfManagedDataTest::TempHandler03[id=66].deserializeSelfManagedData()   count [2]
MessageContextSelfManagedDataTest::TempHandler02[id=67].deserializeSelfManagedData()   count [1]
MessageContextSelfManagedDataTest::saveAndRestore::[TempHandler02[id=67].invoke()]   ....restored message context .....
MessageContextSelfManagedDataTest::TempHandler02[id=67].invoke(): Completed
MessageContextSelfManagedDataTest::TempHandler03[id=68].invoke()
MessageContextSelfManagedDataTest::TempHandler03[id=68].invoke():   Setting self managed data using key [68]
MessageContextSelfManagedDataTest::saveAndRestore::[TempHandler03[id=68].invoke()]   
MessageContextSelfManagedDataTest::saveAndRestore::[TempHandler03[id=68].invoke()]   temp file = [TempHandler03_37491.tmp]
MessageContextSelfManagedDataTest::saveAndRestore::[TempHandler03[id=68].invoke()]   saving message context ....
MessageContextSelfManagedDataTest::TempHandler02[id=61].serializeSelfManagedData()   count [11]
MessageContextSelfManagedDataTest::TempHandler02[id=61].serializeSelfManagedData()   count [11]: saved self managed data string length [24]
MessageContextSelfManagedDataTest::TempHandler02[id=61].serializeSelfManagedData()   count [11]: saved self managed data byte array output stream (UTF) length [32]
MessageContextSelfManagedDataTest::TempHandler03[id=62].serializeSelfManagedData()   count [11]
MessageContextSelfManagedDataTest::TempHandler03[id=62].serializeSelfManagedData()   count [11]: saved self managed data byte [] length [25]
MessageContextSelfManagedDataTest::TempHandler03[id=62].serializeSelfManagedData()   count [11]: saved self managed data byte array output stream length [25]
MessageContextSelfManagedDataTest::TempHandler02[id=63].serializeSelfManagedData()   count [11]
MessageContextSelfManagedDataTest::TempHandler02[id=63].serializeSelfManagedData()   count [11]: saved self managed data string length [24]
MessageContextSelfManagedDataTest::TempHandler02[id=63].serializeSelfManagedData()   count [11]: saved self managed data byte array output stream (UTF) length [32]
MessageContextSelfManagedDataTest::TempHandler02[id=666].serializeSelfManagedData()   count [11]
MessageContextSelfManagedDataTest::TempHandler02[id=666].serializeSelfManagedData()   count [11]: saved self managed data string length [48]
MessageContextSelfManagedDataTest::TempHandler02[id=666].serializeSelfManagedData()   count [11]: saved self managed data byte array output stream (UTF) length [56]
MessageContextSelfManagedDataTest::TempHandler03[id=64].serializeSelfManagedData()   count [11]
MessageContextSelfManagedDataTest::TempHandler03[id=64].serializeSelfManagedData()   count [11]: saved self managed data byte [] length [25]
MessageContextSelfManagedDataTest::TempHandler03[id=64].serializeSelfManagedData()   count [11]: saved self managed data byte array output stream length [25]
MessageContextSelfManagedDataTest::TempHandler02[id=65].serializeSelfManagedData()   count [11]
MessageContextSelfManagedDataTest::TempHandler02[id=65].serializeSelfManagedData()   count [11]: saved self managed data string length [24]
MessageContextSelfManagedDataTest::TempHandler02[id=65].serializeSelfManagedData()   count [11]: saved self managed data byte array output stream (UTF) length [32]
MessageContextSelfManagedDataTest::TempHandler02[id=1000].serializeSelfManagedData()   count [11]
MessageContextSelfManagedDataTest::TempHandler02[id=1000].serializeSelfManagedData()   count [11]: saved self managed data string length [26]
MessageContextSelfManagedDataTest::TempHandler02[id=1000].serializeSelfManagedData()   count [11]: saved self managed data byte array output stream (UTF) length [34]
MessageContextSelfManagedDataTest::TempHandler03[id=66].serializeSelfManagedData()   count [11]
MessageContextSelfManagedDataTest::TempHandler03[id=66].serializeSelfManagedData()   count [11]: saved self managed data byte [] length [25]
MessageContextSelfManagedDataTest::TempHandler03[id=66].serializeSelfManagedData()   count [11]: saved self managed data byte array output stream length [25]
MessageContextSelfManagedDataTest::TempHandler02[id=67].serializeSelfManagedData()   count [11]
MessageContextSelfManagedDataTest::TempHandler02[id=67].serializeSelfManagedData()   count [11]: saved self managed data string length [24]
MessageContextSelfManagedDataTest::TempHandler02[id=67].serializeSelfManagedData()   count [11]: saved self managed data byte array output stream (UTF) length [32]
MessageContextSelfManagedDataTest::TempHandler03[id=68].serializeSelfManagedData()   count [11]
MessageContextSelfManagedDataTest::TempHandler03[id=68].serializeSelfManagedData()   count [11]: saved self managed data byte [] length [25]
MessageContextSelfManagedDataTest::TempHandler03[id=68].serializeSelfManagedData()   count [11]: saved self managed data byte array output stream length [25]
MessageContextSelfManagedDataTest::saveAndRestore::[TempHandler03[id=68].invoke()]   ....saved message context .....
MessageContextSelfManagedDataTest::saveAndRestore::[TempHandler03[id=68].invoke()]   restoring message context .....
MessageContextSelfManagedDataTest::TempHandler02[id=61].deserializeSelfManagedData()   count [11]
MessageContextSelfManagedDataTest::TempHandler03[id=62].deserializeSelfManagedData()   count [10]
MessageContextSelfManagedDataTest::TempHandler02[id=63].deserializeSelfManagedData()   count [9]
MessageContextSelfManagedDataTest::TempHandler02[id=666].deserializeSelfManagedData()   count [8]
MessageContextSelfManagedDataTest::TempHandler03[id=64].deserializeSelfManagedData()   count [7]
MessageContextSelfManagedDataTest::TempHandler02[id=65].deserializeSelfManagedData()   count [6]
MessageContextSelfManagedDataTest::TempHandler02[id=1000].deserializeSelfManagedData()   count [5]
MessageContextSelfManagedDataTest::TempHandler03[id=66].deserializeSelfManagedData()   count [3]
MessageContextSelfManagedDataTest::TempHandler02[id=67].deserializeSelfManagedData()   count [2]
MessageContextSelfManagedDataTest::TempHandler03[id=68].deserializeSelfManagedData()   count [1]
MessageContextSelfManagedDataTest::saveAndRestore::[TempHandler03[id=68].invoke()]   ....restored message context .....
MessageContextSelfManagedDataTest::TempHandler03[id=68].invoke(): Completed
MessagecontextSelfManagedDataTest::compareHandlers:  class [org.apache.axis2.engine.MessageContextSelfManagedDataTest$TempHandler02] match 
MessagecontextSelfManagedDataTest::compareHandlers:  id [61] match
MessagecontextSelfManagedDataTest::compareHandlers:  class [org.apache.axis2.engine.MessageContextSelfManagedDataTest$TempHandler03] match 
MessagecontextSelfManagedDataTest::compareHandlers:  id [62] match
MessagecontextSelfManagedDataTest::compareHandlers:  class [org.apache.axis2.engine.MessageContextSelfManagedDataTest$TempHandler02] match 
MessagecontextSelfManagedDataTest::compareHandlers:  id [63] match
MessagecontextSelfManagedDataTest::compareHandlers:  class [org.apache.axis2.engine.MessageContextSelfManagedDataTest$TempHandler02] match 
MessagecontextSelfManagedDataTest::compareHandlers:  id [666] match
MessagecontextSelfManagedDataTest::compareHandlers:  class [org.apache.axis2.engine.MessageContextSelfManagedDataTest$TempHandler03] match 
MessagecontextSelfManagedDataTest::compareHandlers:  id [64] match
MessagecontextSelfManagedDataTest::compareHandlers:  class [org.apache.axis2.engine.MessageContextSelfManagedDataTest$TempHandler02] match 
MessagecontextSelfManagedDataTest::compareHandlers:  id [65] match
MessagecontextSelfManagedDataTest::compareHandlers:  class [org.apache.axis2.engine.MessageContextSelfManagedDataTest$TempHandler02] match 
MessagecontextSelfManagedDataTest::compareHandlers:  id [1000] match
MessagecontextSelfManagedDataTest::compareHandlers:  class [org.apache.axis2.engine.MessageContextSelfManagedDataTest$TempHandler02] match 
MessagecontextSelfManagedDataTest::compareHandlers:  id [666] match
MessagecontextSelfManagedDataTest::compareHandlers:  class [org.apache.axis2.engine.MessageContextSelfManagedDataTest$TempHandler03] match 
MessagecontextSelfManagedDataTest::compareHandlers:  id [66] match
MessagecontextSelfManagedDataTest::compareHandlers:  class [org.apache.axis2.engine.MessageContextSelfManagedDataTest$TempHandler02] match 
MessagecontextSelfManagedDataTest::compareHandlers:  id [1000] match
MessagecontextSelfManagedDataTest::compareHandlers:  class [org.apache.axis2.engine.MessageContextSelfManagedDataTest$TempHandler02] match 
MessagecontextSelfManagedDataTest::compareHandlers:  id [67] match
MessagecontextSelfManagedDataTest::compareHandlers:  class [org.apache.axis2.engine.MessageContextSelfManagedDataTest$TempHandler03] match 
MessagecontextSelfManagedDataTest::compareHandlers:  id [68] match
MessageContextSelfManagedDataTest::testPause06_saveRestorePhases()::  invokecallcount [11]
MessageContextSelfManagedDataTest::testPause06_saveRestorePhases()::  handlerA serialize call count [11]
MessageContextSelfManagedDataTest::testPause06_saveRestorePhases()::  handlerA deserialize call count [8]
MessageContextSelfManagedDataTest::testSelfManagedData07()=======================================
MessageContextSelfManagedDataTest::TempHandler03[id=103].invoke()
MessageContextSelfManagedDataTest::TempHandler03[id=103].invoke():   Setting self managed data using key [103]
MessageContextSelfManagedDataTest::saveAndRestore::[TempHandler03[id=103].invoke()]   
MessageContextSelfManagedDataTest::saveAndRestore::[TempHandler03[id=103].invoke()]   temp file = [TempHandler03_37492.tmp]
MessageContextSelfManagedDataTest::saveAndRestore::[TempHandler03[id=103].invoke()]   saving message context ....
MessageContextSelfManagedDataTest::TempHandler03[id=103].serializeSelfManagedData()   count [1]
MessageContextSelfManagedDataTest::TempHandler03[id=103].serializeSelfManagedData()   count [1]: saved self managed data byte [] length [25]
MessageContextSelfManagedDataTest::TempHandler03[id=103].serializeSelfManagedData()   count [1]: saved self managed data byte array output stream length [25]
MessageContextSelfManagedDataTest::saveAndRestore::[TempHandler03[id=103].invoke()]   ....saved message context .....
MessageContextSelfManagedDataTest::saveAndRestore::[TempHandler03[id=103].invoke()]   restoring message context .....
MessageContextSelfManagedDataTest::TempHandler03[id=103].deserializeSelfManagedData()   count [1]
MessageContextSelfManagedDataTest::saveAndRestore::[TempHandler03[id=103].invoke()]   ....restored message context .....
MessageContextSelfManagedDataTest::TempHandler03[id=103].invoke(): Completed
MessageContextSelfManagedDataTest::testSelfManagedData08()=======================================
MessageContextSelfManagedDataTest::TempHandler04[id=104].invoke()
MessageContextSelfManagedDataTest::TempHandler04[id=104].invoke():   Setting self managed data using key [104]
MessageContextSelfManagedDataTest::saveAndRestore::[TempHandler04[id=104].invoke()]   
MessageContextSelfManagedDataTest::saveAndRestore::[TempHandler04[id=104].invoke()]   temp file = [TempHandler04_37493.tmp]
MessageContextSelfManagedDataTest::saveAndRestore::[TempHandler04[id=104].invoke()]   saving message context ....
MessageContextSelfManagedDataTest::TempHandler04[id=104].serializeSelfManagedData()   count [1]
MessageContextSelfManagedDataTest::TempHandler04[id=104].serializeSelfManagedData()   count [1]: saved self managed data byte [] length [4]
MessageContextSelfManagedDataTest::TempHandler04[id=104].serializeSelfManagedData()   count [1]: saved self managed data byte array output stream length [42]
MessageContextSelfManagedDataTest::saveAndRestore::[TempHandler04[id=104].invoke()]   ....saved message context .....
MessageContextSelfManagedDataTest::saveAndRestore::[TempHandler04[id=104].invoke()]   restoring message context .....
MessageContextSelfManagedDataTest::TempHandler04[id=104].deserializeSelfManagedData()   count [1]
MessageContextSelfManagedDataTest::saveAndRestore::[TempHandler04[id=104].invoke()]   ....restored message context .....
MessageContextSelfManagedDataTest::TempHandler04[id=104].invoke(): Completed
MessageContextSelfManagedDataTest::testSelfManagedData09()=======================================
MessageContextSelfManagedDataTest::TempHandler03[id=103].invoke()
MessageContextSelfManagedDataTest::TempHandler03[id=103].invoke():   Setting self managed data using key [103]
MessageContextSelfManagedDataTest::saveAndRestore::[TempHandler03[id=103].invoke()]   
MessageContextSelfManagedDataTest::saveAndRestore::[TempHandler03[id=103].invoke()]   temp file = [TempHandler03_37494.tmp]
MessageContextSelfManagedDataTest::saveAndRestore::[TempHandler03[id=103].invoke()]   saving message context ....
MessageContextSelfManagedDataTest::TempHandler03[id=103].serializeSelfManagedData()   count [1]
MessageContextSelfManagedDataTest::TempHandler03[id=103].serializeSelfManagedData()   count [1]: saved self managed data byte [] length [25]
MessageContextSelfManagedDataTest::TempHandler03[id=103].serializeSelfManagedData()   count [1]: saved self managed data byte array output stream length [25]
MessageContextSelfManagedDataTest::TempHandler04[id=104].serializeSelfManagedData()   count [1]
MessageContextSelfManagedDataTest::TempHandler04[id=104].serializeSelfManagedData()   count [1]:  No self managed data to serialize
MessageContextSelfManagedDataTest::saveAndRestore::[TempHandler03[id=103].invoke()]   ....saved message context .....
MessageContextSelfManagedDataTest::saveAndRestore::[TempHandler03[id=103].invoke()]   restoring message context .....
MessageContextSelfManagedDataTest::TempHandler03[id=103].deserializeSelfManagedData()   count [1]
MessageContextSelfManagedDataTest::saveAndRestore::[TempHandler03[id=103].invoke()]   ....restored message context .....
MessageContextSelfManagedDataTest::TempHandler03[id=103].invoke(): Completed
MessageContextSelfManagedDataTest::TempHandler04[id=104].invoke()
MessageContextSelfManagedDataTest::TempHandler04[id=104].invoke():   Setting self managed data using key [104]
MessageContextSelfManagedDataTest::saveAndRestore::[TempHandler04[id=104].invoke()]   
MessageContextSelfManagedDataTest::saveAndRestore::[TempHandler04[id=104].invoke()]   temp file = [TempHandler04_37495.tmp]
MessageContextSelfManagedDataTest::saveAndRestore::[TempHandler04[id=104].invoke()]   saving message context ....
MessageContextSelfManagedDataTest::TempHandler03[id=103].serializeSelfManagedData()   count [2]
MessageContextSelfManagedDataTest::TempHandler03[id=103].serializeSelfManagedData()   count [2]: saved self managed data byte [] length [25]
MessageContextSelfManagedDataTest::TempHandler03[id=103].serializeSelfManagedData()   count [2]: saved self managed data byte array output stream length [25]
MessageContextSelfManagedDataTest::TempHandler04[id=104].serializeSelfManagedData()   count [2]
MessageContextSelfManagedDataTest::TempHandler04[id=104].serializeSelfManagedData()   count [2]: saved self managed data byte [] length [4]
MessageContextSelfManagedDataTest::TempHandler04[id=104].serializeSelfManagedData()   count [2]: saved self managed data byte array output stream length [42]
MessageContextSelfManagedDataTest::saveAndRestore::[TempHandler04[id=104].invoke()]   ....saved message context .....
MessageContextSelfManagedDataTest::saveAndRestore::[TempHandler04[id=104].invoke()]   restoring message context .....
MessageContextSelfManagedDataTest::TempHandler03[id=103].deserializeSelfManagedData()   count [2]
MessageContextSelfManagedDataTest::TempHandler04[id=104].deserializeSelfManagedData()   count [1]
MessageContextSelfManagedDataTest::saveAndRestore::[TempHandler04[id=104].invoke()]   ....restored message context .....
MessageContextSelfManagedDataTest::TempHandler04[id=104].invoke(): Completed
[surefire] Tests run: 10, Failures: 0, Errors: 0, Time elapsed: 0.966 sec
[surefire] Running org.apache.axis2.engine.SOAPActionBasedDispatcherTest
[surefire] Tests run: 4, Failures: 0, Errors: 0, Time elapsed: 0.005 sec
[surefire] Running org.apache.axis2.engine.ModuleEngageTest
[surefire] Tests run: 1, Failures: 0, Errors: 0, Time elapsed: 0.028 sec
[surefire] Running org.apache.axis2.engine.ParameterAddTest
[surefire] Tests run: 4, Failures: 0, Errors: 0, Time elapsed: 0.005 sec
[surefire] Running org.apache.axis2.engine.MessageContextSaveATest
MessageContextSaveATest:testReceive(): start - - engine.receive(mc) - - - - - - - - - - - - - - - -
TempHandler[1]:invoke(): pause = [false]
TempHandler[1]:invoke(): executedHandlers.add(1)
TempHandler[2]:invoke(): pause = [false]
TempHandler[2]:invoke(): executedHandlers.add(2)
TempHandler[3]:invoke(): pause = [false]
TempHandler[3]:invoke(): executedHandlers.add(3)
TempHandler[4]:invoke(): pause = [false]
TempHandler[4]:invoke(): executedHandlers.add(4)
TempHandler[5]:invoke(): pause = [false]
TempHandler[5]:invoke(): executedHandlers.add(5)
TempHandler[6]:invoke(): pause = [false]
TempHandler[6]:invoke(): executedHandlers.add(6)
TempHandler[7]:invoke(): pause = [false]
TempHandler[7]:invoke(): executedHandlers.add(7)
TempHandler[8]:invoke(): pause = [false]
TempHandler[8]:invoke(): executedHandlers.add(8)
TempHandler[9]:invoke(): pause = [false]
TempHandler[9]:invoke(): executedHandlers.add(9)
TempHandler[10]:invoke(): pause = [false]
TempHandler[10]:invoke(): executedHandlers.add(10)
TempHandler[11]:invoke(): pause = [false]
TempHandler[11]:invoke(): executedHandlers.add(11)
TempHandler[12]:invoke(): pause = [false]
TempHandler[12]:invoke(): executedHandlers.add(12)
TempHandler[13]:invoke(): pause = [false]
TempHandler[13]:invoke(): executedHandlers.add(13)
TempHandler[14]:invoke(): pause = [false]
TempHandler[14]:invoke(): executedHandlers.add(14)
TempHandler[15]:invoke(): pause = [true]
TempHandler[15]:invoke(): msgContext.pause()
TempHandler[15]:invoke(): temp file = [mcSave37496.tmp]
TempHandler[15]:invoke(): saving message context.....
TempHandler[15]:invoke(): ....saved message context.....
TempHandler[15]:invoke(): file size after save [22453]   temp file = [mcSave37496.tmp]
TempHandler[15]:invoke(): restoring a message context.....
TempHandler[15]:invoke(): ....restored message context.....
TempHandler[15]:invoke(): execution chain equivalency [true]
MessageContextSaveATest::compareHandlers:  class [org.apache.axis2.engine.MessageContextSaveATest$TempHandler] match 
MessageContextSaveATest::compareHandlers:  id [10] match
MessageContextSaveATest::compareHandlers:  class [org.apache.axis2.engine.MessageContextSaveATest$TempHandler] match 
MessageContextSaveATest::compareHandlers:  id [11] match
MessageContextSaveATest::compareHandlers:  class [org.apache.axis2.engine.MessageContextSaveATest$TempHandler] match 
MessageContextSaveATest::compareHandlers:  id [12] match
MessageContextSaveATest::compareHandlers:  class [org.apache.axis2.engine.MessageContextSaveATest$TempHandler] match 
MessageContextSaveATest::compareHandlers:  id [13] match
MessageContextSaveATest::compareHandlers:  class [org.apache.axis2.engine.MessageContextSaveATest$TempHandler] match 
MessageContextSaveATest::compareHandlers:  id [14] match
MessageContextSaveATest::compareHandlers:  class [org.apache.axis2.engine.MessageContextSaveATest$TempHandler] match 
MessageContextSaveATest::compareHandlers:  id [15] match
MessageContextSaveATest::compareHandlers:  class [org.apache.axis2.engine.MessageContextSaveATest$TempHandler] match 
MessageContextSaveATest::compareHandlers:  id [16] match
MessageContextSaveATest::compareHandlers:  class [org.apache.axis2.engine.MessageContextSaveATest$TempHandler] match 
MessageContextSaveATest::compareHandlers:  id [17] match
MessageContextSaveATest::compareHandlers:  class [org.apache.axis2.engine.MessageContextSaveATest$TempHandler] match 
MessageContextSaveATest::compareHandlers:  id [18] match
MessageContextSaveATest: comparePhases:  Phase1[middlePhase2] == Phase2[middlePhase2] - matched handler lists
TempHandler[15]:invoke(): executed phase list:  compare phases [true]
MessageContextSaveATest::compareHandlers:  class [org.apache.axis2.engine.MessageContextSaveATest$TempHandler] match 
MessageContextSaveATest::compareHandlers:  id [1] match
MessageContextSaveATest::compareHandlers:  class [org.apache.axis2.engine.MessageContextSaveATest$TempHandler] match 
MessageContextSaveATest::compareHandlers:  id [2] match
MessageContextSaveATest::compareHandlers:  class [org.apache.axis2.engine.MessageContextSaveATest$TempHandler] match 
MessageContextSaveATest::compareHandlers:  id [3] match
MessageContextSaveATest::compareHandlers:  class [org.apache.axis2.engine.MessageContextSaveATest$TempHandler] match 
MessageContextSaveATest::compareHandlers:  id [4] match
MessageContextSaveATest::compareHandlers:  class [org.apache.axis2.engine.MessageContextSaveATest$TempHandler] match 
MessageContextSaveATest::compareHandlers:  id [5] match
MessageContextSaveATest::compareHandlers:  class [org.apache.axis2.engine.MessageContextSaveATest$TempHandler] match 
MessageContextSaveATest::compareHandlers:  id [6] match
MessageContextSaveATest::compareHandlers:  class [org.apache.axis2.engine.MessageContextSaveATest$TempHandler] match 
MessageContextSaveATest::compareHandlers:  id [7] match
MessageContextSaveATest::compareHandlers:  class [org.apache.axis2.engine.MessageContextSaveATest$TempHandler] match 
MessageContextSaveATest::compareHandlers:  id [8] match
MessageContextSaveATest::compareHandlers:  class [org.apache.axis2.engine.MessageContextSaveATest$TempHandler] match 
MessageContextSaveATest::compareHandlers:  id [9] match
MessageContextSaveATest: comparePhases:  Phase1[beginPhase1] == Phase2[beginPhase1] - matched handler lists
TempHandler[15]:invoke(): executed phase list:  compare phases [true]
MessageContextSaveATest:testReceive(): resume - - engine.resume(mc) - - - - - - - - - - - - - - - -
TempHandler[15]:invoke(): pause = [false]
TempHandler[15]:invoke(): executedHandlers.add(15)
TempHandler[16]:invoke(): pause = [false]
TempHandler[16]:invoke(): executedHandlers.add(16)
TempHandler[17]:invoke(): pause = [false]
TempHandler[17]:invoke(): executedHandlers.add(17)
TempHandler[18]:invoke(): pause = [false]
TempHandler[18]:invoke(): executedHandlers.add(18)
TempHandler[19]:invoke(): pause = [false]
TempHandler[19]:invoke(): executedHandlers.add(19)
TempHandler[20]:invoke(): pause = [false]
TempHandler[20]:invoke(): executedHandlers.add(20)
TempHandler[21]:invoke(): pause = [false]
TempHandler[21]:invoke(): executedHandlers.add(21)
TempHandler[22]:invoke(): pause = [false]
TempHandler[22]:invoke(): executedHandlers.add(22)
TempHandler[23]:invoke(): pause = [false]
TempHandler[23]:invoke(): executedHandlers.add(23)
TempHandler[24]:invoke(): pause = [false]
TempHandler[24]:invoke(): executedHandlers.add(24)
TempHandler[25]:invoke(): pause = [false]
TempHandler[25]:invoke(): executedHandlers.add(25)
TempHandler[26]:invoke(): pause = [false]
TempHandler[26]:invoke(): executedHandlers.add(26)
TempHandler[27]:invoke(): pause = [false]
TempHandler[27]:invoke(): executedHandlers.add(27)
TempHandler[28]:invoke(): pause = [false]
TempHandler[28]:invoke(): executedHandlers.add(28)
TempHandler[29]:invoke(): pause = [false]
TempHandler[29]:invoke(): executedHandlers.add(29)
TempHandler[30]:invoke(): pause = [false]
TempHandler[30]:invoke(): executedHandlers.add(30)
TempHandler[31]:invoke(): pause = [true]
TempHandler[31]:invoke(): msgContext.pause()
TempHandler[31]:invoke(): temp file = [mcSave37497.tmp]
TempHandler[31]:invoke(): saving message context.....
TempHandler[31]:invoke(): ....saved message context.....
TempHandler[31]:invoke(): file size after save [26603]   temp file = [mcSave37497.tmp]
TempHandler[31]:invoke(): restoring a message context.....
TempHandler[31]:invoke(): ....restored message context.....
TempHandler[31]:invoke(): execution chain equivalency [true]
MessageContextSaveATest::compareHandlers:  class [org.apache.axis2.engine.MessageContextSaveATest$TempHandler] match 
MessageContextSaveATest::compareHandlers:  id [31] match
MessageContextSaveATest::compareHandlers:  class [org.apache.axis2.engine.MessageContextSaveATest$TempHandler] match 
MessageContextSaveATest::compareHandlers:  id [32] match
MessageContextSaveATest: comparePhases:  Phase1[extraPhase3] == Phase2[extraPhase3] - matched handler lists
TempHandler[31]:invoke(): executed phase list:  compare phases [true]
MessageContextSaveATest::compareHandlers:  class [org.apache.axis2.engine.MessageContextSaveATest$TempHandler] match 
MessageContextSaveATest::compareHandlers:  id [30] match
MessageContextSaveATest: comparePhases:  Phase1[extraPhase2] == Phase2[extraPhase2] - matched handler lists
TempHandler[31]:invoke(): executed phase list:  compare phases [true]
MessageContextSaveATest::compareHandlers:  class [org.apache.axis2.engine.MessageContextSaveATest$TempHandler] match 
MessageContextSaveATest::compareHandlers:  id [28] match
MessageContextSaveATest::compareHandlers:  class [org.apache.axis2.engine.MessageContextSaveATest$TempHandler] match 
MessageContextSaveATest::compareHandlers:  id [29] match
MessageContextSaveATest: comparePhases:  Phase1[extraPhase1] == Phase2[extraPhase1] - matched handler lists
TempHandler[31]:invoke(): executed phase list:  compare phases [true]
MessageContextSaveATest::compareHandlers:  class [org.apache.axis2.engine.MessageContextSaveATest$TempHandler] match 
MessageContextSaveATest::compareHandlers:  id [19] match
MessageContextSaveATest::compareHandlers:  class [org.apache.axis2.engine.MessageContextSaveATest$TempHandler] match 
MessageContextSaveATest::compareHandlers:  id [20] match
MessageContextSaveATest::compareHandlers:  class [org.apache.axis2.engine.MessageContextSaveATest$TempHandler] match 
MessageContextSaveATest::compareHandlers:  id [21] match
MessageContextSaveATest::compareHandlers:  class [org.apache.axis2.engine.MessageContextSaveATest$TempHandler] match 
MessageContextSaveATest::compareHandlers:  id [22] match
MessageContextSaveATest::compareHandlers:  class [org.apache.axis2.engine.MessageContextSaveATest$TempHandler] match 
MessageContextSaveATest::compareHandlers:  id [23] match
MessageContextSaveATest::compareHandlers:  class [org.apache.axis2.engine.MessageContextSaveATest$TempHandler] match 
MessageContextSaveATest::compareHandlers:  id [24] match
MessageContextSaveATest::compareHandlers:  class [org.apache.axis2.engine.MessageContextSaveATest$TempHandler] match 
MessageContextSaveATest::compareHandlers:  id [25] match
MessageContextSaveATest::compareHandlers:  class [org.apache.axis2.engine.MessageContextSaveATest$TempHandler] match 
MessageContextSaveATest::compareHandlers:  id [26] match
MessageContextSaveATest::compareHandlers:  class [org.apache.axis2.engine.MessageContextSaveATest$TempHandler] match 
MessageContextSaveATest::compareHandlers:  id [27] match
MessageContextSaveATest: comparePhases:  Phase1[lastPhase3] == Phase2[lastPhase3] - matched handler lists
TempHandler[31]:invoke(): executed phase list:  compare phases [true]
MessageContextSaveATest::compareHandlers:  class [org.apache.axis2.engine.MessageContextSaveATest$TempHandler] match 
MessageContextSaveATest::compareHandlers:  id [10] match
MessageContextSaveATest::compareHandlers:  class [org.apache.axis2.engine.MessageContextSaveATest$TempHandler] match 
MessageContextSaveATest::compareHandlers:  id [11] match
MessageContextSaveATest::compareHandlers:  class [org.apache.axis2.engine.MessageContextSaveATest$TempHandler] match 
MessageContextSaveATest::compareHandlers:  id [12] match
MessageContextSaveATest::compareHandlers:  class [org.apache.axis2.engine.MessageContextSaveATest$TempHandler] match 
MessageContextSaveATest::compareHandlers:  id [13] match
MessageContextSaveATest::compareHandlers:  class [org.apache.axis2.engine.MessageContextSaveATest$TempHandler] match 
MessageContextSaveATest::compareHandlers:  id [14] match
MessageContextSaveATest::compareHandlers:  class [org.apache.axis2.engine.MessageContextSaveATest$TempHandler] match 
MessageContextSaveATest::compareHandlers:  id [15] match
MessageContextSaveATest::compareHandlers:  class [org.apache.axis2.engine.MessageContextSaveATest$TempHandler] match 
MessageContextSaveATest::compareHandlers:  id [16] match
MessageContextSaveATest::compareHandlers:  class [org.apache.axis2.engine.MessageContextSaveATest$TempHandler] match 
MessageContextSaveATest::compareHandlers:  id [17] match
MessageContextSaveATest::compareHandlers:  class [org.apache.axis2.engine.MessageContextSaveATest$TempHandler] match 
MessageContextSaveATest::compareHandlers:  id [18] match
MessageContextSaveATest: comparePhases:  Phase1[middlePhase2] == Phase2[middlePhase2] - matched handler lists
TempHandler[31]:invoke(): executed phase list:  compare phases [true]
MessageContextSaveATest::compareHandlers:  class [org.apache.axis2.engine.MessageContextSaveATest$TempHandler] match 
MessageContextSaveATest::compareHandlers:  id [1] match
MessageContextSaveATest::compareHandlers:  class [org.apache.axis2.engine.MessageContextSaveATest$TempHandler] match 
MessageContextSaveATest::compareHandlers:  id [2] match
MessageContextSaveATest::compareHandlers:  class [org.apache.axis2.engine.MessageContextSaveATest$TempHandler] match 
MessageContextSaveATest::compareHandlers:  id [3] match
MessageContextSaveATest::compareHandlers:  class [org.apache.axis2.engine.MessageContextSaveATest$TempHandler] match 
MessageContextSaveATest::compareHandlers:  id [4] match
MessageContextSaveATest::compareHandlers:  class [org.apache.axis2.engine.MessageContextSaveATest$TempHandler] match 
MessageContextSaveATest::compareHandlers:  id [5] match
MessageContextSaveATest::compareHandlers:  class [org.apache.axis2.engine.MessageContextSaveATest$TempHandler] match 
MessageContextSaveATest::compareHandlers:  id [6] match
MessageContextSaveATest::compareHandlers:  class [org.apache.axis2.engine.MessageContextSaveATest$TempHandler] match 
MessageContextSaveATest::compareHandlers:  id [7] match
MessageContextSaveATest::compareHandlers:  class [org.apache.axis2.engine.MessageContextSaveATest$TempHandler] match 
MessageContextSaveATest::compareHandlers:  id [8] match
MessageContextSaveATest::compareHandlers:  class [org.apache.axis2.engine.MessageContextSaveATest$TempHandler] match 
MessageContextSaveATest::compareHandlers:  id [9] match
MessageContextSaveATest: comparePhases:  Phase1[beginPhase1] == Phase2[beginPhase1] - matched handler lists
TempHandler[31]:invoke(): executed phase list:  compare phases [true]
MessageContextSaveATest::compareHandlers:  class [org.apache.axis2.engine.MessageContextSaveATest$TempHandler] match 
MessageContextSaveATest::compareHandlers:  id [1] match
MessageContextSaveATest::compareHandlers:  class [org.apache.axis2.engine.MessageContextSaveATest$TempHandler] match 
MessageContextSaveATest::compareHandlers:  id [2] match
MessageContextSaveATest::compareHandlers:  class [org.apache.axis2.engine.MessageContextSaveATest$TempHandler] match 
MessageContextSaveATest::compareHandlers:  id [3] match
MessageContextSaveATest::compareHandlers:  class [org.apache.axis2.engine.MessageContextSaveATest$TempHandler] match 
MessageContextSaveATest::compareHandlers:  id [4] match
MessageContextSaveATest::compareHandlers:  class [org.apache.axis2.engine.MessageContextSaveATest$TempHandler] match 
MessageContextSaveATest::compareHandlers:  id [5] match
MessageContextSaveATest::compareHandlers:  class [org.apache.axis2.engine.MessageContextSaveATest$TempHandler] match 
MessageContextSaveATest::compareHandlers:  id [6] match
MessageContextSaveATest::compareHandlers:  class [org.apache.axis2.engine.MessageContextSaveATest$TempHandler] match 
MessageContextSaveATest::compareHandlers:  id [7] match
MessageContextSaveATest::compareHandlers:  class [org.apache.axis2.engine.MessageContextSaveATest$TempHandler] match 
MessageContextSaveATest::compareHandlers:  id [8] match
MessageContextSaveATest::compareHandlers:  class [org.apache.axis2.engine.MessageContextSaveATest$TempHandler] match 
MessageContextSaveATest::compareHandlers:  id [9] match
MessageContextSaveATest: comparePhases:  Phase1[beginPhase1] == Phase2[beginPhase1] - matched handler lists
MessageContextSaveATest::compareHandlers:  class [org.apache.axis2.engine.MessageContextSaveATest$TempHandler] match 
MessageContextSaveATest::compareHandlers:  id [10] match
MessageContextSaveATest::compareHandlers:  class [org.apache.axis2.engine.MessageContextSaveATest$TempHandler] match 
MessageContextSaveATest::compareHandlers:  id [11] match
MessageContextSaveATest::compareHandlers:  class [org.apache.axis2.engine.MessageContextSaveATest$TempHandler] match 
MessageContextSaveATest::compareHandlers:  id [12] match
MessageContextSaveATest::compareHandlers:  class [org.apache.axis2.engine.MessageContextSaveATest$TempHandler] match 
MessageContextSaveATest::compareHandlers:  id [13] match
MessageContextSaveATest::compareHandlers:  class [org.apache.axis2.engine.MessageContextSaveATest$TempHandler] match 
MessageContextSaveATest::compareHandlers:  id [14] match
MessageContextSaveATest::compareHandlers:  class [org.apache.axis2.engine.MessageContextSaveATest$TempHandler] match 
MessageContextSaveATest::compareHandlers:  id [15] match
MessageContextSaveATest::compareHandlers:  class [org.apache.axis2.engine.MessageContextSaveATest$TempHandler] match 
MessageContextSaveATest::compareHandlers:  id [16] match
MessageContextSaveATest::compareHandlers:  class [org.apache.axis2.engine.MessageContextSaveATest$TempHandler] match 
MessageContextSaveATest::compareHandlers:  id [17] match
MessageContextSaveATest::compareHandlers:  class [org.apache.axis2.engine.MessageContextSaveATest$TempHandler] match 
MessageContextSaveATest::compareHandlers:  id [18] match
MessageContextSaveATest: comparePhases:  Phase1[middlePhase2] == Phase2[middlePhase2] - matched handler lists
MessageContextSaveATest::compareHandlers:  class [org.apache.axis2.engine.MessageContextSaveATest$TempHandler] match 
MessageContextSaveATest::compareHandlers:  id [19] match
MessageContextSaveATest::compareHandlers:  class [org.apache.axis2.engine.MessageContextSaveATest$TempHandler] match 
MessageContextSaveATest::compareHandlers:  id [20] match
MessageContextSaveATest::compareHandlers:  class [org.apache.axis2.engine.MessageContextSaveATest$TempHandler] match 
MessageContextSaveATest::compareHandlers:  id [21] match
MessageContextSaveATest::compareHandlers:  class [org.apache.axis2.engine.MessageContextSaveATest$TempHandler] match 
MessageContextSaveATest::compareHandlers:  id [22] match
MessageContextSaveATest::compareHandlers:  class [org.apache.axis2.engine.MessageContextSaveATest$TempHandler] match 
MessageContextSaveATest::compareHandlers:  id [23] match
MessageContextSaveATest::compareHandlers:  class [org.apache.axis2.engine.MessageContextSaveATest$TempHandler] match 
MessageContextSaveATest::compareHandlers:  id [24] match
MessageContextSaveATest::compareHandlers:  class [org.apache.axis2.engine.MessageContextSaveATest$TempHandler] match 
MessageContextSaveATest::compareHandlers:  id [25] match
MessageContextSaveATest::compareHandlers:  class [org.apache.axis2.engine.MessageContextSaveATest$TempHandler] match 
MessageContextSaveATest::compareHandlers:  id [26] match
MessageContextSaveATest::compareHandlers:  class [org.apache.axis2.engine.MessageContextSaveATest$TempHandler] match 
MessageContextSaveATest::compareHandlers:  id [27] match
MessageContextSaveATest: comparePhases:  Phase1[lastPhase3] == Phase2[lastPhase3] - matched handler lists
MessageContextSaveATest::compareHandlers:  class [org.apache.axis2.engine.MessageContextSaveATest$TempHandler] match 
MessageContextSaveATest::compareHandlers:  id [28] match
MessageContextSaveATest::compareHandlers:  class [org.apache.axis2.engine.MessageContextSaveATest$TempHandler] match 
MessageContextSaveATest::compareHandlers:  id [29] match
MessageContextSaveATest: comparePhases:  Phase1[extraPhase1] == Phase2[extraPhase1] - matched handler lists
MessageContextSaveATest::compareHandlers:  class [org.apache.axis2.engine.MessageContextSaveATest$TempHandler] match 
MessageContextSaveATest::compareHandlers:  id [30] match
MessageContextSaveATest: comparePhases:  Phase1[extraPhase2] == Phase2[extraPhase2] - matched handler lists
MessageContextSaveATest::compareHandlers:  class [org.apache.axis2.engine.MessageContextSaveATest$TempHandler] match 
MessageContextSaveATest::compareHandlers:  id [31] match
MessageContextSaveATest::compareHandlers:  class [org.apache.axis2.engine.MessageContextSaveATest$TempHandler] match 
MessageContextSaveATest::compareHandlers:  id [32] match
MessageContextSaveATest: comparePhases:  Phase1[extraPhase3] == Phase2[extraPhase3] - matched handler lists
MessageContextSaveATest::compareHandlers:  class [org.apache.axis2.engine.MessageContextSaveATest$TempHandler] match 
MessageContextSaveATest::compareHandlers:  id [33] match
MessageContextSaveATest::compareHandlers:  class [org.apache.axis2.engine.MessageContextSaveATest$TempHandler] match 
MessageContextSaveATest::compareHandlers:  id [34] match
MessageContextSaveATest::compareHandlers:  class [org.apache.axis2.engine.MessageContextSaveATest$TempHandler] match 
MessageContextSaveATest::compareHandlers:  id [35] match
MessageContextSaveATest: comparePhases:  Phase1[extraPhase4] == Phase2[extraPhase4] - matched handler lists
MessageContextSaveATest:testReceive(): resume - - engine.resume(mc) - - - - - - - - - - - - - - - -
TempHandler[31]:invoke(): pause = [false]
TempHandler[31]:invoke(): executedHandlers.add(31)
TempHandler[32]:invoke(): pause = [false]
TempHandler[32]:invoke(): executedHandlers.add(32)
TempHandler[33]:invoke(): pause = [false]
TempHandler[33]:invoke(): executedHandlers.add(33)
TempHandler[34]:invoke(): pause = [false]
TempHandler[34]:invoke(): executedHandlers.add(34)
TempHandler[35]:invoke(): pause = [false]
TempHandler[35]:invoke(): executedHandlers.add(35)
MessageContextSaveATest::compareHandlers:  class [org.apache.axis2.engine.MessageContextSaveATest$TempHandler] match 
MessageContextSaveATest::compareHandlers:  id [1] match
MessageContextSaveATest::compareHandlers:  class [org.apache.axis2.engine.MessageContextSaveATest$TempHandler] match 
MessageContextSaveATest::compareHandlers:  id [2] match
MessageContextSaveATest::compareHandlers:  class [org.apache.axis2.engine.MessageContextSaveATest$TempHandler] match 
MessageContextSaveATest::compareHandlers:  id [3] match
MessageContextSaveATest::compareHandlers:  class [org.apache.axis2.engine.MessageContextSaveATest$TempHandler] match 
MessageContextSaveATest::compareHandlers:  id [4] match
MessageContextSaveATest::compareHandlers:  class [org.apache.axis2.engine.MessageContextSaveATest$TempHandler] match 
MessageContextSaveATest::compareHandlers:  id [5] match
MessageContextSaveATest::compareHandlers:  class [org.apache.axis2.engine.MessageContextSaveATest$TempHandler] match 
MessageContextSaveATest::compareHandlers:  id [6] match
MessageContextSaveATest::compareHandlers:  class [org.apache.axis2.engine.MessageContextSaveATest$TempHandler] match 
MessageContextSaveATest::compareHandlers:  id [7] match
MessageContextSaveATest::compareHandlers:  class [org.apache.axis2.engine.MessageContextSaveATest$TempHandler] match 
MessageContextSaveATest::compareHandlers:  id [8] match
MessageContextSaveATest::compareHandlers:  class [org.apache.axis2.engine.MessageContextSaveATest$TempHandler] match 
MessageContextSaveATest::compareHandlers:  id [9] match
MessageContextSaveATest: comparePhases:  Phase1[beginPhase1] == Phase2[beginPhase1] - matched handler lists
MessageContextSaveATest::compareHandlers:  class [org.apache.axis2.engine.MessageContextSaveATest$TempHandler] match 
MessageContextSaveATest::compareHandlers:  id [10] match
MessageContextSaveATest::compareHandlers:  class [org.apache.axis2.engine.MessageContextSaveATest$TempHandler] match 
MessageContextSaveATest::compareHandlers:  id [11] match
MessageContextSaveATest::compareHandlers:  class [org.apache.axis2.engine.MessageContextSaveATest$TempHandler] match 
MessageContextSaveATest::compareHandlers:  id [12] match
MessageContextSaveATest::compareHandlers:  class [org.apache.axis2.engine.MessageContextSaveATest$TempHandler] match 
MessageContextSaveATest::compareHandlers:  id [13] match
MessageContextSaveATest::compareHandlers:  class [org.apache.axis2.engine.MessageContextSaveATest$TempHandler] match 
MessageContextSaveATest::compareHandlers:  id [14] match
MessageContextSaveATest::compareHandlers:  class [org.apache.axis2.engine.MessageContextSaveATest$TempHandler] match 
MessageContextSaveATest::compareHandlers:  id [15] match
MessageContextSaveATest::compareHandlers:  class [org.apache.axis2.engine.MessageContextSaveATest$TempHandler] match 
MessageContextSaveATest::compareHandlers:  id [16] match
MessageContextSaveATest::compareHandlers:  class [org.apache.axis2.engine.MessageContextSaveATest$TempHandler] match 
MessageContextSaveATest::compareHandlers:  id [17] match
MessageContextSaveATest::compareHandlers:  class [org.apache.axis2.engine.MessageContextSaveATest$TempHandler] match 
MessageContextSaveATest::compareHandlers:  id [18] match
MessageContextSaveATest: comparePhases:  Phase1[middlePhase2] == Phase2[middlePhase2] - matched handler lists
MessageContextSaveATest::compareHandlers:  class [org.apache.axis2.engine.MessageContextSaveATest$TempHandler] match 
MessageContextSaveATest::compareHandlers:  id [19] match
MessageContextSaveATest::compareHandlers:  class [org.apache.axis2.engine.MessageContextSaveATest$TempHandler] match 
MessageContextSaveATest::compareHandlers:  id [20] match
MessageContextSaveATest::compareHandlers:  class [org.apache.axis2.engine.MessageContextSaveATest$TempHandler] match 
MessageContextSaveATest::compareHandlers:  id [21] match
MessageContextSaveATest::compareHandlers:  class [org.apache.axis2.engine.MessageContextSaveATest$TempHandler] match 
MessageContextSaveATest::compareHandlers:  id [22] match
MessageContextSaveATest::compareHandlers:  class [org.apache.axis2.engine.MessageContextSaveATest$TempHandler] match 
MessageContextSaveATest::compareHandlers:  id [23] match
MessageContextSaveATest::compareHandlers:  class [org.apache.axis2.engine.MessageContextSaveATest$TempHandler] match 
MessageContextSaveATest::compareHandlers:  id [24] match
MessageContextSaveATest::compareHandlers:  class [org.apache.axis2.engine.MessageContextSaveATest$TempHandler] match 
MessageContextSaveATest::compareHandlers:  id [25] match
MessageContextSaveATest::compareHandlers:  class [org.apache.axis2.engine.MessageContextSaveATest$TempHandler] match 
MessageContextSaveATest::compareHandlers:  id [26] match
MessageContextSaveATest::compareHandlers:  class [org.apache.axis2.engine.MessageContextSaveATest$TempHandler] match 
MessageContextSaveATest::compareHandlers:  id [27] match
MessageContextSaveATest: comparePhases:  Phase1[lastPhase3] == Phase2[lastPhase3] - matched handler lists
MessageContextSaveATest::compareHandlers:  class [org.apache.axis2.engine.MessageContextSaveATest$TempHandler] match 
MessageContextSaveATest::compareHandlers:  id [28] match
MessageContextSaveATest::compareHandlers:  class [org.apache.axis2.engine.MessageContextSaveATest$TempHandler] match 
MessageContextSaveATest::compareHandlers:  id [29] match
MessageContextSaveATest: comparePhases:  Phase1[extraPhase1] == Phase2[extraPhase1] - matched handler lists
MessageContextSaveATest::compareHandlers:  class [org.apache.axis2.engine.MessageContextSaveATest$TempHandler] match 
MessageContextSaveATest::compareHandlers:  id [30] match
MessageContextSaveATest: comparePhases:  Phase1[extraPhase2] == Phase2[extraPhase2] - matched handler lists
MessageContextSaveATest::compareHandlers:  class [org.apache.axis2.engine.MessageContextSaveATest$TempHandler] match 
MessageContextSaveATest::compareHandlers:  id [31] match
MessageContextSaveATest::compareHandlers:  class [org.apache.axis2.engine.MessageContextSaveATest$TempHandler] match 
MessageContextSaveATest::compareHandlers:  id [32] match
MessageContextSaveATest: comparePhases:  Phase1[extraPhase3] == Phase2[extraPhase3] - matched handler lists
MessageContextSaveATest::compareHandlers:  class [org.apache.axis2.engine.MessageContextSaveATest$TempHandler] match 
MessageContextSaveATest::compareHandlers:  id [33] match
MessageContextSaveATest::compareHandlers:  class [org.apache.axis2.engine.MessageContextSaveATest$TempHandler] match 
MessageContextSaveATest::compareHandlers:  id [34] match
MessageContextSaveATest::compareHandlers:  class [org.apache.axis2.engine.MessageContextSaveATest$TempHandler] match 
MessageContextSaveATest::compareHandlers:  id [35] match
MessageContextSaveATest: comparePhases:  Phase1[extraPhase4] == Phase2[extraPhase4] - matched handler lists
MessageContextSaveATest:testSimpleMC(): start - - - - - - - - - - - - - - - -
MessageContextSaveATest:testSimpleMC(): temp file = [Simple37498.tmp]
MessageContextSaveATest:testSimpleMC(): saving message context.....
MessageContextSaveATest:testSimpleMC(): ....saved message context.....
MessageContextSaveATest:testSimpleMC(): file size after save [3298]   temp file = [Simple37498.tmp]
MessageContextSaveATest:testSimpleMC(): restoring a message context.....
MessageContextSaveATest:testSimpleMC(): ....restored message context.....
MessageContextSaveATest:testSimpleMC(): execution chain equivalency [true]
MessageContextSaveATest:testSimpleMC(): end - - - - - - - - - - - - - - - -
MessageContextSaveATest:testMcProperties(): start - - - - - - - - - - - - - - - -
MessageContextSaveATest:testMcProperties(): temp file = [McProps37499.tmp]
MessageContextSaveATest:testMcProperties(): saving message context.....
MessageContextSaveATest:testMcProperties(): ....saved message context.....
MessageContextSaveATest:testMcProperties(): file size after save [3547]   temp file = [McProps37499.tmp]
MessageContextSaveATest:testMcProperties(): restoring a message context.....
MessageContextSaveATest:testMcProperties(): ....restored message context.....
MessageContextSaveATest:testMcProperties(): execution chain equivalency [true]
MessageContextSaveATest:testMcProperties(): end - - - - - - - - - - - - - - - -
MessageContextSaveATest:testMapping(): start - - - - - - - - - - - - - - - -
MessageContextSaveATest:testMapping(): - - - - - original message contexts table- - - - - - - - - - -
MessageContextSaveATest: showMcMap:  Message context   ID[urn:uuid:8368CC4F899BE8C81C1173802157763]   Key Label [In]
MessageContextSaveATest:testMapping(): temp file = [McMappings37500.tmp]
MessageContextSaveATest:testMapping(): saving message context.....
MessageContextSaveATest:testMapping(): ....saved message context.....
MessageContextSaveATest:testMapping(): file size after save [8506]   temp file = [McMappings37500.tmp]
MessageContextSaveATest:testMapping(): restoring a message context.....
MessageContextSaveATest:testMapping(): ....restored message context.....
MessageContextSaveATest:testMapping(): - - - - - restored message contexts table- - - - - - - - - - -
MessageContextSaveATest: showMcMap:  Message context   ID[urn:uuid:8368CC4F899BE8C81C1173802157763]   Key Label [In]
MessageContextSaveATest:testMapping(): end - - - - - - - - - - - - - - - -
[surefire] Tests run: 4, Failures: 0, Errors: 0, Time elapsed: 0.15 sec
[surefire] Running org.apache.axis2.engine.OperationContextSaveTest
OperationContextSaveTest:testSaveAndRestore():  BEGIN ---------------
OperationContextSaveTest:testSaveAndRestore(): temp file = [OpCtxSave37501.tmp]
OperationContextSaveTest:testSaveAndRestore(): saving .....
OperationContextSaveTest:testSaveAndRestore(): ....save operation completed.....
OperationContextSaveTest:testSaveAndRestore(): file size after save [6965]   temp file = [OpCtxSave37501.tmp]
OperationContextSaveTest:testSaveAndRestore(): restoring .....
OperationContextSaveTest:testSaveAndRestore(): ....restored operation completed.....
OperationContextSaveTest:testSaveAndRestore():  OperationContext equivalency [true]
OperationContextSaveTest:testSaveAndRestore():  ServiceContext equivalency [true]
OperationContextSaveTest:testSaveAndRestore():  ServiceGroupContext equivalency [true]
OperationContextSaveTest:testSaveAndRestore():  END ---------------
[surefire] Tests run: 1, Failures: 0, Errors: 0, Time elapsed: 0.028 sec
[surefire] Running org.apache.axis2.engine.ModuleConfigTest
[surefire] Tests run: 2, Failures: 0, Errors: 0, Time elapsed: 0.019 sec
[surefire] Running org.apache.axis2.engine.ObjectSaveTest
ObjectSaveTest:testObjectSerializable():  BEGIN ---------------
ObjectSaveTest:testObjectSerializable(): temp file = [objectTest37502.tmp]
ObjectSaveTest:testObjectSerializable(): saving .....
ObjectSaveTest:testObjectSerializable(): ....save operation completed.....
ObjectSaveTest:testObjectSerializable(): file size after save [265]   temp file = [objectTest37502.tmp]
ObjectSaveTest:testObjectSerializable(): restoring .....
ObjectSaveTest:testObjectSerializable(): ....restored operation completed.....
ObjectSaveTest:testObjectSerializable():  END ---------------
ObjectSaveTest:testObjectNotSerializable():  BEGIN ---------------
ObjectSaveTest:testObjectNotSerializable(): temp file = [objectTest37503.tmp]
ObjectSaveTest:testObjectNotSerializable(): saving .....
ObjectSaveTest:testObjectSerializable(): restoring .....
ObjectSaveTest:testObjectNotSerializable(): ....restored operation completed.....
ObjectSaveTest:testObjectNotSerializable():  END ---------------
ObjectSaveTest:testArrayList():  BEGIN ---------------
ObjectSaveTest:testArrayList(): temp file = [arraylistTest37504.tmp]
ObjectSaveTest:testArrayList(): saving .....
ObjectSaveTest:testArrayList(): ....save operation completed.....
ObjectSaveTest:testArrayList(): file size after save [199]   temp file = [arraylistTest37504.tmp]
ObjectSaveTest:testArrayList(): restoring .....
ObjectSaveTest:testArrayList(): ....restored operation completed.....
ObjectSaveTest:testArrayList():  END ---------------
ObjectSaveTest:testHashMap():  BEGIN ---------------
ObjectSaveTest:testHashMap(): temp file = [hashmapTest37505.tmp]
ObjectSaveTest:testHashMap(): saving .....
ObjectSaveTest:testHashMap(): ....save operation completed.....
ObjectSaveTest:testHashMap(): file size after save [253]   temp file = [hashmapTest37505.tmp]
ObjectSaveTest:testHashMap(): restoring .....
ObjectSaveTest:testHashMap(): ....restored operation completed.....
ObjectSaveTest:testHashMap():  END ---------------
ObjectSaveTest:testLinkedList():  BEGIN ---------------
ObjectSaveTest:testLinkedList(): temp file = [linkedlistTest37506.tmp]
ObjectSaveTest:testLinkedList(): saving .....
ObjectSaveTest:testLinkedList(): ....save operation completed.....
ObjectSaveTest:testLinkedList(): file size after save [200]   temp file = [linkedlistTest37506.tmp]
ObjectSaveTest:testLinkedList(): restoring .....
ObjectSaveTest:testLinkedList(): ....restored operation completed.....
ObjectSaveTest:testLinkedList():  END ---------------
[surefire] Tests run: 5, Failures: 0, Errors: 0, Time elapsed: 0.064 sec
[surefire] Running org.apache.axis2.engine.MessageContextChangeTest
[surefire] Tests run: 1, Failures: 0, Errors: 0, Time elapsed: 0.003 sec
[surefire] Running org.apache.axis2.engine.MessageContextSaveBTest
original properties ======================================
original properties: key-value pair [serviceKey2][serviceValue2_before]
original properties: key-value pair [serviceKey3][serviceValue3_before]
original properties: key-value pair [serviceKey1][serviceValue1_before]
original properties ======================================
MessageContextSaveBTest: testServiceProperties(): start - - engine.receive(mc) - - - - - - - - - - - - - - - -
TempHandler[1]:invoke(): executedHandlers.add(1)
HandlerMCS[2]:invoke(): pause = [true]
HandlerMCS[2]:invoke(): msgContext.pause()
HandlerMCS[2]:invoke(): temp file = [mcSave37507.tmp]
HandlerMCS[2]:invoke(): saving message context.....
HandlerMCS[2]:invoke(): ....saved message context.....
HandlerMCS[2]:invoke(): file size after save [11197]   temp file = [mcSave37507.tmp]
HandlerMCS[2]:invoke(): restoring a message context.....
HandlerMCS[2]:invoke(): ....restored message context.....
restored properties ======================================
restored properties: key-value pair [serviceKey2][serviceValue2_before]
restored properties: key-value pair [Property.ID[1].2][ServiceLevelSetting[2]]
restored properties: key-value pair [serviceKey3][serviceValue3_before]
restored properties: key-value pair [serviceKey1][serviceValue1_before]
restored properties: key-value pair [Property.ID[1].1][ServiceLevelSetting[1]]
restored properties ======================================
MessageContextSaveBTest: testServiceProperties(): resume - - engine.resume(mc) - - - - - - - - - - - - - - - -
HandlerMCS[2]:invoke(): pause = [false]
HandlerMCS[2]:invoke(): executedHandlers.add(2)
TempHandler[3]:invoke(): executedHandlers.add(3)
restored service properties post-resume ======================================
restored service properties post-resume: key-value pair [serviceKey2][serviceValue2_postReceive]
restored service properties post-resume: key-value pair [Property.ID[1].2][ServiceLevelSetting[2]]
restored service properties post-resume: key-value pair [Property.ID[3].2][ServiceLevelSetting[2]]
restored service properties post-resume: key-value pair [serviceKey3][serviceValue3_postReceive]
restored service properties post-resume: key-value pair [Property.ID[3].1][ServiceLevelSetting[1]]
restored service properties post-resume: key-value pair [serviceKey1][serviceValue1_postReceive]
restored service properties post-resume: key-value pair [Property.ID[1].1][ServiceLevelSetting[1]]
restored service properties post-resume ======================================
service properties from other active MsgCtx ======================================
service properties from other active MsgCtx: key-value pair [serviceKey2][serviceValue2_postReceive]
service properties from other active MsgCtx: key-value pair [Property.ID[1].2][ServiceLevelSetting[2]]
service properties from other active MsgCtx: key-value pair [Property.ID[3].2][ServiceLevelSetting[2]]
service properties from other active MsgCtx: key-value pair [Property.ID[3].1][ServiceLevelSetting[1]]
service properties from other active MsgCtx: key-value pair [serviceKey3][serviceValue3_postReceive]
service properties from other active MsgCtx: key-value pair [Property.ID[1].1][ServiceLevelSetting[1]]
service properties from other active MsgCtx: key-value pair [serviceKey1][serviceValue1_postReceive]
service properties from other active MsgCtx ======================================
[surefire] Tests run: 1, Failures: 0, Errors: 0, Time elapsed: 0.042 sec
[surefire] Running org.apache.axis2.dispatchers.RequestURIBasedServiceDispatcherTest
[surefire] Tests run: 1, Failures: 0, Errors: 0, Time elapsed: 0.005 sec
[surefire] Running org.apache.axis2.dispatchers.SOAPMessageBodyBasedOperationDispatcherTest
[surefire] Tests run: 1, Failures: 0, Errors: 0, Time elapsed: 0.005 sec
[surefire] Running org.apache.axis2.dispatchers.RelatesToBasedServiceDispatcherTest
[surefire] Tests run: 1, Failures: 0, Errors: 0, Time elapsed: 0.005 sec
[surefire] Running org.apache.axis2.dispatchers.RequestURIBasedOperationDispatcherTest
[surefire] Tests run: 1, Failures: 0, Errors: 0, Time elapsed: 0.005 sec
[surefire] Running org.apache.axis2.dispatchers.RelatesToBasedOperationDispatcherTest
[surefire] Tests run: 1, Failures: 0, Errors: 0, Time elapsed: 0.057 sec
[surefire] Running org.apache.axis2.dispatchers.SOAPMessageBodyBasedServiceDispatcherTest
[surefire] Tests run: 1, Failures: 0, Errors: 0, Time elapsed: 0.004 sec
[surefire] Running org.apache.axis2.dispatchers.ActionBasedOperationDispatchTest
[surefire] Tests run: 1, Failures: 0, Errors: 0, Time elapsed: 0.004 sec
[surefire] Running org.apache.axis2.context.OperationContextTest
[surefire] Tests run: 1, Failures: 0, Errors: 0, Time elapsed: 0.002 sec
[surefire] Running org.apache.axis2.context.ContextHierarchyTest
[surefire] Tests run: 2, Failures: 0, Errors: 0, Time elapsed: 0.002 sec
[surefire] Running org.apache.axis2.description.WSDLToAllServicesBuilderTest
[SimpleHTTPServer] Stop called
[SimpleHTTPServer] Stop called
[surefire] Tests run: 2, Failures: 0, Errors: 0, Time elapsed: 3.23 sec
[surefire] Running org.apache.axis2.description.RegistryTest
[surefire] Tests run: 5, Failures: 0, Errors: 0, Time elapsed: 0.004 sec
[surefire] Running org.apache.axis2.util.ThreadContextMigratorTest
[surefire] Tests run: 2, Failures: 0, Errors: 0, Time elapsed: 0.007 sec
[surefire] Running org.apache.axis2.addressing.EndpointReferenceHelperTest
[surefire] Tests run: 2, Failures: 0, Errors: 0, Time elapsed: 0.01 sec
[surefire] Running org.apache.axis2.addressing.miheaders.RelatesToTest
[surefire] Tests run: 3, Failures: 0, Errors: 0, Time elapsed: 0.003 sec
[surefire] Running org.apache.axis2.addressing.wsdl.WSDL11ActionHelperTest
[surefire] Tests run: 8, Failures: 0, Errors: 0, Time elapsed: 0.876 sec
[surefire] Running org.apache.axis2.addressing.EndpointReferenceTypeTest
[surefire] Tests run: 5, Failures: 0, Errors: 0, Time elapsed: 0.01 sec
[surefire] Running org.apache.axis2.addressing.AddressingHelperTest
[surefire] Tests run: 6, Failures: 0, Errors: 0, Time elapsed: 0.005 sec
[surefire] Running org.apache.axis2.transport.tcp.TCPTransportTest
[surefire] Tests run: 1, Failures: 0, Errors: 0, Time elapsed: 0.002 sec
[surefire] Running org.apache.axis2.misc.MiscTest
[surefire] Tests run: 1, Failures: 0, Errors: 0, Time elapsed: 0.001 sec
[INFO] [jar:jar]
[INFO] Building jar: /export/home/illsleyd/continuum/continuum-1.0.3/apps/continuum/working-directory/61/modules/kernel/target/axis2-kernel-SNAPSHOT.jar
[INFO] [install:install]
[INFO] Installing /export/home/illsleyd/continuum/continuum-1.0.3/apps/continuum/working-directory/61/modules/kernel/target/axis2-kernel-SNAPSHOT.jar to /export/home/illsleyd/.m2/repository/org/apache/axis2/axis2-kernel/SNAPSHOT/axis2-kernel-SNAPSHOT.jar
[INFO] ----------------------------------------------------------------------------
[INFO] Building Apache Axis 2.0 - Data Binding
[INFO]    task-segment: [clean, install]
[INFO] ----------------------------------------------------------------------------
[INFO] [clean:clean]
[INFO] Deleting directory /export/home/illsleyd/continuum/continuum-1.0.3/apps/continuum/working-directory/61/modules/adb/target
[INFO] Deleting directory /export/home/illsleyd/continuum/continuum-1.0.3/apps/continuum/working-directory/61/modules/adb/target/classes
[INFO] Deleting directory /export/home/illsleyd/continuum/continuum-1.0.3/apps/continuum/working-directory/61/modules/adb/target/test-classes
[INFO] [resources:resources]
[INFO] Using default encoding to copy filtered resources.
[INFO] [compiler:compile]
[INFO] Compiling 66 source files to /export/home/illsleyd/continuum/continuum-1.0.3/apps/continuum/working-directory/61/modules/adb/target/classes
[INFO] [resources:testResources]
[INFO] Using default encoding to copy filtered resources.
[INFO] [compiler:testCompile]
[INFO] Compiling 9 source files to /export/home/illsleyd/continuum/continuum-1.0.3/apps/continuum/working-directory/61/modules/adb/target/test-classes
[INFO] [surefire:test]
[INFO] Setting reports dir: /export/home/illsleyd/continuum/continuum-1.0.3/apps/continuum/working-directory/61/modules/adb/target/surefire-reports

-------------------------------------------------------
 T E S T S
-------------------------------------------------------
[surefire] Running org.apache.axis2.databinding.utils.NamedStaxOMBuilderTest
log4j:WARN No appenders could be found for logger (org.apache.axiom.om.util.StAXUtils).
log4j:WARN Please initialize the log4j system properly.
[surefire] Tests run: 2, Failures: 0, Errors: 0, Time elapsed: 0.233 sec
[surefire] Running org.apache.axis2.databinding.utils.SimpleElementReaderStateMachineTest
[surefire] Tests run: 3, Failures: 0, Errors: 0, Time elapsed: 0.009 sec
[surefire] Running org.apache.axis2.databinding.utils.reader.ADBXMLStreamReaderTest
[surefire] Tests run: 15, Failures: 0, Errors: 0, Time elapsed: 0.456 sec
[surefire] Running org.apache.axis2.databinding.utils.SimpleArrayReaderStateMachineTest
[surefire] Tests run: 4, Failures: 0, Errors: 0, Time elapsed: 0.006 sec
[surefire] Running org.apache.axis2.databinding.ADBSOAPModelBuilderTest
EVENT:[START_DOCUMENT]  [<?xml version='1.0' encoding='utf-8' standalone='yes'?>]
EVENT:[START_ELEMENT]  [<['http://schemas.xmlsoap.org/soap/envelope/']:soapenv:Envelope xmlns:soapenv='http://schemas.xmlsoap.org/soap/envelope/'>]
EVENT:[START_ELEMENT]  [<['http://schemas.xmlsoap.org/soap/envelope/']:soapenv:Header xmlns:soapenv='http://schemas.xmlsoap.org/soap/envelope/'>]
EVENT:[END_ELEMENT]  [</['http://schemas.xmlsoap.org/soap/envelope/']:soapenv:Header>]
EVENT:[START_ELEMENT]  [<['http://schemas.xmlsoap.org/soap/envelope/']:soapenv:Body xmlns:soapenv='http://schemas.xmlsoap.org/soap/envelope/'>]
EVENT:[START_ELEMENT]  [<['http://www.wso2.com/types']:ns1:createAccountRequest xmlns:ns1='http://www.wso2.com/types'>]
EVENT:[START_ELEMENT]  [<['http://www.wso2.com/types']::clientinfo xmlns:='http://www.wso2.com/types'>]
EVENT:[START_ELEMENT]  [<['http://www.wso2.com/types']::name xmlns:='http://www.wso2.com/types'>]
EVENT:[CHARACTERS]  [bob]
EVENT:[END_ELEMENT]  [</['http://www.wso2.com/types']::name>]
EVENT:[START_ELEMENT]  [<['http://www.wso2.com/types']::ssn xmlns:='http://www.wso2.com/types'>]
EVENT:[CHARACTERS]  [123456789]
EVENT:[END_ELEMENT]  [</['http://www.wso2.com/types']::ssn>]
EVENT:[END_ELEMENT]  [</['http://www.wso2.com/types']::clientinfo>]
EVENT:[START_ELEMENT]  [<password xmlns:=''>]
EVENT:[CHARACTERS]  [passwd]
EVENT:[END_ELEMENT]  [</password>]
EVENT:[END_ELEMENT]  [</['http://www.wso2.com/types']:ns1:createAccountRequest>]
EVENT:[END_ELEMENT]  [</['http://schemas.xmlsoap.org/soap/envelope/']:soapenv:Body>]
EVENT:[END_ELEMENT]  [</['http://schemas.xmlsoap.org/soap/envelope/']:soapenv:Envelope>]
EVENT:[START_DOCUMENT]  [<?xml version='1.0' encoding='utf-8' standalone='yes'?>]
EVENT:[START_ELEMENT]  [<['http://schemas.xmlsoap.org/soap/envelope/']:soapenv:Envelope xmlns:soapenv='http://schemas.xmlsoap.org/soap/envelope/'>]
EVENT:[START_ELEMENT]  [<['http://schemas.xmlsoap.org/soap/envelope/']:soapenv:Header xmlns:soapenv='http://schemas.xmlsoap.org/soap/envelope/'>]
EVENT:[END_ELEMENT]  [</['http://schemas.xmlsoap.org/soap/envelope/']:soapenv:Header>]
EVENT:[START_ELEMENT]  [<['http://schemas.xmlsoap.org/soap/envelope/']:soapenv:Body xmlns:soapenv='http://schemas.xmlsoap.org/soap/envelope/'>]
EVENT:[START_ELEMENT]  [<['http://www.wso2.com/types']:ns1:createAccountRequest xmlns:ns1='http://www.wso2.com/types'>]
EVENT:[START_ELEMENT]  [<['http://www.wso2.com/types']:clientinfo xmlns:='http://www.wso2.com/types'>]
EVENT:[START_ELEMENT]  [<['http://www.wso2.com/types']::name xmlns:='http://www.wso2.com/types'>]
EVENT:[CHARACTERS]  [bob]
EVENT:[END_ELEMENT]  [</['http://www.wso2.com/types']::name>]
EVENT:[START_ELEMENT]  [<['http://www.wso2.com/types']::ssn xmlns:='http://www.wso2.com/types'>]
EVENT:[CHARACTERS]  [123456789]
EVENT:[END_ELEMENT]  [</['http://www.wso2.com/types']::ssn>]
EVENT:[END_ELEMENT]  [</['http://www.wso2.com/types']:clientinfo>]
EVENT:[START_ELEMENT]  [<:password xmlns:=''>]
EVENT:[CHARACTERS]  [passwd]
EVENT:[END_ELEMENT]  [</:password>]
EVENT:[END_ELEMENT]  [</['http://www.wso2.com/types']:ns1:createAccountRequest>]
EVENT:[END_ELEMENT]  [</['http://schemas.xmlsoap.org/soap/envelope/']:soapenv:Body>]
EVENT:[END_ELEMENT]  [</['http://schemas.xmlsoap.org/soap/envelope/']:soapenv:Envelope>]
EVENT:[START_DOCUMENT]  [<?xml version='1.0' encoding='utf-8' standalone='no'?>]
EVENT:[START_ELEMENT]  [<['http://schemas.xmlsoap.org/soap/envelope/']:soapenv:Envelope xmlns:soapenv='http://schemas.xmlsoap.org/soap/envelope/'>]
EVENT:[START_ELEMENT]  [<['http://schemas.xmlsoap.org/soap/envelope/']:soapenv:Body>]
EVENT:[START_ELEMENT]  [<['http://www.wso2.com/types']:ns1:createAccountRequest xmlns:ns1='http://www.wso2.com/types'>]
EVENT:[START_ELEMENT]  [<['http://www.wso2.com/types']:clientinfo xmlns='http://www.wso2.com/types'>]
EVENT:[START_ELEMENT]  [<['http://www.wso2.com/types']:name>]
EVENT:[CHARACTERS]  [bob]
EVENT:[END_ELEMENT]  [</['http://www.wso2.com/types']:name>]
EVENT:[START_ELEMENT]  [<['http://www.wso2.com/types']:ssn>]
EVENT:[CHARACTERS]  [123456789]
EVENT:[END_ELEMENT]  [</['http://www.wso2.com/types']:ssn>]
EVENT:[END_ELEMENT]  [</['http://www.wso2.com/types']:clientinfo>]
EVENT:[START_ELEMENT]  [<password>]
EVENT:[CHARACTERS]  [passwd]
EVENT:[END_ELEMENT]  [</password>]
EVENT:[END_ELEMENT]  [</['http://www.wso2.com/types']:ns1:createAccountRequest>]
EVENT:[END_ELEMENT]  [</['http://schemas.xmlsoap.org/soap/envelope/']:soapenv:Body>]
EVENT:[END_ELEMENT]  [</['http://schemas.xmlsoap.org/soap/envelope/']:soapenv:Envelope>]
[surefire] Tests run: 5, Failures: 0, Errors: 0, Time elapsed: 0.12 sec
[INFO] [jar:jar]
[INFO] Building jar: /export/home/illsleyd/continuum/continuum-1.0.3/apps/continuum/working-directory/61/modules/adb/target/axis2-adb-SNAPSHOT.jar
[INFO] [install:install]
[INFO] Installing /export/home/illsleyd/continuum/continuum-1.0.3/apps/continuum/working-directory/61/modules/adb/target/axis2-adb-SNAPSHOT.jar to /export/home/illsleyd/.m2/repository/org/apache/axis2/axis2-adb/SNAPSHOT/axis2-adb-SNAPSHOT.jar
[INFO] ----------------------------------------------------------------------------
[INFO] Building Apache Axis 2.0 - Code Generation
[INFO]    task-segment: [clean, install]
[INFO] ----------------------------------------------------------------------------
[INFO] [clean:clean]
[INFO] Deleting directory /export/home/illsleyd/continuum/continuum-1.0.3/apps/continuum/working-directory/61/modules/codegen/target
[INFO] Deleting directory /export/home/illsleyd/continuum/continuum-1.0.3/apps/continuum/working-directory/61/modules/codegen/target/classes
[INFO] Deleting directory /export/home/illsleyd/continuum/continuum-1.0.3/apps/continuum/working-directory/61/modules/codegen/target/test-classes
[INFO] [resources:resources]
[INFO] Using default encoding to copy filtered resources.
[INFO] [compiler:compile]
[INFO] Compiling 69 source files to /export/home/illsleyd/continuum/continuum-1.0.3/apps/continuum/working-directory/61/modules/codegen/target/classes
[INFO] [resources:testResources]
[INFO] Using default encoding to copy filtered resources.
[INFO] [compiler:testCompile]
[INFO] Compiling 2 source files to /export/home/illsleyd/continuum/continuum-1.0.3/apps/continuum/working-directory/61/modules/codegen/target/test-classes
[INFO] [surefire:test]
[INFO] Tests are skipped.
[INFO] [jar:jar]
[INFO] Building jar: /export/home/illsleyd/continuum/continuum-1.0.3/apps/continuum/working-directory/61/modules/codegen/target/axis2-codegen-SNAPSHOT.jar
[INFO] [install:install]
[INFO] Installing /export/home/illsleyd/continuum/continuum-1.0.3/apps/continuum/working-directory/61/modules/codegen/target/axis2-codegen-SNAPSHOT.jar to /export/home/illsleyd/.m2/repository/org/apache/axis2/axis2-codegen/SNAPSHOT/axis2-codegen-SNAPSHOT.jar
[INFO] ----------------------------------------------------------------------------
[INFO] Building Apache Axis 2.0 - ADB Codegen
[INFO]    task-segment: [clean, install]
[INFO] ----------------------------------------------------------------------------
[INFO] [clean:clean]
[INFO] Deleting directory /export/home/illsleyd/continuum/continuum-1.0.3/apps/continuum/working-directory/61/modules/adb-codegen/target
[INFO] Deleting directory /export/home/illsleyd/continuum/continuum-1.0.3/apps/continuum/working-directory/61/modules/adb-codegen/target/classes
[INFO] Deleting directory /export/home/illsleyd/continuum/continuum-1.0.3/apps/continuum/working-directory/61/modules/adb-codegen/target/test-classes
[INFO] [resources:resources]
[INFO] Using default encoding to copy filtered resources.
[WARNING] 
	Artifact junit:junit:jar:3.8:test retains local scope 'test' overriding broader scope 'compile'
	given by a dependency. If this is not intended, modify or remove the local scope.

[INFO] [compiler:compile]
[INFO] Compiling 17 source files to /export/home/illsleyd/continuum/continuum-1.0.3/apps/continuum/working-directory/61/modules/adb-codegen/target/classes
[INFO] [antrun:run {execution: generate-test-sources}]
[INFO] Executing tasks
    [mkdir] Created dir: /export/home/illsleyd/continuum/continuum-1.0.3/apps/continuum/working-directory/61/modules/adb-codegen/target/schema
    [mkdir] Created dir: /export/home/illsleyd/continuum/continuum-1.0.3/apps/continuum/working-directory/61/modules/adb-codegen/target/schema/src
    [mkdir] Created dir: /export/home/illsleyd/continuum/continuum-1.0.3/apps/continuum/working-directory/61/modules/adb-codegen/target/schema/classes
    [mkdir] Created dir: /export/home/illsleyd/continuum/continuum-1.0.3/apps/continuum/working-directory/61/modules/adb-codegen/target/test-classes
     [echo] Compiling simple_maxOccurs2.xsd
     [java] log4j:WARN No appenders could be found for logger (org.apache.axis2.util.Loader).
     [java] log4j:WARN Please initialize the log4j system properly.
     [echo] Compiling anonymous_complexType.xsd
     [java] log4j:WARN No appenders could be found for logger (org.apache.axis2.util.Loader).
     [java] log4j:WARN Please initialize the log4j system properly.
     [echo] Compiling simple_choice.xsd
     [java] log4j:WARN No appenders could be found for logger (org.apache.axis2.util.Loader).
     [java] log4j:WARN Please initialize the log4j system properly.
     [echo] Compiling simple_particle_all.xsd
     [java] log4j:WARN No appenders could be found for logger (org.apache.axis2.util.Loader).
     [java] log4j:WARN Please initialize the log4j system properly.
     [echo] Compiling simple_maxOccurs.xsd
     [java] log4j:WARN No appenders could be found for logger (org.apache.axis2.util.Loader).
     [java] log4j:WARN Please initialize the log4j system properly.
     [echo] Compiling simple_anytype.xsd
     [java] log4j:WARN No appenders could be found for logger (org.apache.axis2.util.Loader).
     [java] log4j:WARN Please initialize the log4j system properly.
     [echo] Compiling simple-minoccurs0.xsd
     [java] log4j:WARN No appenders could be found for logger (org.apache.axis2.util.Loader).
     [java] log4j:WARN Please initialize the log4j system properly.
     [echo] Compiling complex-minoccurs0.xsd
     [java] log4j:WARN No appenders could be found for logger (org.apache.axis2.util.Loader).
     [java] log4j:WARN Please initialize the log4j system properly.
     [echo] Compiling simple-recursive-datatypes.xsd
     [java] log4j:WARN No appenders could be found for logger (org.apache.axis2.util.Loader).
     [java] log4j:WARN Please initialize the log4j system properly.
     [echo] Compiling mixed_minoccus0.xsd
     [java] log4j:WARN No appenders could be found for logger (org.apache.axis2.util.Loader).
     [java] log4j:WARN Please initialize the log4j system properly.
     [java] log4j:WARN No appenders could be found for logger (org.apache.axis2.util.Loader).
     [java] log4j:WARN Please initialize the log4j system properly.
     [java] log4j:WARN No appenders could be found for logger (org.apache.axis2.util.Loader).
     [java] log4j:WARN Please initialize the log4j system properly.
     [echo] Compiling complete.xsd
     [java] log4j:WARN No appenders could be found for logger (org.apache.axis2.util.Loader).
     [java] log4j:WARN Please initialize the log4j system properly.
     [echo] Compiling simpleExtension.xsd
     [java] log4j:WARN No appenders could be found for logger (org.apache.axis2.util.Loader).
     [java] log4j:WARN Please initialize the log4j system properly.
     [echo] Compiling union.xsd
     [java] log4j:WARN No appenders could be found for logger (org.apache.axis2.util.Loader).
     [java] log4j:WARN Please initialize the log4j system properly.
     [echo] Compiling all.xsd
     [java] log4j:WARN No appenders could be found for logger (org.apache.axis2.util.Loader).
     [java] log4j:WARN Please initialize the log4j system properly.
     [echo] Compiling enumeration.xsd
     [java] log4j:WARN No appenders could be found for logger (org.apache.axis2.util.Loader).
     [java] log4j:WARN Please initialize the log4j system properly.
     [echo] Compiling restrictions.xsd
     [java] log4j:WARN No appenders could be found for logger (org.apache.axis2.util.Loader).
     [java] log4j:WARN Please initialize the log4j system properly.
     [echo] Compiling choice.xsd
     [java] log4j:WARN No appenders could be found for logger (org.apache.axis2.util.Loader).
     [java] log4j:WARN Please initialize the log4j system properly.
     [echo] Compiling list.xsd
     [java] log4j:WARN No appenders could be found for logger (org.apache.axis2.util.Loader).
     [java] log4j:WARN Please initialize the log4j system properly.
     [echo] Compiling element_references.xsd
     [java] log4j:WARN No appenders could be found for logger (org.apache.axis2.util.Loader).
     [java] log4j:WARN Please initialize the log4j system properly.
     [echo] Compiling innersequence_choice.xsd
     [java] log4j:WARN No appenders could be found for logger (org.apache.axis2.util.Loader).
     [java] log4j:WARN Please initialize the log4j system properly.
[INFO] Executed tasks
[INFO] [resources:testResources]
[INFO] Using default encoding to copy filtered resources.
[INFO] [build-helper:add-test-source {execution: add-test-source}]
[INFO] Test Source directory: /export/home/illsleyd/continuum/continuum-1.0.3/apps/continuum/working-directory/61/modules/adb-codegen/target/schema/src added.
[INFO] [compiler:testCompile]
[INFO] Compiling 277 source files to /export/home/illsleyd/continuum/continuum-1.0.3/apps/continuum/working-directory/61/modules/adb-codegen/target/test-classes
[INFO] [surefire:test]
[INFO] Setting reports dir: /export/home/illsleyd/continuum/continuum-1.0.3/apps/continuum/working-directory/61/modules/adb-codegen/target/surefire-reports

-------------------------------------------------------
 T E S T S
-------------------------------------------------------
[surefire] Running org.apache.axis2.schema.populate.simple.SimpleTypeBase64BinPopulateTest
log4j:WARN No appenders could be found for logger (org.apache.axiom.om.util.StAXUtils).
log4j:WARN Please initialize the log4j system properly.
[surefire] Tests run: 1, Failures: 0, Errors: 0, Time elapsed: 0.273 sec
[surefire] Running org.apache.axis2.schema.populate.simple.SimpleTypeTimePopulateTest
[surefire] Tests run: 1, Failures: 0, Errors: 0, Time elapsed: 0.014 sec
[surefire] Running org.apache.axis2.schema.populate.simple.SimpleTypeDatePopulateTest
[surefire] Tests run: 1, Failures: 0, Errors: 0, Time elapsed: 0.008 sec
[surefire] Running org.apache.axis2.schema.populate.simple.SimpleTypeQNamePopulateTest
[surefire] Tests run: 1, Failures: 0, Errors: 0, Time elapsed: 0.005 sec
[surefire] Running org.apache.axis2.schema.populate.simple.SimpleTypeMonthDayPopulateTest
[surefire] Tests run: 1, Failures: 0, Errors: 0, Time elapsed: 0.008 sec
[surefire] Running org.apache.axis2.schema.populate.simple.SimpleTypeBooleanPopulateTest
[surefire] Tests run: 1, Failures: 0, Errors: 0, Time elapsed: 0.007 sec
[surefire] Running org.apache.axis2.schema.populate.simple.SimpleTypeDayPopulateTest
[surefire] Tests run: 1, Failures: 0, Errors: 0, Time elapsed: 0.008 sec
[surefire] Running org.apache.axis2.schema.populate.simple.SimpleTypegMonthPopulateTest
[surefire] Tests run: 1, Failures: 0, Errors: 0, Time elapsed: 0.008 sec
[surefire] Running org.apache.axis2.schema.populate.simple.SimpleTypeDurationPopulateTest
[surefire] Tests run: 1, Failures: 0, Errors: 0, Time elapsed: 0.035 sec
[surefire] Running org.apache.axis2.schema.populate.simple.SimpleTypeDoublePopulateTest
[surefire] Tests run: 1, Failures: 0, Errors: 0, Time elapsed: 0.01 sec
[surefire] Running org.apache.axis2.schema.populate.simple.SimpleTypeDateTimePopulateTest
[surefire] Tests run: 1, Failures: 0, Errors: 0, Time elapsed: 0.011 sec
[surefire] Running org.apache.axis2.schema.populate.simple.SimpleTypegYearMonthPopulateTest
[surefire] Tests run: 1, Failures: 0, Errors: 0, Time elapsed: 0.011 sec
[surefire] Running org.apache.axis2.schema.populate.simple.SimpleTypegYearPopulateTest
[surefire] Tests run: 1, Failures: 0, Errors: 0, Time elapsed: 0.02 sec
[surefire] Running org.apache.axis2.schema.populate.simple.SimpleTypeHexBinaryPopulateTest
[surefire] Tests run: 1, Failures: 0, Errors: 0, Time elapsed: 0.015 sec
[surefire] Running org.apache.axis2.schema.populate.simple.SimpleTypeFloatPopulateTest
[surefire] Tests run: 1, Failures: 0, Errors: 0, Time elapsed: 0.009 sec
[surefire] Running org.apache.axis2.schema.populate.simple.SimpleTypeAnyURIPopulateTest
[surefire] Tests run: 1, Failures: 0, Errors: 0, Time elapsed: 0.022 sec
[surefire] Running org.apache.axis2.schema.populate.derived.DerivedTypeLongPopulateTest
[surefire] Tests run: 1, Failures: 0, Errors: 0, Time elapsed: 0.559 sec
[surefire] Running org.apache.axis2.schema.populate.derived.DerivedTypeUnsignedBytePopulateTest
[surefire] Tests run: 1, Failures: 0, Errors: 0, Time elapsed: 0.022 sec
[surefire] Running org.apache.axis2.schema.populate.derived.DerivedTypeBytePopulateTest
[surefire] Tests run: 1, Failures: 0, Errors: 0, Time elapsed: 0.018 sec
[surefire] Running org.apache.axis2.schema.populate.derived.DerivedTypeIntegerPopulateTest
[surefire] Tests run: 1, Failures: 0, Errors: 0, Time elapsed: 0.019 sec
[surefire] Running org.apache.axis2.schema.populate.derived.DerivedTypeNegativeIntegerPopulateTest
[surefire] Tests run: 1, Failures: 0, Errors: 0, Time elapsed: 0.021 sec
[surefire] Running org.apache.axis2.schema.populate.derived.DerivedTypeUnsignedIntPopulateTest
[surefire] Tests run: 1, Failures: 0, Errors: 0, Time elapsed: 0.021 sec
[surefire] Running org.apache.axis2.schema.populate.derived.DerivedTypeNonPositiveIntegerPopulateTest
[surefire] Tests run: 1, Failures: 0, Errors: 0, Time elapsed: 0.022 sec
[surefire] Running org.apache.axis2.schema.populate.derived.DerivedTypeUnsignedShortPopulateTest
[surefire] Tests run: 1, Failures: 0, Errors: 0, Time elapsed: 0.02 sec
[surefire] Running org.apache.axis2.schema.populate.derived.DerivedTypeShortPopulateTest
[surefire] Tests run: 1, Failures: 0, Errors: 0, Time elapsed: 0.025 sec
[surefire] Running org.apache.axis2.schema.populate.derived.DerivedTypePositveIntegerPopulateTest
[surefire] Tests run: 1, Failures: 0, Errors: 0, Time elapsed: 0.02 sec
[surefire] Running org.apache.axis2.schema.populate.derived.DerivedTypeUnsignedLongPopulateTest
[surefire] Tests run: 1, Failures: 0, Errors: 0, Time elapsed: 0.029 sec
[surefire] Running org.apache.axis2.schema.populate.derived.DerivedTypeIntPopulateTest
[surefire] Tests run: 1, Failures: 0, Errors: 0, Time elapsed: 0.015 sec
[surefire] Running org.apache.axis2.schema.populate.derived.DerivedTypeNonNegativeIntegerPopulateTest
[surefire] Tests run: 1, Failures: 0, Errors: 0, Time elapsed: 0.02 sec
[surefire] Running org.apache.axis2.schema.populate.other.PopulateComplexMinOccurs0Test
[surefire] Tests run: 4, Failures: 0, Errors: 0, Time elapsed: 0.013 sec
[surefire] Running org.apache.axis2.schema.populate.other.PopulateParticleAllTest
[surefire] Tests run: 1, Failures: 0, Errors: 0, Time elapsed: 0.011 sec
[surefire] Running org.apache.axis2.schema.populate.other.PopulateAnyTypeTest
[surefire] Tests run: 1, Failures: 0, Errors: 0, Time elapsed: 0.013 sec
[surefire] Running org.apache.axis2.schema.populate.other.PopulateArrayInArrayTest
[surefire] Tests run: 1, Failures: 0, Errors: 0, Time elapsed: 0.012 sec
[surefire] Running org.apache.axis2.schema.populate.other.PopulateChoiceTest
[surefire] Tests run: 1, Failures: 0, Errors: 0, Time elapsed: 0.011 sec
[surefire] Running org.apache.axis2.schema.populate.other.PopulateArrayTest
[surefire] Tests run: 1, Failures: 0, Errors: 0, Time elapsed: 0.015 sec
[surefire] Running org.apache.axis2.schema.populate.other.PopulateAnonComplexTypeTest
[surefire] Tests run: 1, Failures: 0, Errors: 0, Time elapsed: 0.007 sec
[surefire] Running org.apache.axis2.schema.populate.other.PopulateMixedMinoccurs0Test
[surefire] Tests run: 2, Failures: 0, Errors: 0, Time elapsed: 0.048 sec
[surefire] Running org.apache.axis2.schema.populate.other.PopulateRecursiveTest
[surefire] Tests run: 1, Failures: 0, Errors: 0, Time elapsed: 0.007 sec
[surefire] Running org.apache.axis2.schema.populate.other.ADBInOutTest
event 1
text 
localName tempElt
event 4
text hello
localName 
event 2
text 
localName tempElt
event 1
text 
localName tempElt
event 4
text hello
localName 
event 2
text 
localName tempElt
[surefire] Tests run: 2, Failures: 0, Errors: 0, Time elapsed: 0.033 sec
[surefire] Running org.apache.axis2.schema.populate.other.PopulateMinOccurs0Test
[surefire] Tests run: 3, Failures: 0, Errors: 0, Time elapsed: 0.024 sec
[surefire] Running org.apache.axis2.schema.enumeration.EnumerationTest
OM String ==> <ns1:CountPlacesInRect xmlns:ns1="http://tempuri.org/"><ns1:upperleft>upperleft</ns1:upperleft><ns1:lowerright>lowerright</ns1:lowerright><ns1:ptype>River</ns1:ptype></ns1:CountPlacesInRect>
[surefire] Tests run: 1, Failures: 0, Errors: 0, Time elapsed: 0.028 sec
[surefire] Running org.apache.axis2.schema.testsuite.StringElementsTest
Test minOccurs 0 nillable true
OMElement ==> <ns1:testString2 xmlns:ns1="http://types.echo.services"><ns1:testValue xmlns:xsi="http://www.w3.org/2001/XMLSchema-instance" xsi:nil="1" /></ns1:testString2>
OMElement ==> <ns1:testString2 xmlns:ns1="http://types.echo.services"><ns1:testValue>Test</ns1:testValue></ns1:testString2>
Test minOccurs = 0 nillable false
OMElement ==> <ns1:testString4 xmlns:ns1="http://types.echo.services" />
OMElement ==> <ns1:testString4 xmlns:ns1="http://types.echo.services"><ns1:testValue>Test</ns1:testValue></ns1:testString4>
Test minOccurs = 1 nillable true
OMElement ==> <ns1:testString6 xmlns:ns1="http://types.echo.services"><ns1:testValue xmlns:xsi="http://www.w3.org/2001/XMLSchema-instance" xsi:nil="1" /></ns1:testString6>
OMElement ==> <ns1:testString6 xmlns:ns1="http://types.echo.services"><ns1:testValue>Test</ns1:testValue></ns1:testString6>
Test minOccurs = 1 nillable false
OMElement ==> <ns1:testString8 xmlns:ns1="http://types.echo.services"><ns1:testValue>Test</ns1:testValue></ns1:testString8>
Test minOccurs 0 nillable true
OMElement ==> <ns1:testString1 xmlns:ns1="http://types.echo.services"><ns1:testValue xmlns:xsi="http://www.w3.org/2001/XMLSchema-instance" xsi:nil="1" /></ns1:testString1>
OMElement ==> <ns1:testString1 xmlns:ns1="http://types.echo.services"><ns1:testValue xmlns:xsi="http://www.w3.org/2001/XMLSchema-instance" xsi:nil="1" /></ns1:testString1>
OMElement ==> <ns1:testString1 xmlns:ns1="http://types.echo.services"><ns1:testValue>test</ns1:testValue></ns1:testString1>
OMElement ==> <ns1:testString1 xmlns:ns1="http://types.echo.services"><ns1:testValue>test</ns1:testValue><ns1:testValue xmlns:xsi="http://www.w3.org/2001/XMLSchema-instance" xsi:nil="1" /></ns1:testString1>
Test minOccurs = 0 nillable false
OMElement ==> <ns1:testString3 xmlns:ns1="http://types.echo.services" />
OMElement ==> <ns1:testString3 xmlns:ns1="http://types.echo.services" />
OMElement ==> <ns1:testString3 xmlns:ns1="http://types.echo.services"><ns1:testValue>test</ns1:testValue></ns1:testString3>
OMElement ==> <ns1:testString3 xmlns:ns1="http://types.echo.services"><ns1:testValue>test</ns1:testValue></ns1:testString3>
Test minOccurs = 1 nillable true
OMElement ==> <ns1:testString5 xmlns:ns1="http://types.echo.services"><ns1:testValue xmlns:xsi="http://www.w3.org/2001/XMLSchema-instance" xsi:nil="1" /></ns1:testString5>
OMElement ==> <ns1:testString5 xmlns:ns1="http://types.echo.services"><ns1:testValue xmlns:xsi="http://www.w3.org/2001/XMLSchema-instance" xsi:nil="1" /></ns1:testString5>
OMElement ==> <ns1:testString5 xmlns:ns1="http://types.echo.services"><ns1:testValue>test</ns1:testValue></ns1:testString5>
OMElement ==> <ns1:testString5 xmlns:ns1="http://types.echo.services"><ns1:testValue>test</ns1:testValue><ns1:testValue xmlns:xsi="http://www.w3.org/2001/XMLSchema-instance" xsi:nil="1" /></ns1:testString5>
Test minOccurs = 1 nillable false
OMElement ==> <ns1:testString7 xmlns:ns1="http://types.echo.services"><ns1:testValue>test</ns1:testValue></ns1:testString7>
[surefire] Tests run: 3, Failures: 0, Errors: 0, Time elapsed: 0.046 sec
[surefire] Running org.apache.axis2.schema.testsuite.CustomElementsTest
minOccurs = 0 and nillable true
OMElement ==> <ns1:testBookInformation1 xmlns:ns1="http://types.echo.services"><ns1:testValue xmlns:xsi="http://www.w3.org/2001/XMLSchema-instance" xsi:nil="1" /></ns1:testBookInformation1>
OMElement ==> <ns1:testBookInformation1 xmlns:ns1="http://types.echo.services"><ns1:testValue xmlns:xsi="http://www.w3.org/2001/XMLSchema-instance" xsi:nil="1" /></ns1:testBookInformation1>
OMElement ==> <ns1:testBookInformation1 xmlns:ns1="http://types.echo.services"><ns1:testValue type="test" isbn="test"><ns1:title>test</ns1:title></ns1:testValue></ns1:testBookInformation1>
OMElement ==> <ns1:testBookInformation1 xmlns:ns1="http://types.echo.services"><ns1:testValue type="test" isbn="test"><ns1:title>test</ns1:title></ns1:testValue><ns1:testValue xmlns:xsi="http://www.w3.org/2001/XMLSchema-instance" xsi:nil="1" /></ns1:testBookInformation1>
minOccurs = 0 and nillable false
OMElement ==> <ns1:testBookInformation3 xmlns:ns1="http://types.echo.services" />
OMElement ==> <ns1:testBookInformation3 xmlns:ns1="http://types.echo.services" />
OMElement ==> <ns1:testBookInformation3 xmlns:ns1="http://types.echo.services"><ns1:testValue type="test" isbn="test"><ns1:title>test</ns1:title></ns1:testValue></ns1:testBookInformation3>
OMElement ==> <ns1:testBookInformation3 xmlns:ns1="http://types.echo.services"><ns1:testValue type="test" isbn="test"><ns1:title>test</ns1:title></ns1:testValue></ns1:testBookInformation3>
minOccurs = 1 and nillable true
OMElement ==> <ns1:testBookInformation5 xmlns:ns1="http://types.echo.services"><ns1:testValue xmlns:xsi="http://www.w3.org/2001/XMLSchema-instance" xsi:nil="1" /></ns1:testBookInformation5>
OMElement ==> <ns1:testBookInformation5 xmlns:ns1="http://types.echo.services"><ns1:testValue xmlns:xsi="http://www.w3.org/2001/XMLSchema-instance" xsi:nil="1" /></ns1:testBookInformation5>
OMElement ==> <ns1:testBookInformation5 xmlns:ns1="http://types.echo.services"><ns1:testValue type="test" isbn="test"><ns1:title>test</ns1:title></ns1:testValue></ns1:testBookInformation5>
OMElement ==> <ns1:testBookInformation5 xmlns:ns1="http://types.echo.services"><ns1:testValue type="test" isbn="test"><ns1:title>test</ns1:title></ns1:testValue><ns1:testValue xmlns:xsi="http://www.w3.org/2001/XMLSchema-instance" xsi:nil="1" /></ns1:testBookInformation5>
minOccurs = 1 and nillable false
OMElement ==> <ns1:testBookInformation7 xmlns:ns1="http://types.echo.services"><ns1:testValue type="test" isbn="test"><ns1:title>test</ns1:title></ns1:testValue></ns1:testBookInformation7>
minOccurs = 0 and nillable true
OMElement ==> <ns1:testBookInformation2 xmlns:ns1="http://types.echo.services"><ns1:testValue xmlns:xsi="http://www.w3.org/2001/XMLSchema-instance" xsi:nil="1" /></ns1:testBookInformation2>
OMElement ==> <ns1:testBookInformation2 xmlns:ns1="http://types.echo.services"><ns1:testValue type="test" isbn="test"><ns1:title>test</ns1:title></ns1:testValue></ns1:testBookInformation2>
minOccurs = 0 and nillable false
OMElement ==> <ns1:testBookInformation4 xmlns:ns1="http://types.echo.services" />
OMElement ==> <ns1:testBookInformation4 xmlns:ns1="http://types.echo.services"><ns1:testValue type="test" isbn="test"><ns1:title>test</ns1:title></ns1:testValue></ns1:testBookInformation4>
minOccurs = 1 and nillable true
OMElement ==> <ns1:testBookInformation6 xmlns:ns1="http://types.echo.services"><ns1:testValue xmlns:xsi="http://www.w3.org/2001/XMLSchema-instance" xsi:nil="1" /></ns1:testBookInformation6>
OMElement ==> <ns1:testBookInformation6 xmlns:ns1="http://types.echo.services"><ns1:testValue type="test" isbn="test"><ns1:title>test</ns1:title></ns1:testValue></ns1:testBookInformation6>
minOccurs = 1 and nillable false
OMElement ==> <ns1:testBookInformation8 xmlns:ns1="http://types.echo.services"><ns1:testValue type="test" isbn="test"><ns1:title>test</ns1:title></ns1:testValue></ns1:testBookInformation8>
[surefire] Tests run: 3, Failures: 0, Errors: 0, Time elapsed: 0.05 sec
[surefire] Running org.apache.axis2.schema.testsuite.XsdAnyElementsTest
minOccurs = 0 and nillable true
OMElement ==> <ns1:TestAnyType1 xmlns:ns1="http://types.echo.services"><ns1:testValue xmlns:xsi="http://www.w3.org/2001/XMLSchema-instance" xsi:nil="1" /></ns1:TestAnyType1>
OMElement ==> <ns1:TestAnyType1 xmlns:ns1="http://types.echo.services"><ns1:testValue xmlns:xsi="http://www.w3.org/2001/XMLSchema-instance" xsi:nil="1" /></ns1:TestAnyType1>
OMElement ==> <ns1:TestAnyType1 xmlns:ns1="http://types.echo.services"><ns1:testValue><ns1:TestValue xmlns:ns1="http://test.ws02.com">testString</ns1:TestValue></ns1:testValue></ns1:TestAnyType1>
OMElement ==> <ns1:TestAnyType1 xmlns:ns1="http://types.echo.services"><ns1:testValue><ns1:TestValue xmlns:ns1="http://test.ws02.com">testString</ns1:TestValue></ns1:testValue><ns1:testValue xmlns:xsi="http://www.w3.org/2001/XMLSchema-instance" xsi:nil="1" /></ns1:TestAnyType1>
minOccurs = 0 and nillable false
OMElement ==> <ns1:TestAnyType3 xmlns:ns1="http://types.echo.services" />
OMElement ==> <ns1:TestAnyType3 xmlns:ns1="http://types.echo.services" />
OMElement ==> <ns1:TestAnyType3 xmlns:ns1="http://types.echo.services"><ns1:testValue><ns1:TestValue xmlns:ns1="http://test.ws02.com">testString</ns1:TestValue></ns1:testValue></ns1:TestAnyType3>
OMElement ==> <ns1:TestAnyType3 xmlns:ns1="http://types.echo.services"><ns1:testValue><ns1:TestValue xmlns:ns1="http://test.ws02.com">testString</ns1:TestValue></ns1:testValue></ns1:TestAnyType3>
minOccurs = 1 and nillable true
OMElement ==> <ns1:TestAnyType5 xmlns:ns1="http://types.echo.services"><ns1:testValue xmlns:xsi="http://www.w3.org/2001/XMLSchema-instance" xsi:nil="1" /></ns1:TestAnyType5>
OMElement ==> <ns1:TestAnyType5 xmlns:ns1="http://types.echo.services"><ns1:testValue xmlns:xsi="http://www.w3.org/2001/XMLSchema-instance" xsi:nil="1" /></ns1:TestAnyType5>
OMElement ==> <ns1:TestAnyType5 xmlns:ns1="http://types.echo.services"><ns1:testValue><ns1:TestValue xmlns:ns1="http://test.ws02.com">testString</ns1:TestValue></ns1:testValue></ns1:TestAnyType5>
OMElement ==> <ns1:TestAnyType5 xmlns:ns1="http://types.echo.services"><ns1:testValue><ns1:TestValue xmlns:ns1="http://test.ws02.com">testString</ns1:TestValue></ns1:testValue><ns1:testValue xmlns:xsi="http://www.w3.org/2001/XMLSchema-instance" xsi:nil="1" /></ns1:TestAnyType5>
minOccurs = 1 and nillable false
OMElement ==> <ns1:TestAnyType7 xmlns:ns1="http://types.echo.services"><ns1:testValue><ns1:TestValue xmlns:ns1="http://test.ws02.com">testString</ns1:TestValue></ns1:testValue></ns1:TestAnyType7>
minOccurs = 0 nillable true
OMElement ==> <ns1:TestAnyType2 xmlns:ns1="http://types.echo.services"><ns1:testValue xmlns:xsi="http://www.w3.org/2001/XMLSchema-instance" xsi:nil="1" /></ns1:TestAnyType2>
OMElement ==> <ns1:TestAnyType2 xmlns:ns1="http://types.echo.services"><ns1:testValue><ns1:TestValue xmlns:ns1="http://test.ws02.com">testString</ns1:TestValue></ns1:testValue></ns1:TestAnyType2>
minOccurs = 0 nillable false
OMElement ==> <ns1:TestAnyType4 xmlns:ns1="http://types.echo.services" />
OMElement ==> <ns1:TestAnyType4 xmlns:ns1="http://types.echo.services"><ns1:testValue><ns1:TestValue xmlns:ns1="http://test.ws02.com">testString</ns1:TestValue></ns1:testValue></ns1:TestAnyType4>
minOccurs = 1 nillable true
OMElement ==> <ns1:TestAnyType6 xmlns:ns1="http://types.echo.services"><ns1:testValue xmlns:xsi="http://www.w3.org/2001/XMLSchema-instance" xsi:nil="1" /></ns1:TestAnyType6>
OMElement ==> <ns1:TestAnyType6 xmlns:ns1="http://types.echo.services"><ns1:testValue><ns1:TestValue xmlns:ns1="http://test.ws02.com">testString</ns1:TestValue></ns1:testValue></ns1:TestAnyType6>
minOccurs = 1 nillable false
OMElement ==> <ns1:TestAnyType8 xmlns:ns1="http://types.echo.services"><ns1:testValue><ns1:TestValue xmlns:ns1="http://test.ws02.com">testString</ns1:TestValue></ns1:testValue></ns1:TestAnyType8>
[surefire] Tests run: 3, Failures: 0, Errors: 0, Time elapsed: 0.153 sec
[surefire] Running org.apache.axis2.schema.testsuite.IntElementsTest
minOccurs = 0 nillable true
OMElement ==> <ns1:testInt1 xmlns:ns1="http://types.echo.services"><ns1:testValue xmlns:xsi="http://www.w3.org/2001/XMLSchema-instance" xsi:nil="1" /></ns1:testInt1>
OMElement ==> <ns1:testInt1 xmlns:ns1="http://types.echo.services"><ns1:testValue>5</ns1:testValue></ns1:testInt1>
OMElement ==> <ns1:testInt1 xmlns:ns1="http://types.echo.services"><ns1:testValue xmlns:xsi="http://www.w3.org/2001/XMLSchema-instance" xsi:nil="1" /></ns1:testInt1>
OMElement ==> <ns1:testInt1 xmlns:ns1="http://types.echo.services"><ns1:testValue xmlns:xsi="http://www.w3.org/2001/XMLSchema-instance" xsi:nil="1" /><ns1:testValue>5</ns1:testValue></ns1:testInt1>
minOccurs = 0 nillable false
OMElement ==> <ns1:testInt3 xmlns:ns1="http://types.echo.services" />
OMElement ==> <ns1:testInt3 xmlns:ns1="http://types.echo.services"><ns1:testValue>5</ns1:testValue></ns1:testInt3>
OMElement ==> <ns1:testInt3 xmlns:ns1="http://types.echo.services" />
minOccurs = 1 nillable true
OMElement ==> <ns1:testInt5 xmlns:ns1="http://types.echo.services"><ns1:testValue xmlns:xsi="http://www.w3.org/2001/XMLSchema-instance" xsi:nil="1" /></ns1:testInt5>
OMElement ==> <ns1:testInt5 xmlns:ns1="http://types.echo.services"><ns1:testValue>5</ns1:testValue></ns1:testInt5>
OMElement ==> <ns1:testInt5 xmlns:ns1="http://types.echo.services"><ns1:testValue xmlns:xsi="http://www.w3.org/2001/XMLSchema-instance" xsi:nil="1" /></ns1:testInt5>
minOccurs = 1 nillable false
OMElement ==> <ns1:testInt7 xmlns:ns1="http://types.echo.services"><ns1:testValue>5</ns1:testValue></ns1:testInt7>
min =0 and nillable true test
OMElement ==> <ns1:testInt2 xmlns:ns1="http://types.echo.services"><ns1:testValue>1</ns1:testValue></ns1:testInt2>
OMElement ==> <ns1:testInt2 xmlns:ns1="http://types.echo.services"><ns1:testValue xmlns:xsi="http://www.w3.org/2001/XMLSchema-instance" xsi:nil="1" /></ns1:testInt2>
OMElement ==> <ns1:testInt4 xmlns:ns1="http://types.echo.services"><ns1:testValue>1</ns1:testValue></ns1:testInt4>
OMElement ==> <ns1:testInt4 xmlns:ns1="http://types.echo.services" />
OMElement ==> <ns1:testInt6 xmlns:ns1="http://types.echo.services"><ns1:testValue>1</ns1:testValue></ns1:testInt6>
OMElement ==> <ns1:testInt6 xmlns:ns1="http://types.echo.services"><ns1:testValue xmlns:xsi="http://www.w3.org/2001/XMLSchema-instance" xsi:nil="1" /></ns1:testInt6>
OMElement ==> <ns1:testInt8 xmlns:ns1="http://types.echo.services"><ns1:testValue>1</ns1:testValue></ns1:testInt8>
[surefire] Tests run: 3, Failures: 0, Errors: 0, Time elapsed: 0.035 sec
[surefire] Running org.apache.axis2.schema.testsuite.OuterElementsTest
OMElement ==> <s1:OuterTestString1 xmlns:s1="http://types.echo.services" xmlns:xsi="http://www.w3.org/2001/XMLSchema-instance" xsi:nil="1" />
OMElement ==> <s2:OuterTestString1 xmlns:s2="http://types.echo.services">Test String</s2:OuterTestString1>
OMElement ==> <s4:OuterTestString2 xmlns:s4="http://types.echo.services">Test String</s4:OuterTestString2>
OMElement ==> <s5:OuterTestBookInformation1 xmlns:s5="http://types.echo.services" xmlns:xsi="http://www.w3.org/2001/XMLSchema-instance" xsi:nil="1" />
OMElement ==> <ns1:OuterTestBookInformation1 xmlns:ns1="http://types.echo.services" type="test" isbn="test"><ns1:title>test</ns1:title></ns1:OuterTestBookInformation1>
OMElement ==> <ns1:OuterTestBookInformation2 xmlns:ns1="http://types.echo.services" type="test" isbn="test"><ns1:title>test</ns1:title></ns1:OuterTestBookInformation2>
OMElement ==> <s6:OuterTestAnyType1 xmlns:s6="http://types.echo.services" xmlns:xsi="http://www.w3.org/2001/XMLSchema-instance" xsi:nil="1" />
OMElement ==> <s7:OuterTestAnyType1 xmlns:s7="http://types.echo.services"><ns1:TestValue xmlns:ns1="http://test.ws02.com">testString</ns1:TestValue></s7:OuterTestAnyType1>
OMElement ==> <s9:OuterTestAnyType2 xmlns:s9="http://types.echo.services"><ns1:TestValue xmlns:ns1="http://test.ws02.com">testString</ns1:TestValue></s9:OuterTestAnyType2>
OMElement ==> <s10:OuterTestInt1 xmlns:s10="http://types.echo.services">5</s10:OuterTestInt1>
OMElement ==> <s11:OuterTestInt1 xmlns:s11="http://types.echo.services" xmlns:xsi="http://www.w3.org/2001/XMLSchema-instance" xsi:nil="1" />
OMElement ==> <s12:OuterTestInt2 xmlns:s12="http://types.echo.services">5</s12:OuterTestInt2>
[surefire] Tests run: 5, Failures: 0, Errors: 0, Time elapsed: 0.045 sec
[surefire] Running org.apache.axis2.schema.testsuite.AnyElementsTest
OMElement ==> <ns1:testAny1 xmlns:ns1="http://types.echo.services" />
OMElement ==> <ns1:testAny1 xmlns:ns1="http://types.echo.services" />
OMElement ==> <ns1:testAny1 xmlns:ns1="http://types.echo.services"><ns1:TestValue xmlns:ns1="http://test.ws02.com">testString</ns1:TestValue></ns1:testAny1>
OMElement ==> <ns1:testAny1 xmlns:ns1="http://types.echo.services"><ns1:TestValue xmlns:ns1="http://test.ws02.com">testString</ns1:TestValue><ns1:TestValue xmlns:ns1="http://test.ws02.com">testString</ns1:TestValue></ns1:testAny1>
OMElement ==> <ns1:testAny3 xmlns:ns1="http://types.echo.services"><ns1:TestValue xmlns:ns1="http://test.ws02.com">testString</ns1:TestValue><ns1:TestValue xmlns:ns1="http://test.ws02.com">testString</ns1:TestValue></ns1:testAny3>
OMElement ==> <ns1:testAny2 xmlns:ns1="http://types.echo.services" />
OMElement ==> <ns1:testAny2 xmlns:ns1="http://types.echo.services"><ns1:TestValue xmlns:ns1="http://test.ws02.com">testString</ns1:TestValue></ns1:testAny2>
OMElement ==> <ns1:testAny4 xmlns:ns1="http://types.echo.services"><ns1:TestValue xmlns:ns1="http://test.ws02.com">testString</ns1:TestValue></ns1:testAny4>
[surefire] Tests run: 3, Failures: 0, Errors: 0, Time elapsed: 0.053 sec
[surefire] Running org.apache.axis2.schema.compile.SimpleChoiceTest
[surefire] Tests run: 1, Failures: 0, Errors: 0, Time elapsed: 3.432 sec
[surefire] Running org.apache.axis2.schema.compile.RecursiveCompileTest
[surefire] Tests run: 1, Failures: 0, Errors: 0, Time elapsed: 0.48 sec
[surefire] Running org.apache.axis2.schema.compile.simple.SimpleTypeAllCompileTest
[surefire] Tests run: 1, Failures: 0, Errors: 0, Time elapsed: 0.618 sec
[surefire] Running org.apache.axis2.schema.compile.ComplexAllTest
[surefire] Tests run: 1, Failures: 0, Errors: 0, Time elapsed: 0.164 sec
[surefire] Running org.apache.axis2.schema.compile.SimpleAnyTypeTest
[surefire] Tests run: 1, Failures: 0, Errors: 0, Time elapsed: 0.018 sec
[surefire] Running org.apache.axis2.schema.compile.SimpleAnyTest
[surefire] Tests run: 1, Failures: 0, Errors: 0, Time elapsed: 0.083 sec
[surefire] Running org.apache.axis2.schema.compile.XmlmaxOccursTest
[surefire] Tests run: 1, Failures: 0, Errors: 0, Time elapsed: 0.028 sec
[surefire] Running org.apache.axis2.schema.compile.SimpleSequence2Test
[surefire] Tests run: 1, Failures: 0, Errors: 0, Time elapsed: 0.058 sec
[surefire] Running org.apache.axis2.schema.compile.AnonymousComplexTypeTest
[surefire] Tests run: 1, Failures: 0, Errors: 0, Time elapsed: 0.148 sec
[surefire] Running org.apache.axis2.schema.compile.SimpleParticleAllTest
[surefire] Tests run: 1, Failures: 0, Errors: 0, Time elapsed: 0.131 sec
[surefire] Running org.apache.axis2.schema.compile.SimpleAttributeTest
[surefire] Tests run: 1, Failures: 0, Errors: 0, Time elapsed: 0.084 sec
[surefire] Running org.apache.axis2.schema.compile.SimpleElementTest
[surefire] Tests run: 1, Failures: 0, Errors: 0, Time elapsed: 0.105 sec
[surefire] Running org.apache.axis2.schema.compile.SimpleSequenceTest
[surefire] Tests run: 1, Failures: 0, Errors: 0, Time elapsed: 0.188 sec
[surefire] Running org.apache.axis2.schema.compile.SimpleRestrictionTest
[surefire] Tests run: 1, Failures: 0, Errors: 0, Time elapsed: 0.149 sec
[surefire] Running org.apache.axis2.schema.compile.ComplexExtensionTest
[surefire] Tests run: 1, Failures: 0, Errors: 0, Time elapsed: 0.065 sec
[surefire] Running org.apache.axis2.schema.compile.SimpleElementReferenceTest
[surefire] Tests run: 1, Failures: 0, Errors: 0, Time elapsed: 0.098 sec
[surefire] Running org.apache.axis2.schema.compile.SimpleContentExtensionTest
[surefire] Tests run: 1, Failures: 0, Errors: 0, Time elapsed: 0.052 sec
[surefire] Running org.apache.axis2.schema.compile.XmlMaxOccurs2Test
[surefire] Tests run: 1, Failures: 0, Errors: 0, Time elapsed: 0.091 sec
[surefire] Running org.apache.axis2.schema.compile.ImportTest
[surefire] Tests run: 1, Failures: 0, Errors: 0, Time elapsed: 0.109 sec
[surefire] Running org.apache.axis2.schema.compile.SimpleAnyAttribTest
[surefire] Tests run: 1, Failures: 0, Errors: 0, Time elapsed: 0.049 sec
[surefire] Running org.apache.axis2.schema.references.ElementReferenceTest
[surefire] Tests run: 2, Failures: 0, Errors: 0, Time elapsed: 0.202 sec
[surefire] Running org.apache.axis2.schema.restriction.ComplexRestrictionTest
[surefire] Tests run: 1, Failures: 0, Errors: 0, Time elapsed: 0.002 sec
[surefire] Running org.apache.axis2.schema.restriction.SimpleRestrictionTest
OM String ==> <ns1:TestSimpleAttributeElement xmlns:ns1="http://tempuri.org/" attrib1="test simple type 1" attrib2="test simple type 2"><ns1:testElement1 xmlns:s14="http://wso2.com">s14:test1</ns1:testElement1><ns1:testElement2 xmlns:s15="http://wso2.com">s15:test2</ns1:testElement2><ns1:testElement3 xmlns:s16="http://wso2.com">s16:test3</ns1:testElement3></ns1:TestSimpleAttributeElement>
OM Element ==> <s17:NormalSimpleTypeElement xmlns:s17="http://tempuri.org/" xmlns:s18="http://wso2.com">s18:test</s17:NormalSimpleTypeElement>
OM Element ==> <s19:EnumerationSimpleTypeElement xmlns:s19="http://tempuri.org/" xmlns:s20="http://google.com">s20:test1</s19:EnumerationSimpleTypeElement>
OM Element ==> <ns1:ComplexRestrictionTypeTestElement xmlns:ns1="http://tempuri.org/"><ns1:baseTypeElement1>test 1</ns1:baseTypeElement1><ns1:baseTypeElement2>5</ns1:baseTypeElement2></ns1:ComplexRestrictionTypeTestElement>
OM Element ==> <ns1:PersonElement xmlns:ns1="http://tempuri.org/"><ns1:name>amila</ns1:name><ns1:age>23</ns1:age><ns1:hairColor>black</ns1:hairColor><ns1:birthDate>2007-03-13Z</ns1:birthDate><ns1:address><ns1:line1>line1</ns1:line1><ns1:line2>line2</ns1:line2><ns1:city>Galle</ns1:city><ns1:state>state</ns1:state><ns1:zip>C</ns1:zip></ns1:address></ns1:PersonElement>
[surefire] Tests run: 5, Failures: 0, Errors: 0, Time elapsed: 0.062 sec
[surefire] Running org.apache.axis2.schema.innerChoice.InnerChoiceTest
OMelement ==> <ns1:TestInnerSequence1 xmlns:ns1="org.apache.axis2.test"><ns1:sequence1>test sequence</ns1:sequence1><ns1:sequence2>3</ns1:sequence2><ns1:choice2>5</ns1:choice2></ns1:TestInnerSequence1>
OMelement ==> <ns1:TestInnerSequence2 xmlns:ns1="org.apache.axis2.test"><ns1:sequence1>sequence</ns1:sequence1><ns1:sequence2>3</ns1:sequence2><ns1:choice1>choice1</ns1:choice1><ns1:choice1>choice2</ns1:choice1></ns1:TestInnerSequence2>
OMelement ==> <ns1:TestInnerSequence2 xmlns:ns1="org.apache.axis2.test"><ns1:sequence1>sequence</ns1:sequence1><ns1:sequence2>3</ns1:sequence2><ns1:choice2>2</ns1:choice2><ns1:choice2>4</ns1:choice2></ns1:TestInnerSequence2>
OMelement ==> <ns1:TestInnerSequence3 xmlns:ns1="org.apache.axis2.test"><ns1:sequence1>sequence</ns1:sequence1><ns1:sequence2>3</ns1:sequence2><ns1:choice1>choice1</ns1:choice1><ns1:choice1 xmlns:xsi="http://www.w3.org/2001/XMLSchema-instance" xsi:nil="1" /><ns1:choice1>choice2</ns1:choice1></ns1:TestInnerSequence3>
OMelement ==> <ns1:TestInnerSequence3 xmlns:ns1="org.apache.axis2.test"><ns1:sequence1>sequence</ns1:sequence1><ns1:sequence2>3</ns1:sequence2><ns1:choice2>2</ns1:choice2><ns1:choice2 xmlns:xsi="http://www.w3.org/2001/XMLSchema-instance" xsi:nil="1" /><ns1:choice2>6</ns1:choice2></ns1:TestInnerSequence3>
[surefire] Tests run: 5, Failures: 0, Errors: 0, Time elapsed: 0.032 sec
[surefire] Running org.apache.axis2.schema.choice.ChiceTest
OM Element ==> <ns1:TestChoise xmlns:ns1="org.apache.axis2.test"><ns1:choice2>5</ns1:choice2></ns1:TestChoise>
[surefire] Tests run: 1, Failures: 0, Errors: 0, Time elapsed: 0.006 sec
[surefire] Running org.apache.axis2.schema.list.ListTest
OM Element ==> <s21:TestListStringElement xmlns:s21="org.apache.axis2.test">string1 string2</s21:TestListStringElement>
OM Element ==> <s22:TestListQNameElement xmlns:s22="org.apache.axis2.test" xmlns:s23="http://www.google.com" xmlns:s24="http://www.google">s23:test1 s23:test2 s24:test3</s22:TestListQNameElement>
OM Element ==> <s25:TestListOursElement xmlns:s25="org.apache.axis2.test">test test test</s25:TestListOursElement>
OM Element ==> <s26:SuperTestListStringElement xmlns:s26="org.apache.axis2.test">test1 test2 test3</s26:SuperTestListStringElement>
OM Element ==> <s27:TestInnerListSimpleType xmlns:s27="org.apache.axis2.test">Access Exist</s27:TestInnerListSimpleType>
[surefire] Tests run: 5, Failures: 0, Errors: 0, Time elapsed: 0.05 sec
[surefire] Running org.apache.axis2.schema.all.AllTest
om string ==> <ns1:Update xmlns:ns1="http://tempuri.org/"><ns1:id>2</ns1:id><ns1:arg0>test</ns1:arg0><ns1:arg1>true</ns1:arg1></ns1:Update>
[surefire] Tests run: 1, Failures: 0, Errors: 0, Time elapsed: 0.007 sec
[surefire] Running org.apache.axis2.schema.extension.ComplexExtenstionTest
OM String ==> <ns1:TestComplexElement xmlns:ns1="org.apache.axis2.test" xmlns:xsi="http://www.w3.org/2001/XMLSchema-instance" xsi:type="ns1:ExtendedComplexType"><ns1:first>Amila</ns1:first><ns1:middle>Chinthaka</ns1:middle><ns1:last>Suriarachchi</ns1:last><ns1:parentElement1>test1</ns1:parentElement1><ns1:parentElement2>test2</ns1:parentElement2></ns1:TestComplexElement>
[surefire] Tests run: 1, Failures: 0, Errors: 0, Time elapsed: 0.011 sec
[surefire] Running org.apache.axis2.schema.extension.SimpleExtensionTest
OM String ==> <ns1:fullName xmlns:ns1="org.apache.axis2.test" xmlns:xsi="http://www.w3.org/2001/XMLSchema-instance" xsi:type="ns1:fullName" language="singhala" attribute1="s1" attribute2="ATTRIBUTE"><ns1:first>amila</ns1:first><ns1:middle>chinthaka</ns1:middle><ns1:last>suriarachchi</ns1:last></ns1:fullName>
[surefire] Tests run: 1, Failures: 0, Errors: 0, Time elapsed: 0.011 sec
[surefire] Running org.apache.axis2.schema.union.UnionTest
OM Element ==> <s28:TestInnerUnionType xmlns:s28="http://tempuri.org/union" xmlns:xsi="http://www.w3.org/2001/XMLSchema-instance" xsi:type="s28:PackingType_T_type2">MINOR_a</s28:TestInnerUnionType>
OM Element ==> <s29:TestInnerUnionType xmlns:s29="http://tempuri.org/union" xmlns:xsi="http://www.w3.org/2001/XMLSchema-instance" xsi:type="s29:PackingType_T_type3">PROP_a</s29:TestInnerUnionType>
OM Element ==> <s30:TestInnerUnionType xmlns:s30="http://tempuri.org/union" xmlns:xsi="http://www.w3.org/2001/XMLSchema-instance" xsi:type="s30:PackingType_T_type4">TAR</s30:TestInnerUnionType>
OM String ==> <ns1:Record2 xmlns:ns1="http://tempuri.org/union"><ns1:elem1 xmlns:ns0="http://www.w3.org/2001/XMLSchema" xmlns:xsi="http://www.w3.org/2001/XMLSchema-instance" xsi:type="ns0:int">10</ns1:elem1></ns1:Record2>
OM String ==> <ns1:Record2 xmlns:ns1="http://tempuri.org/union"><ns1:elem1 xmlns:ns0="http://www.w3.org/2001/XMLSchema" xmlns:xsi="http://www.w3.org/2001/XMLSchema-instance" xsi:type="ns0:boolean">true</ns1:elem1></ns1:Record2>
OM String ==> <ns1:Record1 xmlns:ns1="http://tempuri.org/union"><ns1:elem1 xmlns:ns0="http://www.w3.org/2001/XMLSchema" xmlns:xsi="http://www.w3.org/2001/XMLSchema-instance" xsi:type="ns0:anyURI">http://www.google.com</ns1:elem1></ns1:Record1>
OM String ==> <ns1:Record1 xmlns:ns1="http://tempuri.org/union"><ns1:elem1 xmlns:ns0="http://www.w3.org/2001/XMLSchema" xmlns:xsi="http://www.w3.org/2001/XMLSchema-instance" xsi:type="ns0:anyURI">http://A</ns1:elem1></ns1:Record1>
OM Element ==> <s31:UnionQNameTestElement xmlns:s31="http://tempuri.org/union" xmlns:ns0="http://www.w3.org/2001/XMLSchema" xmlns:xsi="http://www.w3.org/2001/XMLSchema-instance" xsi:type="ns0:QName" xmlns:s32="http://www.google.com">s32:test</s31:UnionQNameTestElement>
[surefire] Tests run: 4, Failures: 0, Errors: 0, Time elapsed: 0.052 sec
[INFO] [jar:jar]
[INFO] Building jar: /export/home/illsleyd/continuum/continuum-1.0.3/apps/continuum/working-directory/61/modules/adb-codegen/target/axis2-adb-codegen-SNAPSHOT.jar
[INFO] [install:install]
[INFO] Installing /export/home/illsleyd/continuum/continuum-1.0.3/apps/continuum/working-directory/61/modules/adb-codegen/target/axis2-adb-codegen-SNAPSHOT.jar to /export/home/illsleyd/.m2/repository/org/apache/axis2/axis2-adb-codegen/SNAPSHOT/axis2-adb-codegen-SNAPSHOT.jar
[INFO] ----------------------------------------------------------------------------
[INFO] Building Apache Axis 2.0 - tool - Ant Plugin
[INFO]    task-segment: [clean, install]
[INFO] ----------------------------------------------------------------------------
[INFO] [clean:clean]
[INFO] Deleting directory /export/home/illsleyd/continuum/continuum-1.0.3/apps/continuum/working-directory/61/modules/tool/axis2-ant-plugin/target
[INFO] Deleting directory /export/home/illsleyd/continuum/continuum-1.0.3/apps/continuum/working-directory/61/modules/tool/axis2-ant-plugin/target/classes
[INFO] Deleting directory /export/home/illsleyd/continuum/continuum-1.0.3/apps/continuum/working-directory/61/modules/tool/axis2-ant-plugin/target/test-classes
[INFO] [plugin:descriptor]
[INFO] Using 2 extractors.
[INFO] Applying extractor for language: java
[INFO] Extractor for language: java found 0 mojo descriptors.
[INFO] Applying extractor for language: bsh
[INFO] Extractor for language: bsh found 0 mojo descriptors.
[INFO] [resources:resources]
[INFO] Using default encoding to copy filtered resources.
Downloading: http://repo1.maven.org/maven2//woodstox/wstx/asl-3.0.0/wstx-asl-3.0.0.pom
[WARNING] Unable to get resource from repository repo1 (http://repo1.maven.org/maven2/)
Downloading: http://ibiblio.org/maven//woodstox/poms/wstx-asl-3.0.0.pom
[WARNING] Unable to get resource from repository ibiblio (http://ibiblio.org/maven/)
Downloading: http://people.apache.org/repo/m1-ibiblio-rsync-repository//woodstox/poms/wstx-asl-3.0.0.pom
[WARNING] Unable to get resource from repository apache-m1 (http://people.apache.org/repo/m1-ibiblio-rsync-repository/)
Downloading: http://people.apache.org/repository//woodstox/poms/wstx-asl-3.0.0.pom
[WARNING] Unable to get resource from repository apache-people-repo (http://people.apache.org/repository/)
Downloading: http://ws.zones.apache.org/repository2//woodstox/poms/wstx-asl-3.0.0.pom
[WARNING] Unable to get resource from repository ws-zones (http://ws.zones.apache.org/repository2/)
Downloading: http://ws.zones.apache.org/repository2//woodstox/wstx/asl-3.0.0/wstx-asl-3.0.0.pom
[WARNING] Unable to get resource from repository apache-ws-snapshots2 (http://ws.zones.apache.org/repository2/)
Downloading: http://repo1.maven.org/maven2//woodstox/wstx/asl-3.0.0/wstx-asl-3.0.0.pom
[WARNING] Unable to get resource from repository maven2 (http://repo1.maven.org/maven2/)
Downloading: http://repo1.maven.org/maven2/woodstox/wstx/asl-3.0.0/wstx-asl-3.0.0.pom
[WARNING] Unable to get resource from repository central (http://repo1.maven.org/maven2)
[WARNING] 
	Artifact commons-httpclient:commons-httpclient:jar:3.0.1:runtime retains local scope 'runtime' overriding broader scope 'compile'
	given by a dependency. If this is not intended, modify or remove the local scope.

[INFO] [compiler:compile]
[INFO] Compiling 1 source file to /export/home/illsleyd/continuum/continuum-1.0.3/apps/continuum/working-directory/61/modules/tool/axis2-ant-plugin/target/classes
[INFO] [resources:testResources]
[INFO] Using default encoding to copy filtered resources.
[INFO] [compiler:testCompile]
[INFO] No sources to compile
[INFO] [surefire:test]
[INFO] Tests are skipped.
[INFO] [jar:jar]
[INFO] Building jar: /export/home/illsleyd/continuum/continuum-1.0.3/apps/continuum/working-directory/61/modules/tool/axis2-ant-plugin/target/axis2-ant-plugin-SNAPSHOT.jar
[INFO] [plugin:addPluginArtifactMetadata]
[INFO] [install:install]
[INFO] Installing /export/home/illsleyd/continuum/continuum-1.0.3/apps/continuum/working-directory/61/modules/tool/axis2-ant-plugin/target/axis2-ant-plugin-SNAPSHOT.jar to /export/home/illsleyd/.m2/repository/org/apache/axis2/axis2-ant-plugin/SNAPSHOT/axis2-ant-plugin-SNAPSHOT.jar
[INFO] [plugin:updateRegistry]
[INFO] ----------------------------------------------------------------------------
[INFO] Building Apache Axis 2.0 - tool - Intellij IDEA Plugin
[INFO]    task-segment: [clean, install]
[INFO] ----------------------------------------------------------------------------
[INFO] [clean:clean]
[INFO] Deleting directory /export/home/illsleyd/continuum/continuum-1.0.3/apps/continuum/working-directory/61/modules/tool/axis2-idea-plugin/target
[INFO] Deleting directory /export/home/illsleyd/continuum/continuum-1.0.3/apps/continuum/working-directory/61/modules/tool/axis2-idea-plugin/target/classes
[INFO] Deleting directory /export/home/illsleyd/continuum/continuum-1.0.3/apps/continuum/working-directory/61/modules/tool/axis2-idea-plugin/target/test-classes
[INFO] [plugin:descriptor]
[INFO] Using 2 extractors.
[INFO] Applying extractor for language: java
[INFO] Extractor for language: java found 0 mojo descriptors.
[INFO] Applying extractor for language: bsh
[INFO] Extractor for language: bsh found 0 mojo descriptors.
[INFO] [resources:resources]
[INFO] Using default encoding to copy filtered resources.
[INFO] [compiler:compile]
[INFO] Compiling 37 source files to /export/home/illsleyd/continuum/continuum-1.0.3/apps/continuum/working-directory/61/modules/tool/axis2-idea-plugin/target/classes
[INFO] ------------------------------------------------------------------------
[ERROR] BUILD FAILURE
[INFO] ------------------------------------------------------------------------
[INFO] Compilation failure

/export/home/illsleyd/continuum/continuum-1.0.3/apps/continuum/working-directory/61/modules/tool/axis2-idea-plugin/src/main/java/org/apache/axis2/tools/bean/CodegenBean.java:[368,49] cannot find symbol
symbol  : constructor CodeGenConfiguration(org.apache.axis2.description.AxisService,java.util.Map)
location: class org.apache.axis2.wsdl.codegen.CodeGenConfiguration

/export/home/illsleyd/continuum/continuum-1.0.3/apps/continuum/working-directory/61/modules/tool/axis2-idea-plugin/src/main/java/org/apache/axis2/tools/bean/CodegenBean.java:[374,53] cannot find symbol
symbol  : constructor CodeGenConfiguration(org.apache.axis2.description.AxisService,java.util.Map)
location: class org.apache.axis2.wsdl.codegen.CodeGenConfiguration


[INFO] ------------------------------------------------------------------------
[INFO] For more information, run Maven with the -e switch
[INFO] ------------------------------------------------------------------------
[INFO] Total time: 6 minutes 6 seconds
[INFO] Finished at: Tue Mar 13 16:13:04 GMT+00:00 2007
[INFO] Final Memory: 42M/321M
[INFO] ------------------------------------------------------------------------

****************************************************************************



---------------------------------------------------------------------
To unsubscribe, e-mail: axis-cvs-unsubscribe@ws.apache.org
For additional commands, e-mail: axis-cvs-help@ws.apache.org


Mime
View raw message