axis-java-dev mailing list archives

Site index · List index
Message view « Date » · « Thread »
Top « Date » · « Thread »
From "davidillsley (Continuum)" <davidills...@apache.org>
Subject [continuum] BUILD FAILURE: Apache Axis 2.0 - Root
Date Mon, 05 Mar 2007 16:22:19 GMT
Online report : http://localhost:8080/continuum/servlet/continuum/target/ProjectBuild.vm/view/ProjectBuild/id/61/buildId/1223
Build statistics:
  State: Failed
  Previous State: Ok
  Started at: Mon, 5 Mar 2007 16:20:31 +0000
  Finished at: Mon, 5 Mar 2007 16:22:17 +0000
  Total time: 1m 45s
  Build Trigger: Schedule
  Exit code: 1
  Building machine hostname: ws.zones.apache.org
  Operating system : SunOS(unknown)
  Java version : 1.5.0_09(Sun Microsystems Inc.)

Changes
         barrettj          Add DescriptionFactory.createServiceDescription(Class) method to create a ServiceDescription hierachy for a single WebService implementation class.
Change current testcases to use that method instead of createServiceDescrition(Class, AxisService) and mark that method as deprectated.
Fixed various problems in the Description and converter code uncovered by the testcases.
             /webservices/axis2/trunk/java/modules/metadata/src/org/apache/axis2/jaxws/description/DescriptionFactory.java
            /webservices/axis2/trunk/java/modules/metadata/src/org/apache/axis2/jaxws/description/builder/DescriptionBuilderUtils.java
            /webservices/axis2/trunk/java/modules/metadata/src/org/apache/axis2/jaxws/description/builder/ServiceModeAnnot.java
            /webservices/axis2/trunk/java/modules/metadata/src/org/apache/axis2/jaxws/description/builder/converter/ConverterUtils.java
            /webservices/axis2/trunk/java/modules/metadata/src/org/apache/axis2/jaxws/description/builder/converter/JavaClassToDBCConverter.java
            /webservices/axis2/trunk/java/modules/metadata/src/org/apache/axis2/jaxws/description/builder/converter/JavaMethodsToMDCConverter.java
            /webservices/axis2/trunk/java/modules/metadata/src/org/apache/axis2/jaxws/description/impl/DescriptionFactoryImpl.java
            /webservices/axis2/trunk/java/modules/metadata/src/org/apache/axis2/jaxws/description/impl/EndpointDescriptionImpl.java
            /webservices/axis2/trunk/java/modules/metadata/src/org/apache/axis2/jaxws/description/impl/ParameterDescriptionImpl.java
            /webservices/axis2/trunk/java/modules/metadata/src/org/apache/axis2/jaxws/description/impl/ServiceDescriptionImpl.java
            /webservices/axis2/trunk/java/modules/metadata/test/org/apache/axis2/jaxws/description/AnnotationProviderImplDescriptionTests.java
            /webservices/axis2/trunk/java/modules/metadata/test/org/apache/axis2/jaxws/description/AnnotationServiceImplDescriptionTests.java
            /webservices/axis2/trunk/java/modules/metadata/test/org/apache/axis2/jaxws/description/DocLitWrappedImplWithSEI.java
            /webservices/axis2/trunk/java/modules/metadata/test/org/apache/axis2/jaxws/description/ServiceAnnotationTests.java
            /webservices/axis2/trunk/java/modules/metadata/test/org/apache/axis2/jaxws/description/WrapperPackageTests.java
            /webservices/axis2/trunk/java/modules/metadata/test/org/apache/axis2/jaxws/description/builder/converter/ReflectiveConverterTests.java
            /webservices/axis2/trunk/java/modules/metadata/test/org/apache/ws/axis2/tests/EchoServiceImplWithSEI.java
            /webservices/axis2/trunk/java/modules/metadata/test-resources/commons-logging.properties
            /webservices/axis2/trunk/java/modules/metadata/test-resources/log4j.properties
           pradine          Do something more useful than throw an exception.
             /webservices/axis2/trunk/java/modules/kernel/src/org/apache/axis2/engine/AddressingBasedDispatcher.java
           barrettj          Add assertion that AxisService attached to EndpointDescription is not null.
             /webservices/axis2/trunk/java/modules/metadata/test/org/apache/axis2/jaxws/description/AnnotationServiceImplDescriptionTests.java
           pradine          Remove redundant message.
             /webservices/axis2/trunk/java/modules/kernel/src/org/apache/axis2/i18n/resource.properties
           barrettj          Cleanup and condense Description composites toString output.
             /webservices/axis2/trunk/java/modules/metadata/src/org/apache/axis2/jaxws/description/builder/DescriptionBuilderComposite.java
            /webservices/axis2/trunk/java/modules/metadata/src/org/apache/axis2/jaxws/description/builder/MethodDescriptionComposite.java
            /webservices/axis2/trunk/java/modules/metadata/src/org/apache/axis2/jaxws/description/builder/ParameterDescriptionComposite.java
           barrettj          AXIS2-2272
Submitted by Dustin Amrhein.  Allow https on imported schema docs.
             /webservices/axis2/trunk/java/modules/metadata/src/org/apache/axis2/jaxws/description/impl/URIResolverImpl.java
           amilas          applied the patch for AXIS2-1993.

             /webservices/axis2/trunk/java/modules/xmlbeans/src/org/apache/axis2/xmlbeans/CodeGenerationUtility.java
           keithc          Fixing default SOAP version
             /webservices/axis2/trunk/java/modules/kernel/src/org/apache/axis2/description/WSDL20DefaultValueHolder.java
           amilas          check for soap version using the namespace

             /webservices/axis2/trunk/java/modules/codegen/src/org/apache/axis2/wsdl/template/java/InterfaceImplementationTemplate.xsl
           sandakith          fix the eclipse plugin maven 2 build, 
	axis2 dependencies added in more finer grained dependencies since axis2-*.jar is not generated 

             /webservices/axis2/trunk/java/modules/tool/axis2-eclipse-codegen-plugin/pom.xml
            /webservices/axis2/trunk/java/modules/tool/axis2-eclipse-service-plugin/pom.xml
           sandakith          moved plugins to more fine grained dependencies of axis2

             /webservices/axis2/trunk/java/modules/tool/conf/codegen/.classpath
            /webservices/axis2/trunk/java/modules/tool/conf/codegen/build.properties
            /webservices/axis2/trunk/java/modules/tool/conf/codegen/plugin.xml
            /webservices/axis2/trunk/java/modules/tool/conf/service/.classpath
            /webservices/axis2/trunk/java/modules/tool/conf/service/build.properties
            /webservices/axis2/trunk/java/modules/tool/conf/service/plugin.xml
           deepal          Change POJO deloyer to use JAX-WS
             /webservices/axis2/trunk/java/modules/adb/src/org/apache/axis2/databinding/typemapping/SimpleTypeMapper.java
            /webservices/axis2/trunk/java/modules/kernel/src/org/apache/axis2/deployment/POJODeployer.java
            /webservices/axis2/trunk/java/modules/kernel/src/org/apache/axis2/deployment/util/Utils.java
            /webservices/axis2/trunk/java/modules/metadata/src/org/apache/axis2/jaxws/description/DescriptionFactory.java
           keithc          Fixing test failure

             /webservices/axis2/trunk/java/modules/integration/test/samples/wsdl/perf/PerfPortTypeTest.java
           keithc          Adding formatters and Builders for REST
Refractoring RESTUtil
Adding URIEncoderDecoder to facilitate url encoding and decoding
Adding put and delete methods to HTTPWorker


             /webservices/axis2/trunk/java/modules/kernel/conf/axis2.xml
            /webservices/axis2/trunk/java/modules/kernel/src/org/apache/axis2/builder/ApplicationXMLBuilder.java
            /webservices/axis2/trunk/java/modules/kernel/src/org/apache/axis2/builder/BuilderUtil.java
            /webservices/axis2/trunk/java/modules/kernel/src/org/apache/axis2/builder/MultipartFormDataBuilder.java
            /webservices/axis2/trunk/java/modules/kernel/src/org/apache/axis2/builder/XFormURLEncodedBuilder.java
            /webservices/axis2/trunk/java/modules/kernel/src/org/apache/axis2/deployment/axis2_default.xml
            /webservices/axis2/trunk/java/modules/kernel/src/org/apache/axis2/description/AxisService.java
            /webservices/axis2/trunk/java/modules/kernel/src/org/apache/axis2/description/WSDL20ToAxisServiceBuilder.java
            /webservices/axis2/trunk/java/modules/kernel/src/org/apache/axis2/description/WSDL2Constants.java
            /webservices/axis2/trunk/java/modules/kernel/src/org/apache/axis2/transport/TransportUtils.java
            /webservices/axis2/trunk/java/modules/kernel/src/org/apache/axis2/transport/http/AxisServlet.java
            /webservices/axis2/trunk/java/modules/kernel/src/org/apache/axis2/transport/http/HTTPConstants.java
            /webservices/axis2/trunk/java/modules/kernel/src/org/apache/axis2/transport/http/HTTPSender.java
            /webservices/axis2/trunk/java/modules/kernel/src/org/apache/axis2/transport/http/HTTPTransportUtils.java
            /webservices/axis2/trunk/java/modules/kernel/src/org/apache/axis2/transport/http/HTTPWorker.java
            /webservices/axis2/trunk/java/modules/kernel/src/org/apache/axis2/transport/http/MultipartFormDataFormatter.java
            /webservices/axis2/trunk/java/modules/kernel/src/org/apache/axis2/transport/http/util/RESTUtil.java
            /webservices/axis2/trunk/java/modules/kernel/src/org/apache/axis2/transport/http/util/URIEncoderDecoder.java
            /webservices/axis2/trunk/java/modules/kernel/src/org/apache/axis2/transport/http/util/URLTemplatingUtil.java
            /webservices/axis2/trunk/java/modules/kernel/src/org/apache/axis2/util/MultipleEntryHashMap.java
            /webservices/axis2/trunk/java/modules/kernel/src/org/apache/axis2/util/SchemaUtil.java
            /webservices/axis2/trunk/java/modules/kernel/test/org/apache/axis2/transport/http/util
            /webservices/axis2/trunk/java/modules/kernel/test/org/apache/axis2/transport/http/util/URLTemplatingUtilTest.java
            /webservices/axis2/trunk/java/modules/kernel/test/org/apache/axis2/util/SchemaUtilTest.java
           keithc          Removing dependancy to HTTPServletRequest
             /webservices/axis2/trunk/java/modules/kernel/src/org/apache/axis2/engine/HTTPLocationBasedDispatcher.java
           dims          Fix for AXIS2-1956 - SAAJ 1.3 implementation (Removed implementation code from saap-api module. fixed Base64 check.Code clean up.)
             /webservices/axis2/trunk/java/modules/saaj/src/org/apache/axis2/saaj/AttachmentPartImpl.java
            /webservices/axis2/trunk/java/modules/saaj/src/org/apache/axis2/saaj/DetailEntryImpl.java
            /webservices/axis2/trunk/java/modules/saaj/src/org/apache/axis2/saaj/DetailImpl.java
            /webservices/axis2/trunk/java/modules/saaj/src/org/apache/axis2/saaj/MessageFactoryImpl.java
            /webservices/axis2/trunk/java/modules/saaj/src/org/apache/axis2/saaj/SAAJMetaFactoryImpl.java
            /webservices/axis2/trunk/java/modules/saaj/src/org/apache/axis2/saaj/SOAPBodyElementImpl.java
            /webservices/axis2/trunk/java/modules/saaj/src/org/apache/axis2/saaj/SOAPBodyImpl.java
            /webservices/axis2/trunk/java/modules/saaj/src/org/apache/axis2/saaj/SOAPConnectionImpl.java
            /webservices/axis2/trunk/java/modules/saaj/src/org/apache/axis2/saaj/SOAPElementImpl.java
            /webservices/axis2/trunk/java/modules/saaj/src/org/apache/axis2/saaj/SOAPEnvelopeImpl.java
            /webservices/axis2/trunk/java/modules/saaj/src/org/apache/axis2/saaj/SOAPFactoryImpl.java
            /webservices/axis2/trunk/java/modules/saaj/src/org/apache/axis2/saaj/SOAPFaultImpl.java
            /webservices/axis2/trunk/java/modules/saaj/src/org/apache/axis2/saaj/SOAPHeaderImpl.java
            /webservices/axis2/trunk/java/modules/saaj/src/org/apache/axis2/saaj/SOAPMessageImpl.java
            /webservices/axis2/trunk/java/modules/saaj/src/org/apache/axis2/saaj/SOAPPartImpl.java
            /webservices/axis2/trunk/java/modules/saaj/test/org/apache/axis2/saaj/AttachmentTest.java
            /webservices/axis2/trunk/java/modules/saaj/test/org/apache/axis2/saaj/SOAPEnvelopeTest.java
            /webservices/axis2/trunk/java/modules/saaj/test/org/apache/axis2/saaj/SOAPFactoryTest.java
            /webservices/axis2/trunk/java/modules/saaj/test/org/apache/axis2/saaj/SOAPMessageTest.java
            /webservices/axis2/trunk/java/modules/saaj/test/org/apache/axis2/saaj/SOAPPartTest.java
            /webservices/axis2/trunk/java/modules/saaj-api/src/javax/xml/soap/MessageFactory.java
            /webservices/axis2/trunk/java/modules/saaj-api/src/javax/xml/soap/SAAJResult.java
            /webservices/axis2/trunk/java/modules/saaj-api/src/javax/xml/soap/SOAPConnection.java
            /webservices/axis2/trunk/java/modules/saaj-api/src/javax/xml/soap/SOAPFactory.java
           dims          fix G build break
             /webservices/axis2/trunk/java/modules/kernel/src/org/apache/axis2/transport/http/HTTPTransportUtils.java
           dims          move code that sets the message receivers to the pojodeployer
             /webservices/axis2/trunk/java/modules/kernel/src/org/apache/axis2/deployment/POJODeployer.java
            /webservices/axis2/trunk/java/modules/kernel/src/org/apache/axis2/deployment/util/Utils.java
           keithc          Fixing few issues in HTTPLocation based dispatching and XFormURLEncodedBuilder

             /webservices/axis2/trunk/java/modules/kernel/src/org/apache/axis2/builder/XFormURLEncodedBuilder.java
            /webservices/axis2/trunk/java/modules/kernel/src/org/apache/axis2/engine/HTTPLocationBasedDispatcher.java
            /webservices/axis2/trunk/java/modules/kernel/src/org/apache/axis2/transport/http/util/RESTUtil.java
           keithc          marked processHTTPGetRequest as deprecated use RESTUtil.processURLRequest instead
             /webservices/axis2/trunk/java/modules/kernel/src/org/apache/axis2/transport/http/HTTPTransportUtils.java
           deepal          fixing AXIS2-1982
             /webservices/axis2/trunk/java/modules/adb/src/org/apache/axis2/databinding/typemapping/SimpleTypeMapper.java
            /webservices/axis2/trunk/java/modules/adb/src/org/apache/axis2/databinding/utils/BeanUtil.java
            /webservices/axis2/trunk/java/modules/adb/src/org/apache/axis2/rpc/receivers/RPCUtil.java
            /webservices/axis2/trunk/java/modules/java2wsdl/src/org/apache/ws/java2wsdl/SchemaGenerator.java
            /webservices/axis2/trunk/java/modules/kernel/conf/axis2.xml
            /webservices/axis2/trunk/java/modules/kernel/src/org/apache/axis2/deployment/axis2_default.xml
           sanjiva          removed extraneous ^M at EOL
             /webservices/axis2/trunk/java/README.txt
           keithc          Fixing client side issues in handling REST respnses
Fixing issues in XFormURLEncodedBuilder

             /webservices/axis2/trunk/java/modules/kernel/src/org/apache/axis2/builder/XFormURLEncodedBuilder.java
            /webservices/axis2/trunk/java/modules/kernel/src/org/apache/axis2/transport/TransportUtils.java
            /webservices/axis2/trunk/java/modules/kernel/src/org/apache/axis2/transport/http/AbstractHTTPSender.java
           deepal          applied the patch in AXIS2-2212
Thx Angel Todorov
             /webservices/axis2/trunk/java/modules/kernel/src/org/apache/axis2/deployment/Deployer.java
            /webservices/axis2/trunk/java/modules/kernel/src/org/apache/axis2/deployment/DeploymentEngine.java
            /webservices/axis2/trunk/java/modules/kernel/src/org/apache/axis2/deployment/RepositoryListener.java
            /webservices/axis2/trunk/java/modules/kernel/src/org/apache/axis2/deployment/ServiceDeployer.java
            /webservices/axis2/trunk/java/modules/kernel/src/org/apache/axis2/deployment/repository/util/WSInfoList.java
           keithc          Fixing listServices in HTTPWorker
             /webservices/axis2/trunk/java/modules/kernel/src/org/apache/axis2/transport/http/HTTPWorker.java
           deepal          fixing AXIS2-2192
             /webservices/axis2/trunk/java/modules/java2wsdl/src/org/apache/ws/java2wsdl/SchemaGenerator.java
           keithc          Removing unnecessary if condition

             /webservices/axis2/trunk/java/modules/kernel/src/org/apache/axis2/transport/http/HTTPWorker.java
           amilas          Added the http binding support to wsdl11 code generation

             /webservices/axis2/trunk/java/modules/codegen/src/org/apache/axis2/wsdl/codegen/emitter/AxisServiceBasedMultiLanguageEmitter.java
            /webservices/axis2/trunk/java/modules/kernel/src/org/apache/axis2/description/WSDL11ToAxisServiceBuilder.java
            /webservices/axis2/trunk/java/modules/kernel/src/org/apache/axis2/wsdl/HttpAddress.java
           keithc          Adding default REST builders
             /webservices/axis2/trunk/java/modules/kernel/src/org/apache/axis2/deployment/AxisConfigBuilder.java
           thilina          Adding message formatter support for mail transport
Making defualt builders overridable

             /webservices/axis2/trunk/java/modules/kernel/src/org/apache/axis2/deployment/AxisConfigBuilder.java
            /webservices/axis2/trunk/java/modules/kernel/src/org/apache/axis2/transport/TransportUtils.java
            /webservices/axis2/trunk/java/modules/kernel/src/org/apache/axis2/transport/http/CommonsHTTPTransportSender.java
            /webservices/axis2/trunk/java/modules/kernel/src/org/apache/axis2/transport/http/HTTPTransportUtils.java
            /webservices/axis2/trunk/java/modules/kernel/src/org/apache/axis2/transport/mail/MailTransportSender.java
            /webservices/axis2/trunk/java/modules/kernel/src/org/apache/axis2/transport/mail/SimpleMailListener.java
           dims          Fix for AXIS2-2283 - dist-war goal - <axis2-trunk>/modules/json/target not found
             /webservices/axis2/trunk/java/etc/project.properties
           barrettj          AXIS2-2284
Re-enable the JAXWS dispatch tests.
             /webservices/axis2/trunk/java/modules/jaxws/test/org/apache/axis2/jaxws/framework/JAXWSTest.java
           barrettj          AXIS2-2286
Support for Doc/Lit/Bare operation routing in metadata layer.
             /webservices/axis2/trunk/java/modules/metadata/src/org/apache/axis2/jaxws/description/impl/EndpointInterfaceDescriptionImpl.java
            /webservices/axis2/trunk/java/modules/metadata/src/org/apache/axis2/jaxws/description/impl/OperationDescriptionImpl.java
            /webservices/axis2/trunk/java/modules/metadata/test/org/apache/axis2/jaxws/description/DocLitBareResolveOperationTests.java
           dims          Don't use com.sun
             /webservices/axis2/trunk/java/modules/saaj/test/org/apache/axis2/saaj/AttachmentTest.java
           dims          switch the m2 poms to use Geronimo's mail & activation jar
             /webservices/axis2/trunk/java/modules/java2wsdl/pom.xml
            /webservices/axis2/trunk/java/modules/parent/pom.xml
            /webservices/axis2/trunk/java/modules/saaj-api/pom.xml
            /webservices/axis2/trunk/java/modules/tool/axis2-ant-plugin/pom.xml
            /webservices/axis2/trunk/java/modules/tool/axis2-eclipse-codegen-plugin/build.xml
            /webservices/axis2/trunk/java/modules/tool/axis2-eclipse-codegen-plugin/eclipse-codegen-plugin-assembly.xml
            /webservices/axis2/trunk/java/modules/tool/axis2-eclipse-codegen-plugin/pom.xml
            /webservices/axis2/trunk/java/modules/tool/axis2-idea-plugin/pom.xml
            /webservices/axis2/trunk/java/modules/tool/conf/codegen/build.properties
            /webservices/axis2/trunk/java/modules/tool/conf/codegen/plugin.xml
           dims          log error(s)
             /webservices/axis2/trunk/java/modules/saaj/src/org/apache/axis2/saaj/SOAPPartImpl.java
           dims          don't allow someone to set encoding style under soap 1.2 for body/fault/faultelement/envelope/detail elements
             /webservices/axis2/trunk/java/modules/saaj/src/org/apache/axis2/saaj/SOAPElementImpl.java
            /webservices/axis2/trunk/java/modules/saaj/src/org/apache/axis2/saaj/SOAPEnvelopeImpl.java
           gdaniels          Some code cleanup.  This is an example of using IDEA's code reformatter, which as per list discussion we should be running over the whole codebase before cutting the branch for each release.

(now, if it could only fix typos/spelling errors... :) )
             /webservices/axis2/trunk/java/modules/kernel/src/org/apache/axis2/AxisFault.java
            /webservices/axis2/trunk/java/modules/kernel/src/org/apache/axis2/Constants.java
            /webservices/axis2/trunk/java/modules/kernel/src/org/apache/axis2/addressing/AddressingConstants.java
            /webservices/axis2/trunk/java/modules/kernel/src/org/apache/axis2/addressing/AddressingHelper.java
            /webservices/axis2/trunk/java/modules/kernel/src/org/apache/axis2/addressing/EndpointReference.java
            /webservices/axis2/trunk/java/modules/kernel/src/org/apache/axis2/addressing/EndpointReferenceHelper.java
            /webservices/axis2/trunk/java/modules/kernel/src/org/apache/axis2/addressing/RelatesTo.java
            /webservices/axis2/trunk/java/modules/kernel/src/org/apache/axis2/addressing/ServiceName.java
            /webservices/axis2/trunk/java/modules/kernel/src/org/apache/axis2/addressing/wsdl/WSDL11ActionHelper.java
            /webservices/axis2/trunk/java/modules/kernel/src/org/apache/axis2/addressing/wsdl/WSDL11DefaultActionPatternHelper.java
            /webservices/axis2/trunk/java/modules/kernel/src/org/apache/axis2/builder/ApplicationXMLBuilder.java
            /webservices/axis2/trunk/java/modules/kernel/src/org/apache/axis2/builder/Builder.java
            /webservices/axis2/trunk/java/modules/kernel/src/org/apache/axis2/builder/BuilderUtil.java
            /webservices/axis2/trunk/java/modules/kernel/src/org/apache/axis2/builder/MIMEBuilder.java
            /webservices/axis2/trunk/java/modules/kernel/src/org/apache/axis2/builder/MTOMBuilder.java
            /webservices/axis2/trunk/java/modules/kernel/src/org/apache/axis2/builder/MultipartFormDataBuilder.java
            /webservices/axis2/trunk/java/modules/kernel/src/org/apache/axis2/builder/SOAPBuilder.java
            /webservices/axis2/trunk/java/modules/kernel/src/org/apache/axis2/builder/XFormURLEncodedBuilder.java
            /webservices/axis2/trunk/java/modules/kernel/src/org/apache/axis2/client/OperationClient.java
            /webservices/axis2/trunk/java/modules/kernel/src/org/apache/axis2/client/Options.java
            /webservices/axis2/trunk/java/modules/kernel/src/org/apache/axis2/client/ServiceClient.java
            /webservices/axis2/trunk/java/modules/kernel/src/org/apache/axis2/client/Stub.java
            /webservices/axis2/trunk/java/modules/kernel/src/org/apache/axis2/client/WSDLBasedPolicyProcessor.java
            /webservices/axis2/trunk/java/modules/kernel/src/org/apache/axis2/client/async/AsyncResult.java
            /webservices/axis2/trunk/java/modules/kernel/src/org/apache/axis2/cluster/ClusterManager.java
            /webservices/axis2/trunk/java/modules/kernel/src/org/apache/axis2/context/AbstractContext.java
            /webservices/axis2/trunk/java/modules/kernel/src/org/apache/axis2/context/ConfigurationContext.java
            /webservices/axis2/trunk/java/modules/kernel/src/org/apache/axis2/context/ConfigurationContextFactory.java
            /webservices/axis2/trunk/java/modules/kernel/src/org/apache/axis2/context/ContextFactory.java
            /webservices/axis2/trunk/java/modules/kernel/src/org/apache/axis2/context/MessageContext.java
            /webservices/axis2/trunk/java/modules/kernel/src/org/apache/axis2/context/MessageContextConstants.java
            /webservices/axis2/trunk/java/modules/kernel/src/org/apache/axis2/context/OperationContext.java
            /webservices/axis2/trunk/java/modules/kernel/src/org/apache/axis2/context/OperationContextFactory.java
            /webservices/axis2/trunk/java/modules/kernel/src/org/apache/axis2/context/SelfManagedDataManager.java
            /webservices/axis2/trunk/java/modules/kernel/src/org/apache/axis2/context/ServiceContext.java
            /webservices/axis2/trunk/java/modules/kernel/src/org/apache/axis2/context/ServiceGroupContext.java
            /webservices/axis2/trunk/java/modules/kernel/src/org/apache/axis2/context/SessionContext.java
            /webservices/axis2/trunk/java/modules/kernel/src/org/apache/axis2/dataretrieval/AxisDataLocator.java
            /webservices/axis2/trunk/java/modules/kernel/src/org/apache/axis2/dataretrieval/AxisDataLocatorImpl.java
            /webservices/axis2/trunk/java/modules/kernel/src/org/apache/axis2/dataretrieval/BaseAxisDataLocator.java
            /webservices/axis2/trunk/java/modules/kernel/src/org/apache/axis2/dataretrieval/DRConstants.java
            /webservices/axis2/trunk/java/modules/kernel/src/org/apache/axis2/dataretrieval/Data.java
            /webservices/axis2/trunk/java/modules/kernel/src/org/apache/axis2/dataretrieval/DataLocatorFactory.java
            /webservices/axis2/trunk/java/modules/kernel/src/org/apache/axis2/dataretrieval/DataRetrievalException.java
            /webservices/axis2/trunk/java/modules/kernel/src/org/apache/axis2/dataretrieval/DataRetrievalRequest.java
            /webservices/axis2/trunk/java/modules/kernel/src/org/apache/axis2/dataretrieval/DataRetrievalUtil.java
            /webservices/axis2/trunk/java/modules/kernel/src/org/apache/axis2/dataretrieval/LocatorType.java
            /webservices/axis2/trunk/java/modules/kernel/src/org/apache/axis2/dataretrieval/OutputForm.java
            /webservices/axis2/trunk/java/modules/kernel/src/org/apache/axis2/dataretrieval/PolicyDataLocator.java
            /webservices/axis2/trunk/java/modules/kernel/src/org/apache/axis2/dataretrieval/SchemaDataLocator.java
            /webservices/axis2/trunk/java/modules/kernel/src/org/apache/axis2/dataretrieval/ServiceData.java
            /webservices/axis2/trunk/java/modules/kernel/src/org/apache/axis2/dataretrieval/WSDLDataLocator.java
            /webservices/axis2/trunk/java/modules/kernel/src/org/apache/axis2/dataretrieval/client/MexClient.java
            /webservices/axis2/trunk/java/modules/kernel/src/org/apache/axis2/deployment/AxisConfigBuilder.java
            /webservices/axis2/trunk/java/modules/kernel/src/org/apache/axis2/deployment/ClusterBuilder.java
            /webservices/axis2/trunk/java/modules/kernel/src/org/apache/axis2/deployment/Deployer.java
            /webservices/axis2/trunk/java/modules/kernel/src/org/apache/axis2/deployment/DeploymentConstants.java
            /webservices/axis2/trunk/java/modules/kernel/src/org/apache/axis2/deployment/DeploymentEngine.java
            /webservices/axis2/trunk/java/modules/kernel/src/org/apache/axis2/deployment/DescriptionBuilder.java
            /webservices/axis2/trunk/java/modules/kernel/src/org/apache/axis2/deployment/FileSystemConfigurator.java
            /webservices/axis2/trunk/java/modules/kernel/src/org/apache/axis2/deployment/ModuleBuilder.java
            /webservices/axis2/trunk/java/modules/kernel/src/org/apache/axis2/deployment/ModuleDeployer.java
            /webservices/axis2/trunk/java/modules/kernel/src/org/apache/axis2/deployment/POJODeployer.java
            /webservices/axis2/trunk/java/modules/kernel/src/org/apache/axis2/deployment/RepositoryListener.java
            /webservices/axis2/trunk/java/modules/kernel/src/org/apache/axis2/deployment/ServiceBuilder.java
            /webservices/axis2/trunk/java/modules/kernel/src/org/apache/axis2/deployment/ServiceDeployer.java
            /webservices/axis2/trunk/java/modules/kernel/src/org/apache/axis2/deployment/ServiceGroupBuilder.java
            /webservices/axis2/trunk/java/modules/kernel/src/org/apache/axis2/deployment/URLBasedAxisConfigurator.java
            /webservices/axis2/trunk/java/modules/kernel/src/org/apache/axis2/deployment/WarBasedAxisConfigurator.java
            /webservices/axis2/trunk/java/modules/kernel/src/org/apache/axis2/deployment/repository/util/ArchiveReader.java
            /webservices/axis2/trunk/java/modules/kernel/src/org/apache/axis2/deployment/repository/util/DeploymentFileData.java
            /webservices/axis2/trunk/java/modules/kernel/src/org/apache/axis2/deployment/repository/util/WSInfoList.java
            /webservices/axis2/trunk/java/modules/kernel/src/org/apache/axis2/deployment/resolver/AARBasedWSDLLocator.java
            /webservices/axis2/trunk/java/modules/kernel/src/org/apache/axis2/deployment/resolver/WarBasedWSDLLocator.java
            /webservices/axis2/trunk/java/modules/kernel/src/org/apache/axis2/deployment/resolver/WarFileBasedURIResolver.java
            /webservices/axis2/trunk/java/modules/kernel/src/org/apache/axis2/deployment/util/Utils.java
            /webservices/axis2/trunk/java/modules/kernel/src/org/apache/axis2/description/AxisBinding.java
            /webservices/axis2/trunk/java/modules/kernel/src/org/apache/axis2/description/AxisBindingMessage.java
            /webservices/axis2/trunk/java/modules/kernel/src/org/apache/axis2/description/AxisDescription.java
            /webservices/axis2/trunk/java/modules/kernel/src/org/apache/axis2/description/AxisEndpoint.java
            /webservices/axis2/trunk/java/modules/kernel/src/org/apache/axis2/description/AxisMessage.java
            /webservices/axis2/trunk/java/modules/kernel/src/org/apache/axis2/description/AxisModule.java
            /webservices/axis2/trunk/java/modules/kernel/src/org/apache/axis2/description/AxisOperation.java
            /webservices/axis2/trunk/java/modules/kernel/src/org/apache/axis2/description/AxisService.java
            /webservices/axis2/trunk/java/modules/kernel/src/org/apache/axis2/description/AxisService2OM.java
            /webservices/axis2/trunk/java/modules/kernel/src/org/apache/axis2/description/AxisService2WSDL2.java
            /webservices/axis2/trunk/java/modules/kernel/src/org/apache/axis2/description/ClientUtils.java
            /webservices/axis2/trunk/java/modules/kernel/src/org/apache/axis2/description/Flow.java
            /webservices/axis2/trunk/java/modules/kernel/src/org/apache/axis2/description/FlowInclude.java
            /webservices/axis2/trunk/java/modules/kernel/src/org/apache/axis2/description/InOnlyAxisOperation.java
            /webservices/axis2/trunk/java/modules/kernel/src/org/apache/axis2/description/InOutAxisOperation.java
            /webservices/axis2/trunk/java/modules/kernel/src/org/apache/axis2/description/OutInAxisOperation.java
            /webservices/axis2/trunk/java/modules/kernel/src/org/apache/axis2/description/OutOnlyAxisOperation.java
            /webservices/axis2/trunk/java/modules/kernel/src/org/apache/axis2/description/Parameter.java
            /webservices/axis2/trunk/java/modules/kernel/src/org/apache/axis2/description/ParameterIncludeImpl.java
            /webservices/axis2/trunk/java/modules/kernel/src/org/apache/axis2/description/PolicyInclude.java
            /webservices/axis2/trunk/java/modules/kernel/src/org/apache/axis2/description/RobustOutOnlyAxisOperation.java
            /webservices/axis2/trunk/java/modules/kernel/src/org/apache/axis2/description/TwoChannelAxisOperation.java
            /webservices/axis2/trunk/java/modules/kernel/src/org/apache/axis2/description/WSDL11ToAllAxisServicesBuilder.java
            /webservices/axis2/trunk/java/modules/kernel/src/org/apache/axis2/description/WSDL11ToAxisServiceBuilder.java
            /webservices/axis2/trunk/java/modules/kernel/src/org/apache/axis2/description/WSDL20DefaultValueHolder.java
            /webservices/axis2/trunk/java/modules/kernel/src/org/apache/axis2/description/WSDL20ToAllAxisServicesBuilder.java
            /webservices/axis2/trunk/java/modules/kernel/src/org/apache/axis2/description/WSDL20ToAxisServiceBuilder.java
            /webservices/axis2/trunk/java/modules/kernel/src/org/apache/axis2/description/WSDL2Constants.java
            /webservices/axis2/trunk/java/modules/kernel/src/org/apache/axis2/description/WSDLToAxisServiceBuilder.java
            /webservices/axis2/trunk/java/modules/kernel/src/org/apache/axis2/dispatchers/AbstractOperationDispatcher.java
            /webservices/axis2/trunk/java/modules/kernel/src/org/apache/axis2/dispatchers/AbstractServiceDispatcher.java
            /webservices/axis2/trunk/java/modules/kernel/src/org/apache/axis2/dispatchers/ActionBasedOperationDispatcher.java
            /webservices/axis2/trunk/java/modules/kernel/src/org/apache/axis2/dispatchers/RelatesToBasedOperationDispatcher.java
            /webservices/axis2/trunk/java/modules/kernel/src/org/apache/axis2/dispatchers/RelatesToBasedServiceDispatcher.java
            /webservices/axis2/trunk/java/modules/kernel/src/org/apache/axis2/dispatchers/RequestURIBasedOperationDispatcher.java
            /webservices/axis2/trunk/java/modules/kernel/src/org/apache/axis2/dispatchers/RequestURIBasedServiceDispatcher.java
            /webservices/axis2/trunk/java/modules/kernel/src/org/apache/axis2/dispatchers/SOAPMessageBodyBasedOperationDispatcher.java
            /webservices/axis2/trunk/java/modules/kernel/src/org/apache/axis2/dispatchers/SOAPMessageBodyBasedServiceDispatcher.java
            /webservices/axis2/trunk/java/modules/kernel/src/org/apache/axis2/engine/AbstractDispatcher.java
            /webservices/axis2/trunk/java/modules/kernel/src/org/apache/axis2/engine/AddressingBasedDispatcher.java
            /webservices/axis2/trunk/java/modules/kernel/src/org/apache/axis2/engine/AxisConfiguration.java
            /webservices/axis2/trunk/java/modules/kernel/src/org/apache/axis2/engine/AxisConfigurator.java
            /webservices/axis2/trunk/java/modules/kernel/src/org/apache/axis2/engine/AxisEngine.java
            /webservices/axis2/trunk/java/modules/kernel/src/org/apache/axis2/engine/AxisEvent.java
            /webservices/axis2/trunk/java/modules/kernel/src/org/apache/axis2/engine/DependencyManager.java
            /webservices/axis2/trunk/java/modules/kernel/src/org/apache/axis2/engine/DispatchPhase.java
            /webservices/axis2/trunk/java/modules/kernel/src/org/apache/axis2/engine/HTTPLocationBasedDispatcher.java
            /webservices/axis2/trunk/java/modules/kernel/src/org/apache/axis2/engine/Handler.java
            /webservices/axis2/trunk/java/modules/kernel/src/org/apache/axis2/engine/InstanceDispatcher.java
            /webservices/axis2/trunk/java/modules/kernel/src/org/apache/axis2/engine/ListenerManager.java
            /webservices/axis2/trunk/java/modules/kernel/src/org/apache/axis2/engine/Phase.java
            /webservices/axis2/trunk/java/modules/kernel/src/org/apache/axis2/engine/RequestURIBasedDispatcher.java
            /webservices/axis2/trunk/java/modules/kernel/src/org/apache/axis2/engine/RequestURIOperationDispatcher.java
            /webservices/axis2/trunk/java/modules/kernel/src/org/apache/axis2/engine/SOAPActionBasedDispatcher.java
            /webservices/axis2/trunk/java/modules/kernel/src/org/apache/axis2/engine/SOAPMessageBodyBasedDispatcher.java
            /webservices/axis2/trunk/java/modules/kernel/src/org/apache/axis2/handlers/AbstractHandler.java
            /webservices/axis2/trunk/java/modules/kernel/src/org/apache/axis2/i18n/MessageBundle.java
            /webservices/axis2/trunk/java/modules/kernel/src/org/apache/axis2/i18n/Messages.java
            /webservices/axis2/trunk/java/modules/kernel/src/org/apache/axis2/i18n/MessagesConstants.java
            /webservices/axis2/trunk/java/modules/kernel/src/org/apache/axis2/i18n/ProjectResourceBundle.java
            /webservices/axis2/trunk/java/modules/kernel/src/org/apache/axis2/i18n/RB.java
            /webservices/axis2/trunk/java/modules/kernel/src/org/apache/axis2/java/security/AccessController.java
            /webservices/axis2/trunk/java/modules/kernel/src/org/apache/axis2/modules/Module.java
            /webservices/axis2/trunk/java/modules/kernel/src/org/apache/axis2/modules/ModulePolicyExtension.java
            /webservices/axis2/trunk/java/modules/kernel/src/org/apache/axis2/modules/PolicyExtension.java
            /webservices/axis2/trunk/java/modules/kernel/src/org/apache/axis2/namespace/Constants.java
            /webservices/axis2/trunk/java/modules/kernel/src/org/apache/axis2/phaseresolver/PhaseHolder.java
            /webservices/axis2/trunk/java/modules/kernel/src/org/apache/axis2/receivers/AbstractInOutAsyncMessageReceiver.java
            /webservices/axis2/trunk/java/modules/kernel/src/org/apache/axis2/receivers/AbstractMessageReceiver.java
            /webservices/axis2/trunk/java/modules/kernel/src/org/apache/axis2/transport/MessageFormatter.java
            /webservices/axis2/trunk/java/modules/kernel/src/org/apache/axis2/transport/RequestResponseTransport.java
            /webservices/axis2/trunk/java/modules/kernel/src/org/apache/axis2/transport/SimpleAxis2Server.java
            /webservices/axis2/trunk/java/modules/kernel/src/org/apache/axis2/transport/TransportListener.java
            /webservices/axis2/trunk/java/modules/kernel/src/org/apache/axis2/transport/TransportSender.java
            /webservices/axis2/trunk/java/modules/kernel/src/org/apache/axis2/transport/TransportUtils.java
            /webservices/axis2/trunk/java/modules/kernel/src/org/apache/axis2/transport/http/AbstractAgent.java
            /webservices/axis2/trunk/java/modules/kernel/src/org/apache/axis2/transport/http/AbstractHTTPSender.java
            /webservices/axis2/trunk/java/modules/kernel/src/org/apache/axis2/transport/http/AdminAgent.java
            /webservices/axis2/trunk/java/modules/kernel/src/org/apache/axis2/transport/http/AxisAdminServlet.java
            /webservices/axis2/trunk/java/modules/kernel/src/org/apache/axis2/transport/http/AxisRequestEntity.java
            /webservices/axis2/trunk/java/modules/kernel/src/org/apache/axis2/transport/http/AxisServlet.java
            /webservices/axis2/trunk/java/modules/kernel/src/org/apache/axis2/transport/http/CommonsHTTPTransportSender.java
            /webservices/axis2/trunk/java/modules/kernel/src/org/apache/axis2/transport/http/HTTPConstants.java
            /webservices/axis2/trunk/java/modules/kernel/src/org/apache/axis2/transport/http/HTTPSender.java
            /webservices/axis2/trunk/java/modules/kernel/src/org/apache/axis2/transport/http/HTTPTransportReceiver.java
            /webservices/axis2/trunk/java/modules/kernel/src/org/apache/axis2/transport/http/HTTPTransportUtils.java
            /webservices/axis2/trunk/java/modules/kernel/src/org/apache/axis2/transport/http/HTTPWorker.java
            /webservices/axis2/trunk/java/modules/kernel/src/org/apache/axis2/transport/http/HTTPWorkerFactory.java
            /webservices/axis2/trunk/java/modules/kernel/src/org/apache/axis2/transport/http/HttpTransportProperties.java
            /webservices/axis2/trunk/java/modules/kernel/src/org/apache/axis2/transport/http/ListingAgent.java
            /webservices/axis2/trunk/java/modules/kernel/src/org/apache/axis2/transport/http/MultipartFormDataFormatter.java
            /webservices/axis2/trunk/java/modules/kernel/src/org/apache/axis2/transport/http/RESTRequestEntity.java
            /webservices/axis2/trunk/java/modules/kernel/src/org/apache/axis2/transport/http/SOAPMessageFormatter.java
            /webservices/axis2/trunk/java/modules/kernel/src/org/apache/axis2/transport/http/SimpleHTTPServer.java
            /webservices/axis2/trunk/java/modules/kernel/src/org/apache/axis2/transport/http/TransportHeaders.java
            /webservices/axis2/trunk/java/modules/kernel/src/org/apache/axis2/transport/http/server/AxisHttpService.java
            /webservices/axis2/trunk/java/modules/kernel/src/org/apache/axis2/transport/http/server/AxisParams.java
            /webservices/axis2/trunk/java/modules/kernel/src/org/apache/axis2/transport/http/server/ConnectionListenerFailureHandler.java
            /webservices/axis2/trunk/java/modules/kernel/src/org/apache/axis2/transport/http/server/DefaultConnectionListener.java
            /webservices/axis2/trunk/java/modules/kernel/src/org/apache/axis2/transport/http/server/DefaultConnectionListenerFailureHandler.java
            /webservices/axis2/trunk/java/modules/kernel/src/org/apache/axis2/transport/http/server/DefaultHttpConnectionFactory.java
            /webservices/axis2/trunk/java/modules/kernel/src/org/apache/axis2/transport/http/server/DefaultHttpConnectionManager.java
            /webservices/axis2/trunk/java/modules/kernel/src/org/apache/axis2/transport/http/server/DefaultThreadFactory.java
            /webservices/axis2/trunk/java/modules/kernel/src/org/apache/axis2/transport/http/server/HttpConnectionFactory.java
            /webservices/axis2/trunk/java/modules/kernel/src/org/apache/axis2/transport/http/server/HttpConnectionManager.java
            /webservices/axis2/trunk/java/modules/kernel/src/org/apache/axis2/transport/http/server/HttpFactory.java
            /webservices/axis2/trunk/java/modules/kernel/src/org/apache/axis2/transport/http/server/HttpServiceProcessor.java
            /webservices/axis2/trunk/java/modules/kernel/src/org/apache/axis2/transport/http/server/HttpUtils.java
            /webservices/axis2/trunk/java/modules/kernel/src/org/apache/axis2/transport/http/server/IOProcessor.java
            /webservices/axis2/trunk/java/modules/kernel/src/org/apache/axis2/transport/http/server/IOProcessorCallback.java
            /webservices/axis2/trunk/java/modules/kernel/src/org/apache/axis2/transport/http/server/LoggingProcessorDecorator.java
            /webservices/axis2/trunk/java/modules/kernel/src/org/apache/axis2/transport/http/server/OutputBuffer.java
            /webservices/axis2/trunk/java/modules/kernel/src/org/apache/axis2/transport/http/server/RequestSessionCookie.java
            /webservices/axis2/trunk/java/modules/kernel/src/org/apache/axis2/transport/http/server/ResponseSessionCookie.java
            /webservices/axis2/trunk/java/modules/kernel/src/org/apache/axis2/transport/http/server/SessionManager.java
            /webservices/axis2/trunk/java/modules/kernel/src/org/apache/axis2/transport/http/server/SimpleHttpServer.java
            /webservices/axis2/trunk/java/modules/kernel/src/org/apache/axis2/transport/http/server/Worker.java
            /webservices/axis2/trunk/java/modules/kernel/src/org/apache/axis2/transport/http/server/WorkerFactory.java
            /webservices/axis2/trunk/java/modules/kernel/src/org/apache/axis2/transport/http/util/ComplexPart.java
            /webservices/axis2/trunk/java/modules/kernel/src/org/apache/axis2/transport/http/util/RESTUtil.java
            /webservices/axis2/trunk/java/modules/kernel/src/org/apache/axis2/transport/http/util/SOAPUtil.java
            /webservices/axis2/trunk/java/modules/kernel/src/org/apache/axis2/transport/http/util/URIEncoderDecoder.java
            /webservices/axis2/trunk/java/modules/kernel/src/org/apache/axis2/transport/http/util/URLTemplatingUtil.java
            /webservices/axis2/trunk/java/modules/kernel/src/org/apache/axis2/transport/jms/JMSConnectionFactory.java
            /webservices/axis2/trunk/java/modules/kernel/src/org/apache/axis2/transport/jms/JMSConstants.java
            /webservices/axis2/trunk/java/modules/kernel/src/org/apache/axis2/transport/jms/JMSListener.java
            /webservices/axis2/trunk/java/modules/kernel/src/org/apache/axis2/transport/jms/JMSMessageReceiver.java
            /webservices/axis2/trunk/java/modules/kernel/src/org/apache/axis2/transport/jms/JMSOutTransportInfo.java
            /webservices/axis2/trunk/java/modules/kernel/src/org/apache/axis2/transport/jms/JMSSender.java
            /webservices/axis2/trunk/java/modules/kernel/src/org/apache/axis2/transport/jms/JMSUtils.java
            /webservices/axis2/trunk/java/modules/kernel/src/org/apache/axis2/transport/local/LocalResponder.java
            /webservices/axis2/trunk/java/modules/kernel/src/org/apache/axis2/transport/local/LocalTransportSender.java
            /webservices/axis2/trunk/java/modules/kernel/src/org/apache/axis2/transport/mail/Constants.java
            /webservices/axis2/trunk/java/modules/kernel/src/org/apache/axis2/transport/mail/EMailSender.java
            /webservices/axis2/trunk/java/modules/kernel/src/org/apache/axis2/transport/mail/EmailReceiver.java
            /webservices/axis2/trunk/java/modules/kernel/src/org/apache/axis2/transport/mail/MailTransportSender.java
            /webservices/axis2/trunk/java/modules/kernel/src/org/apache/axis2/transport/mail/MailWorker.java
            /webservices/axis2/trunk/java/modules/kernel/src/org/apache/axis2/transport/mail/MimeBase64BodyPart.java
            /webservices/axis2/trunk/java/modules/kernel/src/org/apache/axis2/transport/mail/SimpleMailListener.java
            /webservices/axis2/trunk/java/modules/kernel/src/org/apache/axis2/transport/mail/server/MailAddress.java
            /webservices/axis2/trunk/java/modules/kernel/src/org/apache/axis2/transport/mail/server/MailServer.java
            /webservices/axis2/trunk/java/modules/kernel/src/org/apache/axis2/transport/mail/server/MailSorter.java
            /webservices/axis2/trunk/java/modules/kernel/src/org/apache/axis2/transport/mail/server/POP3Worker.java
            /webservices/axis2/trunk/java/modules/kernel/src/org/apache/axis2/transport/mail/server/Storage.java
            /webservices/axis2/trunk/java/modules/kernel/src/org/apache/axis2/transport/tcp/TCPServer.java
            /webservices/axis2/trunk/java/modules/kernel/src/org/apache/axis2/transport/tcp/TCPTransportSender.java
            /webservices/axis2/trunk/java/modules/kernel/src/org/apache/axis2/transport/tcp/TCPWorker.java
            /webservices/axis2/trunk/java/modules/kernel/src/org/apache/axis2/util/Base64.java
            /webservices/axis2/trunk/java/modules/kernel/src/org/apache/axis2/util/CallbackReceiver.java
            /webservices/axis2/trunk/java/modules/kernel/src/org/apache/axis2/util/CommandLineOption.java
            /webservices/axis2/trunk/java/modules/kernel/src/org/apache/axis2/util/CommandLineOptionConstants.java
            /webservices/axis2/trunk/java/modules/kernel/src/org/apache/axis2/util/CommandLineOptionParser.java
            /webservices/axis2/trunk/java/modules/kernel/src/org/apache/axis2/util/DefaultEntityResolver.java
            /webservices/axis2/trunk/java/modules/kernel/src/org/apache/axis2/util/ExternalPolicySerializer.java
            /webservices/axis2/trunk/java/modules/kernel/src/org/apache/axis2/util/JavaUtils.java
            /webservices/axis2/trunk/java/modules/kernel/src/org/apache/axis2/util/Loader.java
            /webservices/axis2/trunk/java/modules/kernel/src/org/apache/axis2/util/LoggingControl.java
            /webservices/axis2/trunk/java/modules/kernel/src/org/apache/axis2/util/MessageContextBuilder.java
            /webservices/axis2/trunk/java/modules/kernel/src/org/apache/axis2/util/MetaDataEntry.java
            /webservices/axis2/trunk/java/modules/kernel/src/org/apache/axis2/util/MultiParentClassLoader.java
            /webservices/axis2/trunk/java/modules/kernel/src/org/apache/axis2/util/ObjectStateUtils.java
            /webservices/axis2/trunk/java/modules/kernel/src/org/apache/axis2/util/PrettyPrinter.java
            /webservices/axis2/trunk/java/modules/kernel/src/org/apache/axis2/util/SchemaUtil.java
            /webservices/axis2/trunk/java/modules/kernel/src/org/apache/axis2/util/SelfManagedDataHolder.java
            /webservices/axis2/trunk/java/modules/kernel/src/org/apache/axis2/util/SessionUtils.java
            /webservices/axis2/trunk/java/modules/kernel/src/org/apache/axis2/util/ThreadContextMigrator.java
            /webservices/axis2/trunk/java/modules/kernel/src/org/apache/axis2/util/ThreadContextMigratorUtil.java
            /webservices/axis2/trunk/java/modules/kernel/src/org/apache/axis2/util/URLProcessor.java
            /webservices/axis2/trunk/java/modules/kernel/src/org/apache/axis2/util/UUIDGenerator.java
            /webservices/axis2/trunk/java/modules/kernel/src/org/apache/axis2/util/Utils.java
            /webservices/axis2/trunk/java/modules/kernel/src/org/apache/axis2/util/XMLChar.java
            /webservices/axis2/trunk/java/modules/kernel/src/org/apache/axis2/util/XMLPrettyPrinter.java
            /webservices/axis2/trunk/java/modules/kernel/src/org/apache/axis2/util/XMLUtils.java
            /webservices/axis2/trunk/java/modules/kernel/src/org/apache/axis2/util/XSLTTemplateProcessor.java
            /webservices/axis2/trunk/java/modules/kernel/src/org/apache/axis2/util/threadpool/DefaultThreadFactory.java
            /webservices/axis2/trunk/java/modules/kernel/src/org/apache/axis2/util/threadpool/ThreadPool.java
            /webservices/axis2/trunk/java/modules/kernel/src/org/apache/axis2/wsdl/SOAPHeaderMessage.java
            /webservices/axis2/trunk/java/modules/kernel/src/org/apache/axis2/wsdl/SOAPModuleMessage.java
            /webservices/axis2/trunk/java/modules/kernel/src/org/apache/axis2/wsdl/WSDLConstants.java
            /webservices/axis2/trunk/java/modules/kernel/src/org/apache/axis2/wsdl/WSDLUtil.java
            /webservices/axis2/trunk/java/modules/kernel/src/org/apache/axis2/wsdl/util/WSDL4JImportedWSDLHelper.java
            /webservices/axis2/trunk/java/modules/kernel/test/org/apache/axis2/Echo2.java
            /webservices/axis2/trunk/java/modules/kernel/test/org/apache/axis2/InavalidModuleImpl.java
            /webservices/axis2/trunk/java/modules/kernel/test/org/apache/axis2/ModuleHandler1.java
            /webservices/axis2/trunk/java/modules/kernel/test/org/apache/axis2/addressing/AddressingHelperTest.java
            /webservices/axis2/trunk/java/modules/kernel/test/org/apache/axis2/addressing/EndpointReferenceHelperTest.java
            /webservices/axis2/trunk/java/modules/kernel/test/org/apache/axis2/addressing/EndpointReferenceTypeTest.java
            /webservices/axis2/trunk/java/modules/kernel/test/org/apache/axis2/addressing/miheaders/RelatesToTest.java
            /webservices/axis2/trunk/java/modules/kernel/test/org/apache/axis2/addressing/wsdl/WSDL11ActionHelperTest.java
            /webservices/axis2/trunk/java/modules/kernel/test/org/apache/axis2/context/ContextHierarchyTest.java
            /webservices/axis2/trunk/java/modules/kernel/test/org/apache/axis2/context/OperationContextTest.java
            /webservices/axis2/trunk/java/modules/kernel/test/org/apache/axis2/deployment/AddingObserverTest.java
            /webservices/axis2/trunk/java/modules/kernel/test/org/apache/axis2/deployment/AxisMessageTest.java
            /webservices/axis2/trunk/java/modules/kernel/test/org/apache/axis2/deployment/AxisObserverImpl.java
            /webservices/axis2/trunk/java/modules/kernel/test/org/apache/axis2/deployment/BadModuleTest.java
            /webservices/axis2/trunk/java/modules/kernel/test/org/apache/axis2/deployment/BuildERWithDeploymentTest.java
            /webservices/axis2/trunk/java/modules/kernel/test/org/apache/axis2/deployment/BuilderSelectorDeploymentTest.java
            /webservices/axis2/trunk/java/modules/kernel/test/org/apache/axis2/deployment/DeploymentTotalTest.java
            /webservices/axis2/trunk/java/modules/kernel/test/org/apache/axis2/deployment/MessageFormatterDeploymentTest.java
            /webservices/axis2/trunk/java/modules/kernel/test/org/apache/axis2/deployment/ModifiedConfigFileTest.java
            /webservices/axis2/trunk/java/modules/kernel/test/org/apache/axis2/deployment/ModuleDisengagementTest.java
            /webservices/axis2/trunk/java/modules/kernel/test/org/apache/axis2/deployment/ModuleversionTest.java
            /webservices/axis2/trunk/java/modules/kernel/test/org/apache/axis2/deployment/SameServiceAddingTest.java
            /webservices/axis2/trunk/java/modules/kernel/test/org/apache/axis2/deployment/ServiceGroupTest.java
            /webservices/axis2/trunk/java/modules/kernel/test/org/apache/axis2/deployment/SpeakingHandler.java
            /webservices/axis2/trunk/java/modules/kernel/test/org/apache/axis2/deployment/SystemPhasesremovedTest.java
            /webservices/axis2/trunk/java/modules/kernel/test/org/apache/axis2/deployment/TransportDeploymentTest.java
            /webservices/axis2/trunk/java/modules/kernel/test/org/apache/axis2/description/MockFlow.java
            /webservices/axis2/trunk/java/modules/kernel/test/org/apache/axis2/description/RegistryTest.java
            /webservices/axis2/trunk/java/modules/kernel/test/org/apache/axis2/description/SpeakingHandler.java
            /webservices/axis2/trunk/java/modules/kernel/test/org/apache/axis2/description/SpeakingHandler1.java
            /webservices/axis2/trunk/java/modules/kernel/test/org/apache/axis2/description/WSDLToAllServicesBuilderTest.java
            /webservices/axis2/trunk/java/modules/kernel/test/org/apache/axis2/dispatchers/ActionBasedOperationDispatchTest.java
            /webservices/axis2/trunk/java/modules/kernel/test/org/apache/axis2/dispatchers/RelatesToBasedOperationDispatcherTest.java
            /webservices/axis2/trunk/java/modules/kernel/test/org/apache/axis2/dispatchers/RelatesToBasedServiceDispatcherTest.java
            /webservices/axis2/trunk/java/modules/kernel/test/org/apache/axis2/dispatchers/RequestURIBasedOperationDispatcherTest.java
            /webservices/axis2/trunk/java/modules/kernel/test/org/apache/axis2/dispatchers/RequestURIBasedServiceDispatcherTest.java
            /webservices/axis2/trunk/java/modules/kernel/test/org/apache/axis2/dispatchers/SOAPMessageBodyBasedOperationDispatcherTest.java
            /webservices/axis2/trunk/java/modules/kernel/test/org/apache/axis2/dispatchers/SOAPMessageBodyBasedServiceDispatcherTest.java
            /webservices/axis2/trunk/java/modules/kernel/test/org/apache/axis2/engine/EnginePausingTest.java
            /webservices/axis2/trunk/java/modules/kernel/test/org/apache/axis2/engine/EngineWithoutPhaseResolvingTest.java
            /webservices/axis2/trunk/java/modules/kernel/test/org/apache/axis2/engine/MessageContextChangeTest.java
            /webservices/axis2/trunk/java/modules/kernel/test/org/apache/axis2/engine/MessageContextSaveATest.java
            /webservices/axis2/trunk/java/modules/kernel/test/org/apache/axis2/engine/MessageContextSaveBTest.java
            /webservices/axis2/trunk/java/modules/kernel/test/org/apache/axis2/engine/MessageContextSaveCTest.java
            /webservices/axis2/trunk/java/modules/kernel/test/org/apache/axis2/engine/MessageContextSelfManagedDataTest.java
            /webservices/axis2/trunk/java/modules/kernel/test/org/apache/axis2/engine/MessageContextTest.java
            /webservices/axis2/trunk/java/modules/kernel/test/org/apache/axis2/engine/ModuleConfigTest.java
            /webservices/axis2/trunk/java/modules/kernel/test/org/apache/axis2/engine/ModuleEngageTest.java
            /webservices/axis2/trunk/java/modules/kernel/test/org/apache/axis2/engine/ObjectSaveTest.java
            /webservices/axis2/trunk/java/modules/kernel/test/org/apache/axis2/engine/OperationContextSaveTest.java
            /webservices/axis2/trunk/java/modules/kernel/test/org/apache/axis2/engine/OptionsSaveTest.java
            /webservices/axis2/trunk/java/modules/kernel/test/org/apache/axis2/engine/ParameterAddTest.java
            /webservices/axis2/trunk/java/modules/kernel/test/org/apache/axis2/engine/ParameterLocked.java
            /webservices/axis2/trunk/java/modules/kernel/test/org/apache/axis2/engine/SOAPActionBasedDispatcherTest.java
            /webservices/axis2/trunk/java/modules/kernel/test/org/apache/axis2/handlers/Handler2.java
            /webservices/axis2/trunk/java/modules/kernel/test/org/apache/axis2/java/security/action/Action.java
            /webservices/axis2/trunk/java/modules/kernel/test/org/apache/axis2/java/security/driver/Java2SecTest.java
            /webservices/axis2/trunk/java/modules/kernel/test/org/apache/axis2/java/security/interf/Actor.java
            /webservices/axis2/trunk/java/modules/kernel/test/org/apache/axis2/java/security/less/LessPermission.java
            /webservices/axis2/trunk/java/modules/kernel/test/org/apache/axis2/java/security/less/LessPermissionAccessControlContext.java
            /webservices/axis2/trunk/java/modules/kernel/test/org/apache/axis2/java/security/less/LessPermissionPrivilegedExceptionAction.java
            /webservices/axis2/trunk/java/modules/kernel/test/org/apache/axis2/java/security/more/MorePermission.java
            /webservices/axis2/trunk/java/modules/kernel/test/org/apache/axis2/java/security/more/MorePermissionAccessControlContext.java
            /webservices/axis2/trunk/java/modules/kernel/test/org/apache/axis2/java/security/more/MorePermissionPrivilegedExceptionAction.java
            /webservices/axis2/trunk/java/modules/kernel/test/org/apache/axis2/misc/MiscTest.java
            /webservices/axis2/trunk/java/modules/kernel/test/org/apache/axis2/phaserule/AddingHandlerToEachPhaseTest.java
            /webservices/axis2/trunk/java/modules/kernel/test/org/apache/axis2/phaserule/BeforeWithNoFirstHandlerTest.java
            /webservices/axis2/trunk/java/modules/kernel/test/org/apache/axis2/phaserule/InvalidPhaseFirstRulesTest.java
            /webservices/axis2/trunk/java/modules/kernel/test/org/apache/axis2/phaserule/InvalidPhaseFirstTest.java
            /webservices/axis2/trunk/java/modules/kernel/test/org/apache/axis2/phaserule/InvalidPhaseLastRuleTest.java
            /webservices/axis2/trunk/java/modules/kernel/test/org/apache/axis2/phaserule/InvalidPhaselastTest.java
            /webservices/axis2/trunk/java/modules/kernel/test/org/apache/axis2/phaserule/PhaseRuleHandlers.java
            /webservices/axis2/trunk/java/modules/kernel/test/org/apache/axis2/phaserule/SingleHandlerPhaseTest.java
            /webservices/axis2/trunk/java/modules/kernel/test/org/apache/axis2/registry/Handler3.java
            /webservices/axis2/trunk/java/modules/kernel/test/org/apache/axis2/sample/echo/EchoImpl.java
            /webservices/axis2/trunk/java/modules/kernel/test/org/apache/axis2/sample/handlers/LoggingHandler.java
            /webservices/axis2/trunk/java/modules/kernel/test/org/apache/axis2/transport/http/util/URLTemplatingUtilTest.java
            /webservices/axis2/trunk/java/modules/kernel/test/org/apache/axis2/transport/tcp/TCPTransportTest.java
            /webservices/axis2/trunk/java/modules/kernel/test/org/apache/axis2/util/ThreadContextMigratorTest.java
            /webservices/axis2/trunk/java/modules/kernel/test/org/apache/axis2/util/UtilsParseRequestTest.java
           dims          check for illegal argument only if it is not the soap envelope
             /webservices/axis2/trunk/java/modules/saaj/src/org/apache/axis2/saaj/SOAPElementImpl.java
           keithc          Fixing bug in XFormURLEncodedFormatter so that parameters are not duplicated

             /webservices/axis2/trunk/java/modules/kernel/src/org/apache/axis2/transport/http/HTTPSender.java
            /webservices/axis2/trunk/java/modules/kernel/src/org/apache/axis2/transport/http/XFormURLEncodedFormatter.java
            /webservices/axis2/trunk/java/modules/kernel/src/org/apache/axis2/transport/http/util/URLTemplatingUtil.java
            /webservices/axis2/trunk/java/modules/kernel/test/org/apache/axis2/transport/http/util/URLTemplatingUtilTest.java
           amilas          opps I have commit with a System out.

             /webservices/axis2/trunk/java/modules/codegen/src/org/apache/axis2/wsdl/codegen/emitter/AxisServiceBasedMultiLanguageEmitter.java
           thilina          removing the empty header

             /webservices/axis2/trunk/java/modules/adb/test/org/apache/axis2/databinding/ADBSOAPModelBuilderTest.java
           chamikara          Settting the ServletReqResTransport object
             /webservices/axis2/trunk/java/modules/kernel/src/org/apache/axis2/transport/http/AxisServlet.java
           sanka          Fixed:

             /webservices/axis2/trunk/java/modules/kernel/src/org/apache/axis2/description/WSDL11ToAxisServiceBuilder.java
           dims          short cut for gathering all the axis2 jars into one directory and download latest jars
             /webservices/axis2/trunk/java/maven.xml
        
****************************************************************************
Output:
****************************************************************************
[INFO] Scanning for projects...
[INFO] Reactor build order: 
[INFO]   Apache Axis 2.0 - Parent
[INFO]   Apache Axis 2.0 - tool - AAR Maven Plugin
[INFO]   Apache Axis 2.0 - Java2WSDL
[INFO]   Apache Axis 2.0 - Kernel
[INFO]   Apache Axis 2.0 - Data Binding
[INFO]   Apache Axis 2.0 - Code Generation
[INFO]   Apache Axis 2.0 - ADB Codegen
[INFO]   Apache Axis 2.0 - tool - Ant Plugin
[INFO]   Apache Axis 2.0 - tool - Intellij IDEA Plugin
[INFO]   Apache Axis 2.0 - tool - Java2WSDL Maven Plugin
[INFO]   Apache Axis 2.0 - tool - WSDL2Code Maven Plugin
[INFO]   Apache Axis 2.0 - tool - MAR Maven Plugin
[INFO]   Apache Axis 2.0 - Addressing
[INFO]   Apache Axis 2.0 - JiBX Data Binding
[INFO]   Apache Axis 2.0 - XMLBeans Data Binding
[INFO]   Apache Axis 2.0 - JSON
[INFO]   Apache Axis 2.0 - MTOM Policy
[INFO]   Apache Axis 2.0 - spring
[INFO]   Apache Axis 2.0 - JAXB-RI Data Binding
[INFO]   Apache Axis 2.0 - SAAJ API
[INFO]   Apache Axis 2.0 - JAXWS API
[INFO]   Apache Axis 2.0 - Metadata
[INFO]   Apache Axis 2.0 - SAAJ
[INFO]   Apache Axis 2.0 - JAXWS
[INFO]   Apache Axis 2.0 - Root
[INFO] snapshot org.apache.axis2.maven2:axis2-mar-maven-plugin:SNAPSHOT: checking for updates from apache-snapshots
[INFO] snapshot org.apache.axis2.maven2:axis2-mar-maven-plugin:SNAPSHOT: checking for updates from ws-zones
Downloading: http://people.apache.org/repo/m2-snapshot-repository/org/apache/axis2/maven2/axis2-mar-maven-plugin/SNAPSHOT/axis2-mar-maven-plugin-20070305.112018-49.jar
12K downloaded
[INFO] ----------------------------------------------------------------------------
[INFO] Building Apache Axis 2.0 - Parent
[INFO]    task-segment: [clean, install]
[INFO] ----------------------------------------------------------------------------
[INFO] artifact org.apache.maven.plugins:maven-clean-plugin: checking for updates from apache-m2
[INFO] artifact org.apache.maven.plugins:maven-clean-plugin: checking for updates from ws-zones
[INFO] artifact org.apache.maven.plugins:maven-compiler-plugin: checking for updates from apache-m2
[INFO] artifact org.apache.maven.plugins:maven-compiler-plugin: checking for updates from ws-zones
[INFO] [clean:clean]
[INFO] Deleting directory /export/home/illsleyd/continuum/continuum-1.0.3/apps/continuum/working-directory/61/modules/parent/target
[INFO] Deleting directory /export/home/illsleyd/continuum/continuum-1.0.3/apps/continuum/working-directory/61/modules/parent/target/classes
[INFO] Deleting directory /export/home/illsleyd/continuum/continuum-1.0.3/apps/continuum/working-directory/61/modules/parent/target/test-classes
[INFO] artifact org.apache.maven.plugins:maven-site-plugin: checking for updates from apache-m2
[INFO] artifact org.apache.maven.plugins:maven-site-plugin: checking for updates from ws-zones
[INFO] artifact org.apache.maven.plugins:maven-install-plugin: checking for updates from apache-m2
[INFO] artifact org.apache.maven.plugins:maven-install-plugin: checking for updates from ws-zones
[INFO] [site:attach-descriptor]
[INFO] [install:install]
[INFO] Installing /export/home/illsleyd/continuum/continuum-1.0.3/apps/continuum/working-directory/61/modules/parent/pom.xml to /export/home/illsleyd/.m2/repository/org/apache/axis2/axis2-parent/SNAPSHOT/axis2-parent-SNAPSHOT.pom
[INFO] ----------------------------------------------------------------------------
[INFO] Building Apache Axis 2.0 - tool - AAR Maven Plugin
[INFO]    task-segment: [clean, install]
[INFO] ----------------------------------------------------------------------------
[INFO] [clean:clean]
[INFO] Deleting directory /export/home/illsleyd/continuum/continuum-1.0.3/apps/continuum/working-directory/61/modules/tool/axis2-aar-maven-plugin/target
[INFO] Deleting directory /export/home/illsleyd/continuum/continuum-1.0.3/apps/continuum/working-directory/61/modules/tool/axis2-aar-maven-plugin/target/classes
[INFO] Deleting directory /export/home/illsleyd/continuum/continuum-1.0.3/apps/continuum/working-directory/61/modules/tool/axis2-aar-maven-plugin/target/test-classes
[INFO] artifact org.apache.maven.plugins:maven-plugin-plugin: checking for updates from apache-m2
[INFO] artifact org.apache.maven.plugins:maven-plugin-plugin: checking for updates from ws-zones
[INFO] artifact org.apache.maven.plugins:maven-resources-plugin: checking for updates from apache-m2
[INFO] artifact org.apache.maven.plugins:maven-resources-plugin: checking for updates from ws-zones
[INFO] artifact org.apache.maven.plugins:maven-jar-plugin: checking for updates from apache-m2
[INFO] artifact org.apache.maven.plugins:maven-jar-plugin: checking for updates from ws-zones
[INFO] [plugin:descriptor]
[INFO] Using 2 extractors.
[INFO] Applying extractor for language: java
[INFO] Extractor for language: java found 3 mojo descriptors.
[INFO] Applying extractor for language: bsh
[INFO] Extractor for language: bsh found 0 mojo descriptors.
[INFO] [resources:resources]
[INFO] Using default encoding to copy filtered resources.
[WARNING] 
	Artifact junit:junit:jar:3.8.2:test retains local scope 'test' overriding broader scope 'compile'
	given by a dependency. If this is not intended, modify or remove the local scope.

[INFO] [compiler:compile]
[INFO] Compiling 5 source files to /export/home/illsleyd/continuum/continuum-1.0.3/apps/continuum/working-directory/61/modules/tool/axis2-aar-maven-plugin/target/classes
[INFO] [resources:testResources]
[INFO] Using default encoding to copy filtered resources.
[INFO] [compiler:testCompile]
[INFO] No sources to compile
[INFO] [surefire:test]
[INFO] Tests are skipped.
[INFO] [jar:jar]
[INFO] Building jar: /export/home/illsleyd/continuum/continuum-1.0.3/apps/continuum/working-directory/61/modules/tool/axis2-aar-maven-plugin/target/axis2-aar-maven-plugin-SNAPSHOT.jar
[INFO] [plugin:addPluginArtifactMetadata]
[INFO] [install:install]
[INFO] Installing /export/home/illsleyd/continuum/continuum-1.0.3/apps/continuum/working-directory/61/modules/tool/axis2-aar-maven-plugin/target/axis2-aar-maven-plugin-SNAPSHOT.jar to /export/home/illsleyd/.m2/repository/org/apache/axis2/maven2/axis2-aar-maven-plugin/SNAPSHOT/axis2-aar-maven-plugin-SNAPSHOT.jar
[INFO] [plugin:updateRegistry]
[INFO] ----------------------------------------------------------------------------
[INFO] Building Apache Axis 2.0 - Java2WSDL
[INFO]    task-segment: [clean, install]
[INFO] ----------------------------------------------------------------------------
[INFO] [clean:clean]
[INFO] Deleting directory /export/home/illsleyd/continuum/continuum-1.0.3/apps/continuum/working-directory/61/modules/java2wsdl/target
[INFO] Deleting directory /export/home/illsleyd/continuum/continuum-1.0.3/apps/continuum/working-directory/61/modules/java2wsdl/target/classes
[INFO] Deleting directory /export/home/illsleyd/continuum/continuum-1.0.3/apps/continuum/working-directory/61/modules/java2wsdl/target/test-classes
[INFO] [resources:resources]
[INFO] Using default encoding to copy filtered resources.
[INFO] snapshot org.apache.geronimo.specs:geronimo-javamail_1.4_spec:1.0-SNAPSHOT: checking for updates from apache-snapshots
[INFO] snapshot org.apache.geronimo.specs:geronimo-javamail_1.4_spec:1.0-SNAPSHOT: checking for updates from apache-ws-snapshots2
[INFO] snapshot org.apache.geronimo.specs:geronimo-javamail_1.4_spec:1.0-SNAPSHOT: checking for updates from apache.snapshots
Downloading: http://people.apache.org/repo/m2-snapshot-repository//org/apache/geronimo/specs/geronimo-javamail_1.4_spec/1.0-SNAPSHOT/geronimo-javamail_1.4_spec-1.0-20070301.095721-5.pom
1K downloaded
Downloading: http://ws.zones.apache.org/repository2//org/apache/geronimo/specs/specs/1.2/specs-1.2.pom
[WARNING] Unable to get resource from repository apache-ws-snapshots2 (http://ws.zones.apache.org/repository2/)
Downloading: http://repo1.maven.org/maven2//org/apache/geronimo/specs/specs/1.2/specs-1.2.pom
2K downloaded
Downloading: http://ws.zones.apache.org/repository2//org/apache/geronimo/genesis/config/project-config/1.1/project-config-1.1.pom
[WARNING] Unable to get resource from repository apache-ws-snapshots2 (http://ws.zones.apache.org/repository2/)
Downloading: http://repo1.maven.org/maven2//org/apache/geronimo/genesis/config/project-config/1.1/project-config-1.1.pom
14K downloaded
Downloading: http://people.apache.org/repo/m2-incubating-repository//org/apache/geronimo/genesis/config/config/1.1/config-1.1.pom
[WARNING] Unable to get resource from repository apache-incubator (http://people.apache.org/repo/m2-incubating-repository/)
Downloading: http://repository.codehaus.org/org/apache/geronimo/genesis/config/config/1.1/config-1.1.pom
[WARNING] Unable to get resource from repository codehaus (http://repository.codehaus.org)
Downloading: http://ws.zones.apache.org/repository2//org/apache/geronimo/genesis/config/config/1.1/config-1.1.pom
[WARNING] Unable to get resource from repository apache-ws-snapshots2 (http://ws.zones.apache.org/repository2/)
Downloading: http://repo1.maven.org/maven2//org/apache/geronimo/genesis/config/config/1.1/config-1.1.pom
670b downloaded
Downloading: http://people.apache.org/repo/m2-incubating-repository//org/apache/geronimo/genesis/genesis/1.1/genesis-1.1.pom
[WARNING] Unable to get resource from repository apache-incubator (http://people.apache.org/repo/m2-incubating-repository/)
Downloading: http://repository.codehaus.org/org/apache/geronimo/genesis/genesis/1.1/genesis-1.1.pom
[WARNING] Unable to get resource from repository codehaus (http://repository.codehaus.org)
Downloading: http://ws.zones.apache.org/repository2//org/apache/geronimo/genesis/genesis/1.1/genesis-1.1.pom
[WARNING] Unable to get resource from repository apache-ws-snapshots2 (http://ws.zones.apache.org/repository2/)
Downloading: http://repo1.maven.org/maven2//org/apache/geronimo/genesis/genesis/1.1/genesis-1.1.pom
6K downloaded
Downloading: http://ws.zones.apache.org/repository2//jaxen/jaxen/1.1-beta-10/jaxen-1.1-beta-10.pom
[WARNING] Unable to get resource from repository apache-ws-snapshots2 (http://ws.zones.apache.org/repository2/)
Downloading: http://repo1.maven.org/maven2//jaxen/jaxen/1.1-beta-10/jaxen-1.1-beta-10.pom
[WARNING] Unable to get resource from repository maven2 (http://repo1.maven.org/maven2/)
Downloading: http://repo1.maven.org/maven2/jaxen/jaxen/1.1-beta-10/jaxen-1.1-beta-10.pom
[WARNING] Unable to get resource from repository central (http://repo1.maven.org/maven2)
[WARNING] While downloading woodstox:wstx-asl:3.2.0
  This artifact has been relocated to org.codehaus.woodstox:wstx-asl:3.2.0.


[INFO] snapshot org.apache.ws.commons.axiom:axiom-api:SNAPSHOT: checking for updates from apache.snapshots
Downloading: http://people.apache.org/repo/m2-snapshot-repository/org/apache/ws/commons/axiom/axiom-api/SNAPSHOT/axiom-api-20070305.111129-17.pom
1K downloaded
[INFO] snapshot org.apache.ws.commons.axiom:axiom-parent:SNAPSHOT: checking for updates from apache.snapshots
Downloading: http://people.apache.org/repo/m2-snapshot-repository/org/apache/ws/commons/axiom/axiom-parent/SNAPSHOT/axiom-parent-20070305.111129-17.pom
20K downloaded
[INFO] snapshot org.apache.ws.commons.axiom:axiom-impl:SNAPSHOT: checking for updates from apache.snapshots
Downloading: http://people.apache.org/repo/m2-snapshot-repository/org/apache/ws/commons/axiom/axiom-impl/SNAPSHOT/axiom-impl-20070305.111129-17.pom
1K downloaded
[INFO] snapshot org.apache.ws.commons.schema:XmlSchema:SNAPSHOT: checking for updates from apache.snapshots
Downloading: http://people.apache.org/repo/m2-snapshot-repository/org/apache/ws/commons/schema/XmlSchema/SNAPSHOT/XmlSchema-20070302.143809-17.pom
15K downloaded
Downloading: http://people.apache.org/repo/m2-snapshot-repository/org/apache/ws/commons/axiom/axiom-impl/SNAPSHOT/axiom-impl-20070305.111129-17.jar
106K downloaded
Downloading: http://people.apache.org/repo/m2-snapshot-repository/org/apache/ws/commons/schema/XmlSchema/SNAPSHOT/XmlSchema-20070302.143809-17.jar
123K downloaded
Downloading: http://people.apache.org/repo/m2-snapshot-repository/org/apache/geronimo/specs/geronimo-javamail_1.4_spec/1.0-SNAPSHOT/geronimo-javamail_1.4_spec-1.0-20070301.095721-5.jar
189K downloaded
Downloading: http://people.apache.org/repo/m2-snapshot-repository/org/apache/ws/commons/axiom/axiom-api/SNAPSHOT/axiom-api-20070305.111129-17.jar
122K downloaded
[INFO] [compiler:compile]
[INFO] Compiling 23 source files to /export/home/illsleyd/continuum/continuum-1.0.3/apps/continuum/working-directory/61/modules/java2wsdl/target/classes
[INFO] [resources:testResources]
[INFO] Using default encoding to copy filtered resources.
Downloading: http://people.apache.org/repo/m2-snapshot-repository//org/apache/geronimo/specs/geronimo-javamail_1.4_spec/1.0-SNAPSHOT/geronimo-javamail_1.4_spec-1.0-20070301.095721-5.pom
1K downloaded
Downloading: http://ws.zones.apache.org/repository2//org/apache/ws/commons/axiom/axiom-api/20070305.111129-17/axiom-api-20070305.111129-17.pom
[WARNING] Unable to get resource from repository apache-ws-snapshots2 (http://ws.zones.apache.org/repository2/)
Downloading: http://repo1.maven.org/maven2//org/apache/ws/commons/axiom/axiom-api/20070305.111129-17/axiom-api-20070305.111129-17.pom
[WARNING] Unable to get resource from repository maven2 (http://repo1.maven.org/maven2/)
Downloading: http://repo1.maven.org/maven2/org/apache/ws/commons/axiom/axiom-api/20070305.111129-17/axiom-api-20070305.111129-17.pom
[WARNING] Unable to get resource from repository central (http://repo1.maven.org/maven2)
Downloading: http://ws.zones.apache.org/repository2//org/apache/ws/commons/axiom/axiom-impl/20070305.111129-17/axiom-impl-20070305.111129-17.pom
[WARNING] Unable to get resource from repository apache-ws-snapshots2 (http://ws.zones.apache.org/repository2/)
Downloading: http://repo1.maven.org/maven2//org/apache/ws/commons/axiom/axiom-impl/20070305.111129-17/axiom-impl-20070305.111129-17.pom
[WARNING] Unable to get resource from repository maven2 (http://repo1.maven.org/maven2/)
Downloading: http://repo1.maven.org/maven2/org/apache/ws/commons/axiom/axiom-impl/20070305.111129-17/axiom-impl-20070305.111129-17.pom
[WARNING] Unable to get resource from repository central (http://repo1.maven.org/maven2)
Downloading: http://ws.zones.apache.org/repository2//org/apache/ws/commons/schema/XmlSchema/20070302.143809-17/XmlSchema-20070302.143809-17.pom
[WARNING] Unable to get resource from repository apache-ws-snapshots2 (http://ws.zones.apache.org/repository2/)
Downloading: http://repo1.maven.org/maven2//org/apache/ws/commons/schema/XmlSchema/20070302.143809-17/XmlSchema-20070302.143809-17.pom
[WARNING] Unable to get resource from repository maven2 (http://repo1.maven.org/maven2/)
Downloading: http://repo1.maven.org/maven2/org/apache/ws/commons/schema/XmlSchema/20070302.143809-17/XmlSchema-20070302.143809-17.pom
[WARNING] Unable to get resource from repository central (http://repo1.maven.org/maven2)
[INFO] [compiler:testCompile]
[INFO] No sources to compile
[INFO] [surefire:test]
[INFO] Tests are skipped.
[INFO] [jar:jar]
[INFO] Building jar: /export/home/illsleyd/continuum/continuum-1.0.3/apps/continuum/working-directory/61/modules/java2wsdl/target/axis2-java2wsdl-SNAPSHOT.jar
[INFO] [install:install]
[INFO] Installing /export/home/illsleyd/continuum/continuum-1.0.3/apps/continuum/working-directory/61/modules/java2wsdl/target/axis2-java2wsdl-SNAPSHOT.jar to /export/home/illsleyd/.m2/repository/org/apache/axis2/axis2-java2wsdl/SNAPSHOT/axis2-java2wsdl-SNAPSHOT.jar
[INFO] ----------------------------------------------------------------------------
[INFO] Building Apache Axis 2.0 - Kernel
[INFO]    task-segment: [clean, install]
[INFO] ----------------------------------------------------------------------------
[INFO] [clean:clean]
[INFO] Deleting directory /export/home/illsleyd/continuum/continuum-1.0.3/apps/continuum/working-directory/61/modules/kernel/target
[INFO] Deleting directory /export/home/illsleyd/continuum/continuum-1.0.3/apps/continuum/working-directory/61/modules/kernel/target/classes
[INFO] Deleting directory /export/home/illsleyd/continuum/continuum-1.0.3/apps/continuum/working-directory/61/modules/kernel/target/test-classes
[INFO] [resources:resources]
[INFO] Using default encoding to copy filtered resources.
[INFO] snapshot org.apache.ws.commons.axiom:axiom-dom:SNAPSHOT: checking for updates from apache.snapshots
Downloading: http://people.apache.org/repo/m2-snapshot-repository/org/apache/ws/commons/axiom/axiom-dom/SNAPSHOT/axiom-dom-20070305.111129-17.pom
1K downloaded
[WARNING] While downloading woodstox:wstx-asl:3.2.0
  This artifact has been relocated to org.codehaus.woodstox:wstx-asl:3.2.0.


[WARNING] 
	Artifact javax.servlet:servlet-api:jar:2.3:provided retains local scope 'provided' overriding broader scope 'compile'
	given by a dependency. If this is not intended, modify or remove the local scope.

[INFO] snapshot org.apache.woden:woden:1.0-incubating-SNAPSHOT: checking for updates from apache.snapshots
Downloading: http://ws.zones.apache.org/repository2//org/apache/neethi/neethi/2.0/neethi-2.0.pom
[WARNING] Unable to get resource from repository apache-ws-snapshots2 (http://ws.zones.apache.org/repository2/)
Downloading: http://repo1.maven.org/maven2//org/apache/neethi/neethi/2.0/neethi-2.0.pom
[WARNING] Unable to get resource from repository maven2 (http://repo1.maven.org/maven2/)
Downloading: http://repo1.maven.org/maven2/org/apache/neethi/neethi/2.0/neethi-2.0.pom
[WARNING] Unable to get resource from repository central (http://repo1.maven.org/maven2)
Downloading: http://people.apache.org/repo/m2-snapshot-repository/org/apache/ws/commons/axiom/axiom-dom/SNAPSHOT/axiom-dom-20070305.111129-17.jar
128K downloaded
[INFO] [compiler:compile]
[INFO] Compiling 325 source files to /export/home/illsleyd/continuum/continuum-1.0.3/apps/continuum/working-directory/61/modules/kernel/target/classes
[INFO] [resources:testResources]
[INFO] Using default encoding to copy filtered resources.
Downloading: http://ws.zones.apache.org/repository2//org/apache/ws/commons/axiom/axiom-dom/20070305.111129-17/axiom-dom-20070305.111129-17.pom
[WARNING] Unable to get resource from repository apache-ws-snapshots2 (http://ws.zones.apache.org/repository2/)
Downloading: http://repo1.maven.org/maven2//org/apache/ws/commons/axiom/axiom-dom/20070305.111129-17/axiom-dom-20070305.111129-17.pom
[WARNING] Unable to get resource from repository maven2 (http://repo1.maven.org/maven2/)
Downloading: http://repo1.maven.org/maven2/org/apache/ws/commons/axiom/axiom-dom/20070305.111129-17/axiom-dom-20070305.111129-17.pom
[WARNING] Unable to get resource from repository central (http://repo1.maven.org/maven2)
[INFO] [antrun:run {execution: process-test-resources}]
[INFO] Executing tasks

init:
     [echo] the files are up to date = ${jars.uptodate}

compile:
    [mkdir] Created dir: /export/home/illsleyd/continuum/continuum-1.0.3/apps/continuum/working-directory/61/modules/kernel/test-resources/deployment/service2/build/classes
    [mkdir] Created dir: /export/home/illsleyd/continuum/continuum-1.0.3/apps/continuum/working-directory/61/modules/kernel/test-resources/deployment/service2/build/lib

jar:
     [copy] Copying 1 file to /export/home/illsleyd/continuum/continuum-1.0.3/apps/continuum/working-directory/61/modules/kernel/test-resources/deployment/service2/build/classes/META-INF
    [mkdir] Created dir: /export/home/illsleyd/continuum/continuum-1.0.3/apps/continuum/working-directory/61/modules/kernel/target/test-resources/deployment/services
      [jar] Building jar: /export/home/illsleyd/continuum/continuum-1.0.3/apps/continuum/working-directory/61/modules/kernel/target/test-resources/deployment/services/service2.jar
   [delete] Deleting directory /export/home/illsleyd/continuum/continuum-1.0.3/apps/continuum/working-directory/61/modules/kernel/test-resources/deployment/service2/build

init:
     [echo] the files are up to date = ${jars.uptodate}

compile:
    [mkdir] Created dir: /export/home/illsleyd/continuum/continuum-1.0.3/apps/continuum/working-directory/61/modules/kernel/test-resources/deployment/echo/build/classes
    [mkdir] Created dir: /export/home/illsleyd/continuum/continuum-1.0.3/apps/continuum/working-directory/61/modules/kernel/test-resources/deployment/echo/build/lib

jar:
     [copy] Copying 1 file to /export/home/illsleyd/continuum/continuum-1.0.3/apps/continuum/working-directory/61/modules/kernel/test-resources/deployment/echo/build/classes/META-INF
    [mkdir] Created dir: /export/home/illsleyd/continuum/continuum-1.0.3/apps/continuum/working-directory/61/modules/kernel/target/echo
      [jar] Building jar: /export/home/illsleyd/continuum/continuum-1.0.3/apps/continuum/working-directory/61/modules/kernel/target/echo/echo.aar
   [delete] Deleting directory /export/home/illsleyd/continuum/continuum-1.0.3/apps/continuum/working-directory/61/modules/kernel/test-resources/deployment/echo/build

init:
     [echo] the files are up to date = ${jars.uptodate}

compile:
    [mkdir] Created dir: /export/home/illsleyd/continuum/continuum-1.0.3/apps/continuum/working-directory/61/modules/kernel/test-resources/deployment/invalidservice/build/classes
    [mkdir] Created dir: /export/home/illsleyd/continuum/continuum-1.0.3/apps/continuum/working-directory/61/modules/kernel/test-resources/deployment/invalidservice/build/lib

jar:
     [copy] Copying 1 file to /export/home/illsleyd/continuum/continuum-1.0.3/apps/continuum/working-directory/61/modules/kernel/test-resources/deployment/invalidservice/build/classes/META-INF
    [mkdir] Created dir: /export/home/illsleyd/continuum/continuum-1.0.3/apps/continuum/working-directory/61/modules/kernel/target/test-resources/InvalidDeployment/services
      [jar] Building jar: /export/home/illsleyd/continuum/continuum-1.0.3/apps/continuum/working-directory/61/modules/kernel/target/test-resources/InvalidDeployment/services/invalidService.jar
   [delete] Deleting directory /export/home/illsleyd/continuum/continuum-1.0.3/apps/continuum/working-directory/61/modules/kernel/test-resources/deployment/invalidservice/build

init:
     [echo] the files are up to date = ${jars.uptodate}

compile:
    [mkdir] Created dir: /export/home/illsleyd/continuum/continuum-1.0.3/apps/continuum/working-directory/61/modules/kernel/test-resources/deployment/module1/build/classes
    [mkdir] Created dir: /export/home/illsleyd/continuum/continuum-1.0.3/apps/continuum/working-directory/61/modules/kernel/test-resources/deployment/module1/build/lib

jar:
     [copy] Copying 1 file to /export/home/illsleyd/continuum/continuum-1.0.3/apps/continuum/working-directory/61/modules/kernel/test-resources/deployment/module1/build/classes/META-INF
    [mkdir] Created dir: /export/home/illsleyd/continuum/continuum-1.0.3/apps/continuum/working-directory/61/modules/kernel/target/test-resources/deployment/modules
      [jar] Building jar: /export/home/illsleyd/continuum/continuum-1.0.3/apps/continuum/working-directory/61/modules/kernel/target/test-resources/deployment/modules/module1.mar
   [delete] Deleting directory /export/home/illsleyd/continuum/continuum-1.0.3/apps/continuum/working-directory/61/modules/kernel/test-resources/deployment/module1/build

init:
     [echo] the files are up to date = ${jars.uptodate}

compile:
    [mkdir] Created dir: /export/home/illsleyd/continuum/continuum-1.0.3/apps/continuum/working-directory/61/modules/kernel/test-resources/deployment/serviceModule/build/classes
    [mkdir] Created dir: /export/home/illsleyd/continuum/continuum-1.0.3/apps/continuum/working-directory/61/modules/kernel/test-resources/deployment/serviceModule/build/lib

jar:
     [copy] Copying 1 file to /export/home/illsleyd/continuum/continuum-1.0.3/apps/continuum/working-directory/61/modules/kernel/test-resources/deployment/serviceModule/build/classes/META-INF
    [mkdir] Created dir: /export/home/illsleyd/continuum/continuum-1.0.3/apps/continuum/working-directory/61/modules/kernel/target/test-resources/InvalidDeployment/modules
      [jar] Building jar: /export/home/illsleyd/continuum/continuum-1.0.3/apps/continuum/working-directory/61/modules/kernel/target/test-resources/InvalidDeployment/modules/serviceModule.jar
   [delete] Deleting directory /export/home/illsleyd/continuum/continuum-1.0.3/apps/continuum/working-directory/61/modules/kernel/test-resources/deployment/serviceModule/build
[INFO] Executed tasks
[INFO] [compiler:testCompile]
[INFO] Compiling 93 source files to /export/home/illsleyd/continuum/continuum-1.0.3/apps/continuum/working-directory/61/modules/kernel/target/test-classes
[INFO] [antrun:run {execution: test-compile}]
[INFO] Executing tasks

testsetup:
    [mkdir] Created dir: /export/home/illsleyd/continuum/continuum-1.0.3/apps/continuum/working-directory/61/modules/kernel/target/test-resources/java2sec/more
    [mkdir] Created dir: /export/home/illsleyd/continuum/continuum-1.0.3/apps/continuum/working-directory/61/modules/kernel/target/test-resources/java2sec/less
      [jar] Building jar: /export/home/illsleyd/continuum/continuum-1.0.3/apps/continuum/working-directory/61/modules/kernel/target/test-resources/java2sec/more/MorePermission.jar
   [delete] Deleting directory /export/home/illsleyd/continuum/continuum-1.0.3/apps/continuum/working-directory/61/modules/kernel/target/test-classes/org/apache/axis2/java/security/driver
   [delete] Deleting directory /export/home/illsleyd/continuum/continuum-1.0.3/apps/continuum/working-directory/61/modules/kernel/target/test-classes/org/apache/axis2/java/security/more
   [delete] Deleting directory /export/home/illsleyd/continuum/continuum-1.0.3/apps/continuum/working-directory/61/modules/kernel/target/test-classes/org/apache/axis2/java/security/action
   [delete] Deleting directory /export/home/illsleyd/continuum/continuum-1.0.3/apps/continuum/working-directory/61/modules/kernel/target/test-classes/org/apache/axis2/java/security/interf
      [jar] Building jar: /export/home/illsleyd/continuum/continuum-1.0.3/apps/continuum/working-directory/61/modules/kernel/target/test-resources/java2sec/less/LessPermission.jar
   [delete] Deleting directory /export/home/illsleyd/continuum/continuum-1.0.3/apps/continuum/working-directory/61/modules/kernel/target/test-classes/org/apache/axis2/java/security/less
[INFO] Executed tasks
[INFO] [surefire:test]
[INFO] Setting reports dir: /export/home/illsleyd/continuum/continuum-1.0.3/apps/continuum/working-directory/61/modules/kernel/target/surefire-reports

-------------------------------------------------------
 T E S T S
-------------------------------------------------------
log4j:WARN No appenders could be found for logger (org.apache.axis2.engine.Phase).
log4j:WARN Please initialize the log4j system properly.
[surefire] Running org.apache.axis2.phaserule.PhaseLastTest
[surefire] Tests run: 1, Failures: 0, Errors: 0, Time elapsed: 0.023 sec
[surefire] Running org.apache.axis2.phaserule.InvalidPhaseFirstTest
[surefire] Tests run: 1, Failures: 0, Errors: 0, Time elapsed: 0.004 sec
[surefire] Running org.apache.axis2.phaserule.BeforeWithNoFirstHandlerTest
[surefire] Tests run: 1, Failures: 0, Errors: 0, Time elapsed: 0.005 sec
[surefire] Running org.apache.axis2.phaserule.InvalidPhaseRuleTest
[surefire] Tests run: 2, Failures: 0, Errors: 0, Time elapsed: 0.017 sec
[surefire] Running org.apache.axis2.phaserule.AddingHandlerToEachPhaseTest
[surefire] Tests run: 3, Failures: 0, Errors: 0, Time elapsed: 0.004 sec
[surefire] Running org.apache.axis2.phaserule.SingleHandlerPhaseTest
[surefire] Tests run: 1, Failures: 0, Errors: 0, Time elapsed: 0.002 sec
[surefire] Running org.apache.axis2.phaserule.PreDispatchPhaseRuleTest
[surefire] Tests run: 1, Failures: 0, Errors: 0, Time elapsed: 0.003 sec
[surefire] Running org.apache.axis2.phaserule.PhaseFirstTest
[surefire] Tests run: 1, Failures: 0, Errors: 0, Time elapsed: 0.003 sec
[surefire] Running org.apache.axis2.phaserule.InvalidPhaselastTest
[surefire] Tests run: 1, Failures: 0, Errors: 0, Time elapsed: 0.002 sec
[surefire] Running org.apache.axis2.phaserule.BeforeAfterTest
[surefire] Tests run: 1, Failures: 0, Errors: 0, Time elapsed: 0.002 sec
[surefire] Running org.apache.axis2.phaserule.BeforeTest
[surefire] Tests run: 1, Failures: 0, Errors: 0, Time elapsed: 0.002 sec
[surefire] Running org.apache.axis2.phaserule.PhaseRuleTest
[surefire] Tests run: 1, Failures: 0, Errors: 0, Time elapsed: 0.01 sec
[surefire] Running org.apache.axis2.phaserule.InvalidPhaseFirstRulesTest
[surefire] Tests run: 1, Failures: 0, Errors: 0, Time elapsed: 0.002 sec
[surefire] Running org.apache.axis2.phaserule.InvalidPhaseLastRuleTest
[surefire] Tests run: 1, Failures: 0, Errors: 0, Time elapsed: 0.002 sec
[surefire] Running org.apache.axis2.deployment.SystemPhasesremovedTest
[surefire] Tests run: 1, Failures: 0, Errors: 0, Time elapsed: 0.015 sec
[surefire] Running org.apache.axis2.deployment.ModuleversionTest
[surefire] Tests run: 2, Failures: 0, Errors: 0, Time elapsed: 0.235 sec
[surefire] Running org.apache.axis2.deployment.DeploymentTotalTest
[surefire] Tests run: 1, Failures: 0, Errors: 0, Time elapsed: 0.055 sec
[surefire] Running org.apache.axis2.deployment.TransportDeploymentTest
[surefire] Tests run: 1, Failures: 0, Errors: 0, Time elapsed: 0.014 sec
[surefire] Running org.apache.axis2.deployment.BuildERWithDeploymentTest
[surefire] Tests run: 1, Failures: 0, Errors: 0, Time elapsed: 0.056 sec
[surefire] Running org.apache.axis2.deployment.ModuleDisengagementTest
[surefire] Tests run: 7, Failures: 0, Errors: 0, Time elapsed: 0.177 sec
[surefire] Running org.apache.axis2.deployment.ServiceGroupTest
[surefire] Tests run: 1, Failures: 0, Errors: 0, Time elapsed: 0.231 sec
[surefire] Running org.apache.axis2.deployment.BadModuleTest
[surefire] Tests run: 1, Failures: 0, Errors: 0, Time elapsed: 0.002 sec
[surefire] Running org.apache.axis2.deployment.MessageFormatterDeploymentTest
[surefire] Tests run: 2, Failures: 0, Errors: 0, Time elapsed: 0.485 sec
[surefire] Running org.apache.axis2.deployment.AxisMessageTest
[surefire] Tests run: 1, Failures: 0, Errors: 0, Time elapsed: 0.563 sec
[surefire] Running org.apache.axis2.deployment.ModifiedConfigFileTest
[surefire] Tests run: 1, Failures: 0, Errors: 0, Time elapsed: 0.002 sec
[surefire] Running org.apache.axis2.deployment.OperationExcludeTest
[surefire] Tests run: 1, Failures: 0, Errors: 0, Time elapsed: 0.306 sec
[surefire] Running org.apache.axis2.deployment.AddingObserverTest
[surefire] Tests run: 1, Failures: 0, Errors: 0, Time elapsed: 0.176 sec
[surefire] Running org.apache.axis2.deployment.SameServiceAddingTest
[surefire] Tests run: 1, Failures: 0, Errors: 0, Time elapsed: 0.015 sec
[surefire] Running org.apache.axis2.deployment.BuilderSelectorDeploymentTest
[surefire] Tests run: 2, Failures: 0, Errors: 0, Time elapsed: 0.345 sec
[surefire] Running org.apache.axis2.engine.MessageContextSaveCTest
MessageContextSaveCTest:testHierarchyNewContext(): *** Original OperationContext message context table ****
message context table entry:   label [Out]    message ID [urn:uuid:2842E4A067ECD0FD771173111713859]    
message context table entry:   label [In]    message ID [urn:uuid:2842E4A067ECD0FD771173111713854]    
MessageContextSaveCTest:testHierarchyNewContext(): - - - Save the message context from the engine - - - -
TempHandler[1]:invoke(): executedHandlers.add(1)
SaveHandler[2]:invoke(): msgContext.pause()
SaveHandler[2]:invoke(): Resetting the file to use.
SaveHandler[2]:invoke(): temp file = [mcObjTest22890.tmp]
SaveHandler[2]:invoke(): saving message context.....
SaveHandler[2]:invoke(): ....saved message context.....
SaveHandler[2]:invoke(): file size after save [15312]   temp file = [mcObjTest22890.tmp]
SaveHandler[2]:invoke(): executedHandlers.add(2)
MessageContextSaveCTest:testHierarchyNewContext(): *** Originial object graph ****
class[org.apache.axis2.context.MessageContext]  id[urn:uuid:2842E4A067ECD0FD771173111713859]  hashcode[23686363] 
class[org.apache.axis2.context.OperationContext]  id[TestOperationA1]  hashcode[23697864] 
class[org.apache.axis2.context.ServiceContext]  id[ServiceA]  hashcode[13705010] 
class[org.apache.axis2.context.ServiceGroupContext]  id[ABCServiceGroup]  hashcode[30456965] 
class[org.apache.axis2.context.ConfigurationContext]  id[null]  hashcode[12200811] 
class[org.apache.axis2.description.InOutAxisOperation]  id[TestOperationA1]  hashcode[10512406] 
class[org.apache.axis2.description.AxisService]  id[ServiceA]  hashcode[7899771] 
class[org.apache.axis2.description.AxisServiceGroup]  id[ServiceA]  hashcode[30131659] 
class[org.apache.axis2.engine.AxisConfiguration]  id[null]  hashcode[19320273] 
MessageContextSaveCTest:testHierarchyNewContext(): - - - Restore the message context on a separate engine  - - - - - - - - - - - - - - - -
restoreMessageContext(): temp file = [mcObjTest22890.tmp]
restoreMessageContext(): restoring a message context.....
restoreMessageContext(): ....restored message context.....
MessageContextSaveCTest:testHierarchyNewContext(): *** Restored object graph ****
class[org.apache.axis2.context.MessageContext]  id[urn:uuid:2842E4A067ECD0FD771173111713859]  hashcode[30580452] 
class[org.apache.axis2.context.OperationContext]  id[TestOperationA1]  hashcode[12429675] 
class[org.apache.axis2.context.ServiceContext]  id[ServiceA]  hashcode[29208622] 
class[org.apache.axis2.context.ServiceGroupContext]  id[ABCServiceGroup]  hashcode[7974486] 
class[org.apache.axis2.context.ConfigurationContext]  id[null]  hashcode[10800875] 
class[org.apache.axis2.description.InOutAxisOperation]  id[TestOperationA1]  hashcode[19727408] 
class[org.apache.axis2.description.AxisService]  id[ServiceA]  hashcode[838806] 
class[org.apache.axis2.description.AxisServiceGroup]  id[ServiceA]  hashcode[4952321] 
class[org.apache.axis2.engine.AxisConfiguration]  id[null]  hashcode[18677967] 
MessageContextSaveCTest:testHierarchyNewContext(): *** Restored OperationContext message context table ****
message context table entry:   label [Out]    message ID [urn:uuid:2842E4A067ECD0FD771173111713859]    
message context table entry:   label [In]    message ID [urn:uuid:2842E4A067ECD0FD771173111713854]    
compareMCTable:  Return TRUE:  message context tables match
MessageContextSaveCTest:testHierarchyNewContext(): - - - Resume the restored message context - - - - - - - - - - - - - - - -
SaveHandler[2]:invoke(): Configured for no action to be performed.
TempHandler[3]:invoke(): executedHandlers.add(3)
MessageContextSaveCTest:testHierarchyNewContext(): *** Post Resumed object graph ****
class[org.apache.axis2.context.MessageContext]  id[urn:uuid:2842E4A067ECD0FD771173111713859]  hashcode[30580452] 
class[org.apache.axis2.context.OperationContext]  id[TestOperationA1]  hashcode[12429675] 
class[org.apache.axis2.context.ServiceContext]  id[ServiceA]  hashcode[29208622] 
class[org.apache.axis2.context.ServiceGroupContext]  id[ABCServiceGroup]  hashcode[7974486] 
class[org.apache.axis2.context.ConfigurationContext]  id[null]  hashcode[10800875] 
class[org.apache.axis2.description.InOutAxisOperation]  id[TestOperationA1]  hashcode[19727408] 
class[org.apache.axis2.description.AxisService]  id[ServiceA]  hashcode[838806] 
class[org.apache.axis2.description.AxisServiceGroup]  id[ServiceA]  hashcode[4952321] 
class[org.apache.axis2.engine.AxisConfiguration]  id[null]  hashcode[18677967] 
MessageContextSaveCTest: compareObjectGraphInfo(): name [ServiceA]  code1 [[13705010]]  !=   code2 [[29208622]]
MessageContextSaveCTest:testHierarchyReuse(): - - - Save the message context from the engine - - - -
TempHandler[1]:invoke(): executedHandlers.add(1)
SaveHandler[2]:invoke(): msgContext.pause()
SaveHandler[2]:invoke(): Resetting the file to use.
SaveHandler[2]:invoke(): temp file = [mcObjTest22891.tmp]
SaveHandler[2]:invoke(): saving message context.....
SaveHandler[2]:invoke(): ....saved message context.....
SaveHandler[2]:invoke(): file size after save [15311]   temp file = [mcObjTest22891.tmp]
SaveHandler[2]:invoke(): executedHandlers.add(2)
MessageContextSaveCTest:testHierarchyReuse(): *** Originial object graph ****
class[org.apache.axis2.context.MessageContext]  id[urn:uuid:2842E4A067ECD0FD771173111713883]  hashcode[18888821] 
class[org.apache.axis2.context.OperationContext]  id[TestOperationA1]  hashcode[17670616] 
class[org.apache.axis2.context.ServiceContext]  id[ServiceA]  hashcode[9454743] 
class[org.apache.axis2.context.ServiceGroupContext]  id[ABCServiceGroup]  hashcode[18584303] 
class[org.apache.axis2.context.ConfigurationContext]  id[null]  hashcode[13123665] 
class[org.apache.axis2.description.InOutAxisOperation]  id[TestOperationA1]  hashcode[7143557] 
class[org.apache.axis2.description.AxisService]  id[ServiceA]  hashcode[16164625] 
class[org.apache.axis2.description.AxisServiceGroup]  id[ServiceA]  hashcode[22174443] 
class[org.apache.axis2.engine.AxisConfiguration]  id[null]  hashcode[30348972] 
MessageContextSaveCTest:testHierarchyReuse(): - - - Restore the message context on a separate engine  - - - - - - - - - - - - - - - -
restoreMessageContext(): temp file = [mcObjTest22891.tmp]
restoreMessageContext(): restoring a message context.....
restoreMessageContext(): ....restored message context.....
MessageContextSaveCTest:testHierarchyReuse(): *** Restored object graph ****
class[org.apache.axis2.context.MessageContext]  id[urn:uuid:2842E4A067ECD0FD771173111713883]  hashcode[23207910] 
class[org.apache.axis2.context.OperationContext]  id[TestOperationA1]  hashcode[18633599] 
class[org.apache.axis2.context.ServiceContext]  id[ServiceA]  hashcode[11389672] 
class[org.apache.axis2.context.ServiceGroupContext]  id[ABCServiceGroup]  hashcode[31744092] 
class[org.apache.axis2.context.ConfigurationContext]  id[null]  hashcode[7501974] 
class[org.apache.axis2.description.InOutAxisOperation]  id[TestOperationA1]  hashcode[26539111] 
class[org.apache.axis2.description.AxisService]  id[ServiceA]  hashcode[21679729] 
class[org.apache.axis2.description.AxisServiceGroup]  id[ServiceA]  hashcode[3632323] 
class[org.apache.axis2.engine.AxisConfiguration]  id[null]  hashcode[12954537] 
MessageContextSaveCTest:testHierarchyReuse(): - - - Resume the restored message context - - - - - - - - - - - - - - - -
SaveHandler[2]:invoke(): msgContext.pause()
SaveHandler[2]:invoke(): Resetting the file to use.
SaveHandler[2]:invoke(): temp file = [mcObjTest22891.tmp]
SaveHandler[2]:invoke(): saving message context.....
SaveHandler[2]:invoke(): ....saved message context.....
SaveHandler[2]:invoke(): file size after save [14662]   temp file = [mcObjTest22891.tmp]
SaveHandler[2]:invoke(): executedHandlers.add(2)
MessageContextSaveCTest:testHierarchyReuse(): *** Post Resumed object graph ****
class[org.apache.axis2.context.MessageContext]  id[urn:uuid:2842E4A067ECD0FD771173111713883]  hashcode[23207910] 
class[org.apache.axis2.context.OperationContext]  id[TestOperationA1]  hashcode[18633599] 
class[org.apache.axis2.context.ServiceContext]  id[ServiceA]  hashcode[11389672] 
class[org.apache.axis2.context.ServiceGroupContext]  id[ABCServiceGroup]  hashcode[31744092] 
class[org.apache.axis2.context.ConfigurationContext]  id[null]  hashcode[7501974] 
class[org.apache.axis2.description.InOutAxisOperation]  id[TestOperationA1]  hashcode[26539111] 
class[org.apache.axis2.description.AxisService]  id[ServiceA]  hashcode[21679729] 
class[org.apache.axis2.description.AxisServiceGroup]  id[ServiceA]  hashcode[3632323] 
class[org.apache.axis2.engine.AxisConfiguration]  id[null]  hashcode[12954537] 
[surefire] Tests run: 2, Failures: 0, Errors: 0, Time elapsed: 0.5 sec
[surefire] Running org.apache.axis2.engine.OptionsSaveTest
OptionsSaveTest:testSaveAndRestore():  BEGIN ---------------
OptionsSaveTest:testSaveAndRestore(): temp file = [optionsSave22893.tmp]
OptionsSaveTest:testSaveAndRestore(): saving .....
OptionsSaveTest:testSaveAndRestore(): ....save operation completed.....
OptionsSaveTest:testSaveAndRestore(): file size after save [3034]   temp file = [optionsSave22893.tmp]
OptionsSaveTest:testSaveAndRestore(): restoring .....
OptionsSaveTest:testSaveAndRestore(): ....restored operation completed.....
OptionsSaveTest:testSaveAndRestore():   Options equivalency [true]
OptionsSaveTest:testSaveAndRestore():  END ---------------
[surefire] Tests run: 1, Failures: 0, Errors: 0, Time elapsed: 0.021 sec
[surefire] Running org.apache.axis2.engine.EnginePausingTest
[surefire] Tests run: 1, Failures: 0, Errors: 0, Time elapsed: 0.009 sec
[surefire] Running org.apache.axis2.engine.MessageContextTest
[surefire] Tests run: 1, Failures: 0, Errors: 0, Time elapsed: 0.002 sec
[surefire] Running org.apache.axis2.engine.MessageContextSelfManagedDataTest
MessageContextSelfManagedDataTest::testSelfManagedData01()=======================================
MessageContextSelfManagedDataTest::TempHandler01[id=101].invoke()
MessageContextSelfManagedDataTest::TempHandler01[id=101].invoke(): Completed
MessageContextSelfManagedDataTest::testPause01_noExceptions()=======================================
MessageContextSelfManagedDataTest::TempHandler02[id=102].invoke()
MessageContextSelfManagedDataTest::TempHandler02[id=102].invoke():   Setting self managed data using key [102]
MessageContextSelfManagedDataTest::saveAndRestore::[TempHandler02[id=102].invoke()]   
MessageContextSelfManagedDataTest::saveAndRestore::[TempHandler02[id=102].invoke()]   temp file = [TempHandler02_22894.tmp]
MessageContextSelfManagedDataTest::saveAndRestore::[TempHandler02[id=102].invoke()]   saving message context ....
MessageContextSelfManagedDataTest::TempHandler02[id=102].serializeSelfManagedData()   count [1]
MessageContextSelfManagedDataTest::TempHandler02[id=102].serializeSelfManagedData()   count [1]: saved self managed data string length [25]
MessageContextSelfManagedDataTest::TempHandler02[id=102].serializeSelfManagedData()   count [1]: saved self managed data byte array output stream (UTF) length [33]
MessageContextSelfManagedDataTest::saveAndRestore::[TempHandler02[id=102].invoke()]   ....saved message context .....
MessageContextSelfManagedDataTest::saveAndRestore::[TempHandler02[id=102].invoke()]   restoring message context .....
MessageContextSelfManagedDataTest::TempHandler02[id=102].deserializeSelfManagedData()   count [1]
MessageContextSelfManagedDataTest::saveAndRestore::[TempHandler02[id=102].invoke()]   ....restored message context .....
MessageContextSelfManagedDataTest::TempHandler02[id=102].invoke(): Completed
MessageContextSelfManagedDataTest::testPause02_saveRestoreSelfManagedData()=======================================
MessageContextSelfManagedDataTest::TempHandler02[id=102].invoke()
MessageContextSelfManagedDataTest::TempHandler02[id=102].invoke():   Setting self managed data using key [102]
MessageContextSelfManagedDataTest::saveAndRestore::[TempHandler02[id=102].invoke()]   
MessageContextSelfManagedDataTest::saveAndRestore::[TempHandler02[id=102].invoke()]   temp file = [TempHandler02_22895.tmp]
MessageContextSelfManagedDataTest::saveAndRestore::[TempHandler02[id=102].invoke()]   saving message context ....
MessageContextSelfManagedDataTest::TempHandler02[id=102].serializeSelfManagedData()   count [1]
MessageContextSelfManagedDataTest::TempHandler02[id=102].serializeSelfManagedData()   count [1]: saved self managed data string length [25]
MessageContextSelfManagedDataTest::TempHandler02[id=102].serializeSelfManagedData()   count [1]: saved self managed data byte array output stream (UTF) length [33]
MessageContextSelfManagedDataTest::saveAndRestore::[TempHandler02[id=102].invoke()]   ....saved message context .....
MessageContextSelfManagedDataTest::saveAndRestore::[TempHandler02[id=102].invoke()]   restoring message context .....
MessageContextSelfManagedDataTest::TempHandler02[id=102].deserializeSelfManagedData()   count [1]
MessageContextSelfManagedDataTest::saveAndRestore::[TempHandler02[id=102].invoke()]   ....restored message context .....
MessageContextSelfManagedDataTest::TempHandler02[id=102].invoke(): Completed
MessageContextSelfManagedDataTest::testPause03_saveRestoreOperation()=======================================
MessageContextSelfManagedDataTest::TempHandler02[id=102].invoke()
MessageContextSelfManagedDataTest::TempHandler02[id=102].invoke():   Setting self managed data using key [102]
MessageContextSelfManagedDataTest::saveAndRestore::[TempHandler02[id=102].invoke()]   
MessageContextSelfManagedDataTest::saveAndRestore::[TempHandler02[id=102].invoke()]   temp file = [TempHandler02_22896.tmp]
MessageContextSelfManagedDataTest::saveAndRestore::[TempHandler02[id=102].invoke()]   saving message context ....
MessageContextSelfManagedDataTest::TempHandler02[id=102].serializeSelfManagedData()   count [1]
MessageContextSelfManagedDataTest::TempHandler02[id=102].serializeSelfManagedData()   count [1]: saved self managed data string length [25]
MessageContextSelfManagedDataTest::TempHandler02[id=102].serializeSelfManagedData()   count [1]: saved self managed data byte array output stream (UTF) length [33]
MessageContextSelfManagedDataTest::saveAndRestore::[TempHandler02[id=102].invoke()]   ....saved message context .....
MessageContextSelfManagedDataTest::saveAndRestore::[TempHandler02[id=102].invoke()]   restoring message context .....
MessageContextSelfManagedDataTest::TempHandler02[id=102].deserializeSelfManagedData()   count [1]
MessageContextSelfManagedDataTest::saveAndRestore::[TempHandler02[id=102].invoke()]   ....restored message context .....
MessageContextSelfManagedDataTest::TempHandler02[id=102].invoke(): Completed
MessageContextSelfManagedDataTest::testPause04_saveRestoreAxisService()=======================================
MessageContextSelfManagedDataTest::TempHandler02[id=102].invoke()
MessageContextSelfManagedDataTest::TempHandler02[id=102].invoke():   Setting self managed data using key [102]
MessageContextSelfManagedDataTest::saveAndRestore::[TempHandler02[id=102].invoke()]   
MessageContextSelfManagedDataTest::saveAndRestore::[TempHandler02[id=102].invoke()]   temp file = [TempHandler02_22897.tmp]
MessageContextSelfManagedDataTest::saveAndRestore::[TempHandler02[id=102].invoke()]   saving message context ....
MessageContextSelfManagedDataTest::TempHandler02[id=102].serializeSelfManagedData()   count [1]
MessageContextSelfManagedDataTest::TempHandler02[id=102].serializeSelfManagedData()   count [1]: saved self managed data string length [25]
MessageContextSelfManagedDataTest::TempHandler02[id=102].serializeSelfManagedData()   count [1]: saved self managed data byte array output stream (UTF) length [33]
MessageContextSelfManagedDataTest::saveAndRestore::[TempHandler02[id=102].invoke()]   ....saved message context .....
MessageContextSelfManagedDataTest::saveAndRestore::[TempHandler02[id=102].invoke()]   restoring message context .....
MessageContextSelfManagedDataTest::TempHandler02[id=102].deserializeSelfManagedData()   count [1]
MessageContextSelfManagedDataTest::saveAndRestore::[TempHandler02[id=102].invoke()]   ....restored message context .....
MessageContextSelfManagedDataTest::TempHandler02[id=102].invoke(): Completed
MessageContextSelfManagedDataTest::testPause05_saveRestoreAxisServiceGroup()=======================================
MessageContextSelfManagedDataTest::TempHandler02[id=102].invoke()
MessageContextSelfManagedDataTest::TempHandler02[id=102].invoke():   Setting self managed data using key [102]
MessageContextSelfManagedDataTest::saveAndRestore::[TempHandler02[id=102].invoke()]   
MessageContextSelfManagedDataTest::saveAndRestore::[TempHandler02[id=102].invoke()]   temp file = [TempHandler02_22898.tmp]
MessageContextSelfManagedDataTest::saveAndRestore::[TempHandler02[id=102].invoke()]   saving message context ....
MessageContextSelfManagedDataTest::TempHandler02[id=102].serializeSelfManagedData()   count [1]
MessageContextSelfManagedDataTest::TempHandler02[id=102].serializeSelfManagedData()   count [1]: saved self managed data string length [25]
MessageContextSelfManagedDataTest::TempHandler02[id=102].serializeSelfManagedData()   count [1]: saved self managed data byte array output stream (UTF) length [33]
MessageContextSelfManagedDataTest::saveAndRestore::[TempHandler02[id=102].invoke()]   ....saved message context .....
MessageContextSelfManagedDataTest::saveAndRestore::[TempHandler02[id=102].invoke()]   restoring message context .....
MessageContextSelfManagedDataTest::TempHandler02[id=102].deserializeSelfManagedData()   count [1]
MessageContextSelfManagedDataTest::saveAndRestore::[TempHandler02[id=102].invoke()]   ....restored message context .....
MessageContextSelfManagedDataTest::TempHandler02[id=102].invoke(): Completed
MessageContextSelfManagedDataTest::testPause06_saveRestorePhases()=======================================
MessageContextSelfManagedDataTest::TempHandler02[id=61].invoke()
MessageContextSelfManagedDataTest::TempHandler02[id=61].invoke():   Setting self managed data using key [61]
MessageContextSelfManagedDataTest::saveAndRestore::[TempHandler02[id=61].invoke()]   
MessageContextSelfManagedDataTest::saveAndRestore::[TempHandler02[id=61].invoke()]   temp file = [TempHandler02_22899.tmp]
MessageContextSelfManagedDataTest::saveAndRestore::[TempHandler02[id=61].invoke()]   saving message context ....
MessageContextSelfManagedDataTest::TempHandler02[id=61].serializeSelfManagedData()   count [1]
MessageContextSelfManagedDataTest::TempHandler02[id=61].serializeSelfManagedData()   count [1]: saved self managed data string length [24]
MessageContextSelfManagedDataTest::TempHandler02[id=61].serializeSelfManagedData()   count [1]: saved self managed data byte array output stream (UTF) length [32]
MessageContextSelfManagedDataTest::TempHandler03[id=62].serializeSelfManagedData()   count [1]
MessageContextSelfManagedDataTest::TempHandler03[id=62].serializeSelfManagedData()   count [1]:  No self managed data to serialize
MessageContextSelfManagedDataTest::TempHandler02[id=63].serializeSelfManagedData()   count [1]
MessageContextSelfManagedDataTest::TempHandler02[id=63].serializeSelfManagedData()   count [1]:  No self managed data to serialize
MessageContextSelfManagedDataTest::TempHandler02[id=666].serializeSelfManagedData()   count [1]
MessageContextSelfManagedDataTest::TempHandler02[id=666].serializeSelfManagedData()   count [1]:  No self managed data to serialize
MessageContextSelfManagedDataTest::TempHandler03[id=64].serializeSelfManagedData()   count [1]
MessageContextSelfManagedDataTest::TempHandler03[id=64].serializeSelfManagedData()   count [1]:  No self managed data to serialize
MessageContextSelfManagedDataTest::TempHandler02[id=65].serializeSelfManagedData()   count [1]
MessageContextSelfManagedDataTest::TempHandler02[id=65].serializeSelfManagedData()   count [1]:  No self managed data to serialize
MessageContextSelfManagedDataTest::TempHandler02[id=1000].serializeSelfManagedData()   count [1]
MessageContextSelfManagedDataTest::TempHandler02[id=1000].serializeSelfManagedData()   count [1]:  No self managed data to serialize
MessageContextSelfManagedDataTest::TempHandler03[id=66].serializeSelfManagedData()   count [1]
MessageContextSelfManagedDataTest::TempHandler03[id=66].serializeSelfManagedData()   count [1]:  No self managed data to serialize
MessageContextSelfManagedDataTest::TempHandler02[id=67].serializeSelfManagedData()   count [1]
MessageContextSelfManagedDataTest::TempHandler02[id=67].serializeSelfManagedData()   count [1]:  No self managed data to serialize
MessageContextSelfManagedDataTest::TempHandler03[id=68].serializeSelfManagedData()   count [1]
MessageContextSelfManagedDataTest::TempHandler03[id=68].serializeSelfManagedData()   count [1]:  No self managed data to serialize
MessageContextSelfManagedDataTest::saveAndRestore::[TempHandler02[id=61].invoke()]   ....saved message context .....
MessageContextSelfManagedDataTest::saveAndRestore::[TempHandler02[id=61].invoke()]   restoring message context .....
MessageContextSelfManagedDataTest::TempHandler02[id=61].deserializeSelfManagedData()   count [1]
MessageContextSelfManagedDataTest::saveAndRestore::[TempHandler02[id=61].invoke()]   ....restored message context .....
MessageContextSelfManagedDataTest::TempHandler02[id=61].invoke(): Completed
MessageContextSelfManagedDataTest::TempHandler03[id=62].invoke()
MessageContextSelfManagedDataTest::TempHandler03[id=62].invoke():   Setting self managed data using key [62]
MessageContextSelfManagedDataTest::saveAndRestore::[TempHandler03[id=62].invoke()]   
MessageContextSelfManagedDataTest::saveAndRestore::[TempHandler03[id=62].invoke()]   temp file = [TempHandler03_22900.tmp]
MessageContextSelfManagedDataTest::saveAndRestore::[TempHandler03[id=62].invoke()]   saving message context ....
MessageContextSelfManagedDataTest::TempHandler02[id=61].serializeSelfManagedData()   count [2]
MessageContextSelfManagedDataTest::TempHandler02[id=61].serializeSelfManagedData()   count [2]: saved self managed data string length [24]
MessageContextSelfManagedDataTest::TempHandler02[id=61].serializeSelfManagedData()   count [2]: saved self managed data byte array output stream (UTF) length [32]
MessageContextSelfManagedDataTest::TempHandler03[id=62].serializeSelfManagedData()   count [2]
MessageContextSelfManagedDataTest::TempHandler03[id=62].serializeSelfManagedData()   count [2]: saved self managed data byte [] length [25]
MessageContextSelfManagedDataTest::TempHandler03[id=62].serializeSelfManagedData()   count [2]: saved self managed data byte array output stream length [25]
MessageContextSelfManagedDataTest::TempHandler02[id=63].serializeSelfManagedData()   count [2]
MessageContextSelfManagedDataTest::TempHandler02[id=63].serializeSelfManagedData()   count [2]:  No self managed data to serialize
MessageContextSelfManagedDataTest::TempHandler02[id=666].serializeSelfManagedData()   count [2]
MessageContextSelfManagedDataTest::TempHandler02[id=666].serializeSelfManagedData()   count [2]:  No self managed data to serialize
MessageContextSelfManagedDataTest::TempHandler03[id=64].serializeSelfManagedData()   count [2]
MessageContextSelfManagedDataTest::TempHandler03[id=64].serializeSelfManagedData()   count [2]:  No self managed data to serialize
MessageContextSelfManagedDataTest::TempHandler02[id=65].serializeSelfManagedData()   count [2]
MessageContextSelfManagedDataTest::TempHandler02[id=65].serializeSelfManagedData()   count [2]:  No self managed data to serialize
MessageContextSelfManagedDataTest::TempHandler02[id=1000].serializeSelfManagedData()   count [2]
MessageContextSelfManagedDataTest::TempHandler02[id=1000].serializeSelfManagedData()   count [2]:  No self managed data to serialize
MessageContextSelfManagedDataTest::TempHandler03[id=66].serializeSelfManagedData()   count [2]
MessageContextSelfManagedDataTest::TempHandler03[id=66].serializeSelfManagedData()   count [2]:  No self managed data to serialize
MessageContextSelfManagedDataTest::TempHandler02[id=67].serializeSelfManagedData()   count [2]
MessageContextSelfManagedDataTest::TempHandler02[id=67].serializeSelfManagedData()   count [2]:  No self managed data to serialize
MessageContextSelfManagedDataTest::TempHandler03[id=68].serializeSelfManagedData()   count [2]
MessageContextSelfManagedDataTest::TempHandler03[id=68].serializeSelfManagedData()   count [2]:  No self managed data to serialize
MessageContextSelfManagedDataTest::saveAndRestore::[TempHandler03[id=62].invoke()]   ....saved message context .....
MessageContextSelfManagedDataTest::saveAndRestore::[TempHandler03[id=62].invoke()]   restoring message context .....
MessageContextSelfManagedDataTest::TempHandler02[id=61].deserializeSelfManagedData()   count [2]
MessageContextSelfManagedDataTest::TempHandler03[id=62].deserializeSelfManagedData()   count [1]
MessageContextSelfManagedDataTest::saveAndRestore::[TempHandler03[id=62].invoke()]   ....restored message context .....
MessageContextSelfManagedDataTest::TempHandler03[id=62].invoke(): Completed
MessageContextSelfManagedDataTest::TempHandler02[id=63].invoke()
MessageContextSelfManagedDataTest::TempHandler02[id=63].invoke():   Setting self managed data using key [63]
MessageContextSelfManagedDataTest::saveAndRestore::[TempHandler02[id=63].invoke()]   
MessageContextSelfManagedDataTest::saveAndRestore::[TempHandler02[id=63].invoke()]   temp file = [TempHandler02_22901.tmp]
MessageContextSelfManagedDataTest::saveAndRestore::[TempHandler02[id=63].invoke()]   saving message context ....
MessageContextSelfManagedDataTest::TempHandler02[id=61].serializeSelfManagedData()   count [3]
MessageContextSelfManagedDataTest::TempHandler02[id=61].serializeSelfManagedData()   count [3]: saved self managed data string length [24]
MessageContextSelfManagedDataTest::TempHandler02[id=61].serializeSelfManagedData()   count [3]: saved self managed data byte array output stream (UTF) length [32]
MessageContextSelfManagedDataTest::TempHandler03[id=62].serializeSelfManagedData()   count [3]
MessageContextSelfManagedDataTest::TempHandler03[id=62].serializeSelfManagedData()   count [3]: saved self managed data byte [] length [25]
MessageContextSelfManagedDataTest::TempHandler03[id=62].serializeSelfManagedData()   count [3]: saved self managed data byte array output stream length [25]
MessageContextSelfManagedDataTest::TempHandler02[id=63].serializeSelfManagedData()   count [3]
MessageContextSelfManagedDataTest::TempHandler02[id=63].serializeSelfManagedData()   count [3]: saved self managed data string length [24]
MessageContextSelfManagedDataTest::TempHandler02[id=63].serializeSelfManagedData()   count [3]: saved self managed data byte array output stream (UTF) length [32]
MessageContextSelfManagedDataTest::TempHandler02[id=666].serializeSelfManagedData()   count [3]
MessageContextSelfManagedDataTest::TempHandler02[id=666].serializeSelfManagedData()   count [3]:  No self managed data to serialize
MessageContextSelfManagedDataTest::TempHandler03[id=64].serializeSelfManagedData()   count [3]
MessageContextSelfManagedDataTest::TempHandler03[id=64].serializeSelfManagedData()   count [3]:  No self managed data to serialize
MessageContextSelfManagedDataTest::TempHandler02[id=65].serializeSelfManagedData()   count [3]
MessageContextSelfManagedDataTest::TempHandler02[id=65].serializeSelfManagedData()   count [3]:  No self managed data to serialize
MessageContextSelfManagedDataTest::TempHandler02[id=1000].serializeSelfManagedData()   count [3]
MessageContextSelfManagedDataTest::TempHandler02[id=1000].serializeSelfManagedData()   count [3]:  No self managed data to serialize
MessageContextSelfManagedDataTest::TempHandler03[id=66].serializeSelfManagedData()   count [3]
MessageContextSelfManagedDataTest::TempHandler03[id=66].serializeSelfManagedData()   count [3]:  No self managed data to serialize
MessageContextSelfManagedDataTest::TempHandler02[id=67].serializeSelfManagedData()   count [3]
MessageContextSelfManagedDataTest::TempHandler02[id=67].serializeSelfManagedData()   count [3]:  No self managed data to serialize
MessageContextSelfManagedDataTest::TempHandler03[id=68].serializeSelfManagedData()   count [3]
MessageContextSelfManagedDataTest::TempHandler03[id=68].serializeSelfManagedData()   count [3]:  No self managed data to serialize
MessageContextSelfManagedDataTest::saveAndRestore::[TempHandler02[id=63].invoke()]   ....saved message context .....
MessageContextSelfManagedDataTest::saveAndRestore::[TempHandler02[id=63].invoke()]   restoring message context .....
MessageContextSelfManagedDataTest::TempHandler02[id=61].deserializeSelfManagedData()   count [3]
MessageContextSelfManagedDataTest::TempHandler03[id=62].deserializeSelfManagedData()   count [2]
MessageContextSelfManagedDataTest::TempHandler02[id=63].deserializeSelfManagedData()   count [1]
MessageContextSelfManagedDataTest::saveAndRestore::[TempHandler02[id=63].invoke()]   ....restored message context .....
MessageContextSelfManagedDataTest::TempHandler02[id=63].invoke(): Completed
MessageContextSelfManagedDataTest::TempHandler02[id=666].invoke()
MessageContextSelfManagedDataTest::TempHandler02[id=666].invoke():   Setting self managed data using key [666]
MessageContextSelfManagedDataTest::saveAndRestore::[TempHandler02[id=666].invoke()]   
MessageContextSelfManagedDataTest::saveAndRestore::[TempHandler02[id=666].invoke()]   temp file = [TempHandler02_22902.tmp]
MessageContextSelfManagedDataTest::saveAndRestore::[TempHandler02[id=666].invoke()]   saving message context ....
MessageContextSelfManagedDataTest::TempHandler02[id=61].serializeSelfManagedData()   count [4]
MessageContextSelfManagedDataTest::TempHandler02[id=61].serializeSelfManagedData()   count [4]: saved self managed data string length [24]
MessageContextSelfManagedDataTest::TempHandler02[id=61].serializeSelfManagedData()   count [4]: saved self managed data byte array output stream (UTF) length [32]
MessageContextSelfManagedDataTest::TempHandler03[id=62].serializeSelfManagedData()   count [4]
MessageContextSelfManagedDataTest::TempHandler03[id=62].serializeSelfManagedData()   count [4]: saved self managed data byte [] length [25]
MessageContextSelfManagedDataTest::TempHandler03[id=62].serializeSelfManagedData()   count [4]: saved self managed data byte array output stream length [25]
MessageContextSelfManagedDataTest::TempHandler02[id=63].serializeSelfManagedData()   count [4]
MessageContextSelfManagedDataTest::TempHandler02[id=63].serializeSelfManagedData()   count [4]: saved self managed data string length [24]
MessageContextSelfManagedDataTest::TempHandler02[id=63].serializeSelfManagedData()   count [4]: saved self managed data byte array output stream (UTF) length [32]
MessageContextSelfManagedDataTest::TempHandler02[id=666].serializeSelfManagedData()   count [4]
MessageContextSelfManagedDataTest::TempHandler02[id=666].serializeSelfManagedData()   count [4]: saved self managed data string length [25]
MessageContextSelfManagedDataTest::TempHandler02[id=666].serializeSelfManagedData()   count [4]: saved self managed data byte array output stream (UTF) length [33]
MessageContextSelfManagedDataTest::TempHandler03[id=64].serializeSelfManagedData()   count [4]
MessageContextSelfManagedDataTest::TempHandler03[id=64].serializeSelfManagedData()   count [4]:  No self managed data to serialize
MessageContextSelfManagedDataTest::TempHandler02[id=65].serializeSelfManagedData()   count [4]
MessageContextSelfManagedDataTest::TempHandler02[id=65].serializeSelfManagedData()   count [4]:  No self managed data to serialize
MessageContextSelfManagedDataTest::TempHandler02[id=1000].serializeSelfManagedData()   count [4]
MessageContextSelfManagedDataTest::TempHandler02[id=1000].serializeSelfManagedData()   count [4]:  No self managed data to serialize
MessageContextSelfManagedDataTest::TempHandler03[id=66].serializeSelfManagedData()   count [4]
MessageContextSelfManagedDataTest::TempHandler03[id=66].serializeSelfManagedData()   count [4]:  No self managed data to serialize
MessageContextSelfManagedDataTest::TempHandler02[id=67].serializeSelfManagedData()   count [4]
MessageContextSelfManagedDataTest::TempHandler02[id=67].serializeSelfManagedData()   count [4]:  No self managed data to serialize
MessageContextSelfManagedDataTest::TempHandler03[id=68].serializeSelfManagedData()   count [4]
MessageContextSelfManagedDataTest::TempHandler03[id=68].serializeSelfManagedData()   count [4]:  No self managed data to serialize
MessageContextSelfManagedDataTest::saveAndRestore::[TempHandler02[id=666].invoke()]   ....saved message context .....
MessageContextSelfManagedDataTest::saveAndRestore::[TempHandler02[id=666].invoke()]   restoring message context .....
MessageContextSelfManagedDataTest::TempHandler02[id=61].deserializeSelfManagedData()   count [4]
MessageContextSelfManagedDataTest::TempHandler03[id=62].deserializeSelfManagedData()   count [3]
MessageContextSelfManagedDataTest::TempHandler02[id=63].deserializeSelfManagedData()   count [2]
MessageContextSelfManagedDataTest::TempHandler02[id=666].deserializeSelfManagedData()   count [1]
MessageContextSelfManagedDataTest::saveAndRestore::[TempHandler02[id=666].invoke()]   ....restored message context .....
MessageContextSelfManagedDataTest::TempHandler02[id=666].invoke(): Completed
MessageContextSelfManagedDataTest::TempHandler03[id=64].invoke()
MessageContextSelfManagedDataTest::TempHandler03[id=64].invoke():   Setting self managed data using key [64]
MessageContextSelfManagedDataTest::saveAndRestore::[TempHandler03[id=64].invoke()]   
MessageContextSelfManagedDataTest::saveAndRestore::[TempHandler03[id=64].invoke()]   temp file = [TempHandler03_22903.tmp]
MessageContextSelfManagedDataTest::saveAndRestore::[TempHandler03[id=64].invoke()]   saving message context ....
MessageContextSelfManagedDataTest::TempHandler02[id=61].serializeSelfManagedData()   count [5]
MessageContextSelfManagedDataTest::TempHandler02[id=61].serializeSelfManagedData()   count [5]: saved self managed data string length [24]
MessageContextSelfManagedDataTest::TempHandler02[id=61].serializeSelfManagedData()   count [5]: saved self managed data byte array output stream (UTF) length [32]
MessageContextSelfManagedDataTest::TempHandler03[id=62].serializeSelfManagedData()   count [5]
MessageContextSelfManagedDataTest::TempHandler03[id=62].serializeSelfManagedData()   count [5]: saved self managed data byte [] length [25]
MessageContextSelfManagedDataTest::TempHandler03[id=62].serializeSelfManagedData()   count [5]: saved self managed data byte array output stream length [25]
MessageContextSelfManagedDataTest::TempHandler02[id=63].serializeSelfManagedData()   count [5]
MessageContextSelfManagedDataTest::TempHandler02[id=63].serializeSelfManagedData()   count [5]: saved self managed data string length [24]
MessageContextSelfManagedDataTest::TempHandler02[id=63].serializeSelfManagedData()   count [5]: saved self managed data byte array output stream (UTF) length [32]
MessageContextSelfManagedDataTest::TempHandler02[id=666].serializeSelfManagedData()   count [5]
MessageContextSelfManagedDataTest::TempHandler02[id=666].serializeSelfManagedData()   count [5]: saved self managed data string length [25]
MessageContextSelfManagedDataTest::TempHandler02[id=666].serializeSelfManagedData()   count [5]: saved self managed data byte array output stream (UTF) length [33]
MessageContextSelfManagedDataTest::TempHandler03[id=64].serializeSelfManagedData()   count [5]
MessageContextSelfManagedDataTest::TempHandler03[id=64].serializeSelfManagedData()   count [5]: saved self managed data byte [] length [25]
MessageContextSelfManagedDataTest::TempHandler03[id=64].serializeSelfManagedData()   count [5]: saved self managed data byte array output stream length [25]
MessageContextSelfManagedDataTest::TempHandler02[id=65].serializeSelfManagedData()   count [5]
MessageContextSelfManagedDataTest::TempHandler02[id=65].serializeSelfManagedData()   count [5]:  No self managed data to serialize
MessageContextSelfManagedDataTest::TempHandler02[id=1000].serializeSelfManagedData()   count [5]
MessageContextSelfManagedDataTest::TempHandler02[id=1000].serializeSelfManagedData()   count [5]:  No self managed data to serialize
MessageContextSelfManagedDataTest::TempHandler03[id=66].serializeSelfManagedData()   count [5]
MessageContextSelfManagedDataTest::TempHandler03[id=66].serializeSelfManagedData()   count [5]:  No self managed data to serialize
MessageContextSelfManagedDataTest::TempHandler02[id=67].serializeSelfManagedData()   count [5]
MessageContextSelfManagedDataTest::TempHandler02[id=67].serializeSelfManagedData()   count [5]:  No self managed data to serialize
MessageContextSelfManagedDataTest::TempHandler03[id=68].serializeSelfManagedData()   count [5]
MessageContextSelfManagedDataTest::TempHandler03[id=68].serializeSelfManagedData()   count [5]:  No self managed data to serialize
MessageContextSelfManagedDataTest::saveAndRestore::[TempHandler03[id=64].invoke()]   ....saved message context .....
MessageContextSelfManagedDataTest::saveAndRestore::[TempHandler03[id=64].invoke()]   restoring message context .....
MessageContextSelfManagedDataTest::TempHandler02[id=61].deserializeSelfManagedData()   count [5]
MessageContextSelfManagedDataTest::TempHandler03[id=62].deserializeSelfManagedData()   count [4]
MessageContextSelfManagedDataTest::TempHandler02[id=63].deserializeSelfManagedData()   count [3]
MessageContextSelfManagedDataTest::TempHandler02[id=666].deserializeSelfManagedData()   count [2]
MessageContextSelfManagedDataTest::TempHandler03[id=64].deserializeSelfManagedData()   count [1]
MessageContextSelfManagedDataTest::saveAndRestore::[TempHandler03[id=64].invoke()]   ....restored message context .....
MessageContextSelfManagedDataTest::TempHandler03[id=64].invoke(): Completed
MessageContextSelfManagedDataTest::TempHandler02[id=65].invoke()
MessageContextSelfManagedDataTest::TempHandler02[id=65].invoke():   Setting self managed data using key [65]
MessageContextSelfManagedDataTest::saveAndRestore::[TempHandler02[id=65].invoke()]   
MessageContextSelfManagedDataTest::saveAndRestore::[TempHandler02[id=65].invoke()]   temp file = [TempHandler02_22904.tmp]
MessageContextSelfManagedDataTest::saveAndRestore::[TempHandler02[id=65].invoke()]   saving message context ....
MessageContextSelfManagedDataTest::TempHandler02[id=61].serializeSelfManagedData()   count [6]
MessageContextSelfManagedDataTest::TempHandler02[id=61].serializeSelfManagedData()   count [6]: saved self managed data string length [24]
MessageContextSelfManagedDataTest::TempHandler02[id=61].serializeSelfManagedData()   count [6]: saved self managed data byte array output stream (UTF) length [32]
MessageContextSelfManagedDataTest::TempHandler03[id=62].serializeSelfManagedData()   count [6]
MessageContextSelfManagedDataTest::TempHandler03[id=62].serializeSelfManagedData()   count [6]: saved self managed data byte [] length [25]
MessageContextSelfManagedDataTest::TempHandler03[id=62].serializeSelfManagedData()   count [6]: saved self managed data byte array output stream length [25]
MessageContextSelfManagedDataTest::TempHandler02[id=63].serializeSelfManagedData()   count [6]
MessageContextSelfManagedDataTest::TempHandler02[id=63].serializeSelfManagedData()   count [6]: saved self managed data string length [24]
MessageContextSelfManagedDataTest::TempHandler02[id=63].serializeSelfManagedData()   count [6]: saved self managed data byte array output stream (UTF) length [32]
MessageContextSelfManagedDataTest::TempHandler02[id=666].serializeSelfManagedData()   count [6]
MessageContextSelfManagedDataTest::TempHandler02[id=666].serializeSelfManagedData()   count [6]: saved self managed data string length [25]
MessageContextSelfManagedDataTest::TempHandler02[id=666].serializeSelfManagedData()   count [6]: saved self managed data byte array output stream (UTF) length [33]
MessageContextSelfManagedDataTest::TempHandler03[id=64].serializeSelfManagedData()   count [6]
MessageContextSelfManagedDataTest::TempHandler03[id=64].serializeSelfManagedData()   count [6]: saved self managed data byte [] length [25]
MessageContextSelfManagedDataTest::TempHandler03[id=64].serializeSelfManagedData()   count [6]: saved self managed data byte array output stream length [25]
MessageContextSelfManagedDataTest::TempHandler02[id=65].serializeSelfManagedData()   count [6]
MessageContextSelfManagedDataTest::TempHandler02[id=65].serializeSelfManagedData()   count [6]: saved self managed data string length [24]
MessageContextSelfManagedDataTest::TempHandler02[id=65].serializeSelfManagedData()   count [6]: saved self managed data byte array output stream (UTF) length [32]
MessageContextSelfManagedDataTest::TempHandler02[id=1000].serializeSelfManagedData()   count [6]
MessageContextSelfManagedDataTest::TempHandler02[id=1000].serializeSelfManagedData()   count [6]:  No self managed data to serialize
MessageContextSelfManagedDataTest::TempHandler03[id=66].serializeSelfManagedData()   count [6]
MessageContextSelfManagedDataTest::TempHandler03[id=66].serializeSelfManagedData()   count [6]:  No self managed data to serialize
MessageContextSelfManagedDataTest::TempHandler02[id=67].serializeSelfManagedData()   count [6]
MessageContextSelfManagedDataTest::TempHandler02[id=67].serializeSelfManagedData()   count [6]:  No self managed data to serialize
MessageContextSelfManagedDataTest::TempHandler03[id=68].serializeSelfManagedData()   count [6]
MessageContextSelfManagedDataTest::TempHandler03[id=68].serializeSelfManagedData()   count [6]:  No self managed data to serialize
MessageContextSelfManagedDataTest::saveAndRestore::[TempHandler02[id=65].invoke()]   ....saved message context .....
MessageContextSelfManagedDataTest::saveAndRestore::[TempHandler02[id=65].invoke()]   restoring message context .....
MessageContextSelfManagedDataTest::TempHandler02[id=61].deserializeSelfManagedData()   count [6]
MessageContextSelfManagedDataTest::TempHandler03[id=62].deserializeSelfManagedData()   count [5]
MessageContextSelfManagedDataTest::TempHandler02[id=63].deserializeSelfManagedData()   count [4]
MessageContextSelfManagedDataTest::TempHandler02[id=666].deserializeSelfManagedData()   count [3]
MessageContextSelfManagedDataTest::TempHandler03[id=64].deserializeSelfManagedData()   count [2]
MessageContextSelfManagedDataTest::TempHandler02[id=65].deserializeSelfManagedData()   count [1]
MessageContextSelfManagedDataTest::saveAndRestore::[TempHandler02[id=65].invoke()]   ....restored message context .....
MessageContextSelfManagedDataTest::TempHandler02[id=65].invoke(): Completed
MessageContextSelfManagedDataTest::TempHandler02[id=1000].invoke()
MessageContextSelfManagedDataTest::TempHandler02[id=1000].invoke():   Setting self managed data using key [1000]
MessageContextSelfManagedDataTest::saveAndRestore::[TempHandler02[id=1000].invoke()]   
MessageContextSelfManagedDataTest::saveAndRestore::[TempHandler02[id=1000].invoke()]   temp file = [TempHandler02_22905.tmp]
MessageContextSelfManagedDataTest::saveAndRestore::[TempHandler02[id=1000].invoke()]   saving message context ....
MessageContextSelfManagedDataTest::TempHandler02[id=61].serializeSelfManagedData()   count [7]
MessageContextSelfManagedDataTest::TempHandler02[id=61].serializeSelfManagedData()   count [7]: saved self managed data string length [24]
MessageContextSelfManagedDataTest::TempHandler02[id=61].serializeSelfManagedData()   count [7]: saved self managed data byte array output stream (UTF) length [32]
MessageContextSelfManagedDataTest::TempHandler03[id=62].serializeSelfManagedData()   count [7]
MessageContextSelfManagedDataTest::TempHandler03[id=62].serializeSelfManagedData()   count [7]: saved self managed data byte [] length [25]
MessageContextSelfManagedDataTest::TempHandler03[id=62].serializeSelfManagedData()   count [7]: saved self managed data byte array output stream length [25]
MessageContextSelfManagedDataTest::TempHandler02[id=63].serializeSelfManagedData()   count [7]
MessageContextSelfManagedDataTest::TempHandler02[id=63].serializeSelfManagedData()   count [7]: saved self managed data string length [24]
MessageContextSelfManagedDataTest::TempHandler02[id=63].serializeSelfManagedData()   count [7]: saved self managed data byte array output stream (UTF) length [32]
MessageContextSelfManagedDataTest::TempHandler02[id=666].serializeSelfManagedData()   count [7]
MessageContextSelfManagedDataTest::TempHandler02[id=666].serializeSelfManagedData()   count [7]: saved self managed data string length [25]
MessageContextSelfManagedDataTest::TempHandler02[id=666].serializeSelfManagedData()   count [7]: saved self managed data byte array output stream (UTF) length [33]
MessageContextSelfManagedDataTest::TempHandler03[id=64].serializeSelfManagedData()   count [7]
MessageContextSelfManagedDataTest::TempHandler03[id=64].serializeSelfManagedData()   count [7]: saved self managed data byte [] length [25]
MessageContextSelfManagedDataTest::TempHandler03[id=64].serializeSelfManagedData()   count [7]: saved self managed data byte array output stream length [25]
MessageContextSelfManagedDataTest::TempHandler02[id=65].serializeSelfManagedData()   count [7]
MessageContextSelfManagedDataTest::TempHandler02[id=65].serializeSelfManagedData()   count [7]: saved self managed data string length [24]
MessageContextSelfManagedDataTest::TempHandler02[id=65].serializeSelfManagedData()   count [7]: saved self managed data byte array output stream (UTF) length [32]
MessageContextSelfManagedDataTest::TempHandler02[id=1000].serializeSelfManagedData()   count [7]
MessageContextSelfManagedDataTest::TempHandler02[id=1000].serializeSelfManagedData()   count [7]: saved self managed data string length [26]
MessageContextSelfManagedDataTest::TempHandler02[id=1000].serializeSelfManagedData()   count [7]: saved self managed data byte array output stream (UTF) length [34]
MessageContextSelfManagedDataTest::TempHandler03[id=66].serializeSelfManagedData()   count [7]
MessageContextSelfManagedDataTest::TempHandler03[id=66].serializeSelfManagedData()   count [7]:  No self managed data to serialize
MessageContextSelfManagedDataTest::TempHandler02[id=67].serializeSelfManagedData()   count [7]
MessageContextSelfManagedDataTest::TempHandler02[id=67].serializeSelfManagedData()   count [7]:  No self managed data to serialize
MessageContextSelfManagedDataTest::TempHandler03[id=68].serializeSelfManagedData()   count [7]
MessageContextSelfManagedDataTest::TempHandler03[id=68].serializeSelfManagedData()   count [7]:  No self managed data to serialize
MessageContextSelfManagedDataTest::saveAndRestore::[TempHandler02[id=1000].invoke()]   ....saved message context .....
MessageContextSelfManagedDataTest::saveAndRestore::[TempHandler02[id=1000].invoke()]   restoring message context .....
MessageContextSelfManagedDataTest::TempHandler02[id=61].deserializeSelfManagedData()   count [7]
MessageContextSelfManagedDataTest::TempHandler03[id=62].deserializeSelfManagedData()   count [6]
MessageContextSelfManagedDataTest::TempHandler02[id=63].deserializeSelfManagedData()   count [5]
MessageContextSelfManagedDataTest::TempHandler02[id=666].deserializeSelfManagedData()   count [4]
MessageContextSelfManagedDataTest::TempHandler03[id=64].deserializeSelfManagedData()   count [3]
MessageContextSelfManagedDataTest::TempHandler02[id=65].deserializeSelfManagedData()   count [2]
MessageContextSelfManagedDataTest::TempHandler02[id=1000].deserializeSelfManagedData()   count [1]
MessageContextSelfManagedDataTest::saveAndRestore::[TempHandler02[id=1000].invoke()]   ....restored message context .....
MessageContextSelfManagedDataTest::TempHandler02[id=1000].invoke(): Completed
MessageContextSelfManagedDataTest::TempHandler02[id=666].invoke()
MessageContextSelfManagedDataTest::TempHandler02[id=666].invoke():   Setting self managed data using key [666]
MessageContextSelfManagedDataTest::saveAndRestore::[TempHandler02[id=666].invoke()]   
MessageContextSelfManagedDataTest::saveAndRestore::[TempHandler02[id=666].invoke()]   temp file = [TempHandler02_22906.tmp]
MessageContextSelfManagedDataTest::saveAndRestore::[TempHandler02[id=666].invoke()]   saving message context ....
MessageContextSelfManagedDataTest::TempHandler02[id=61].serializeSelfManagedData()   count [8]
MessageContextSelfManagedDataTest::TempHandler02[id=61].serializeSelfManagedData()   count [8]: saved self managed data string length [24]
MessageContextSelfManagedDataTest::TempHandler02[id=61].serializeSelfManagedData()   count [8]: saved self managed data byte array output stream (UTF) length [32]
MessageContextSelfManagedDataTest::TempHandler03[id=62].serializeSelfManagedData()   count [8]
MessageContextSelfManagedDataTest::TempHandler03[id=62].serializeSelfManagedData()   count [8]: saved self managed data byte [] length [25]
MessageContextSelfManagedDataTest::TempHandler03[id=62].serializeSelfManagedData()   count [8]: saved self managed data byte array output stream length [25]
MessageContextSelfManagedDataTest::TempHandler02[id=63].serializeSelfManagedData()   count [8]
MessageContextSelfManagedDataTest::TempHandler02[id=63].serializeSelfManagedData()   count [8]: saved self managed data string length [24]
MessageContextSelfManagedDataTest::TempHandler02[id=63].serializeSelfManagedData()   count [8]: saved self managed data byte array output stream (UTF) length [32]
MessageContextSelfManagedDataTest::TempHandler02[id=666].serializeSelfManagedData()   count [8]
MessageContextSelfManagedDataTest::TempHandler02[id=666].serializeSelfManagedData()   count [8]: saved self managed data string length [48]
MessageContextSelfManagedDataTest::TempHandler02[id=666].serializeSelfManagedData()   count [8]: saved self managed data byte array output stream (UTF) length [56]
MessageContextSelfManagedDataTest::TempHandler03[id=64].serializeSelfManagedData()   count [8]
MessageContextSelfManagedDataTest::TempHandler03[id=64].serializeSelfManagedData()   count [8]: saved self managed data byte [] length [25]
MessageContextSelfManagedDataTest::TempHandler03[id=64].serializeSelfManagedData()   count [8]: saved self managed data byte array output stream length [25]
MessageContextSelfManagedDataTest::TempHandler02[id=65].serializeSelfManagedData()   count [8]
MessageContextSelfManagedDataTest::TempHandler02[id=65].serializeSelfManagedData()   count [8]: saved self managed data string length [24]
MessageContextSelfManagedDataTest::TempHandler02[id=65].serializeSelfManagedData()   count [8]: saved self managed data byte array output stream (UTF) length [32]
MessageContextSelfManagedDataTest::TempHandler02[id=1000].serializeSelfManagedData()   count [8]
MessageContextSelfManagedDataTest::TempHandler02[id=1000].serializeSelfManagedData()   count [8]: saved self managed data string length [26]
MessageContextSelfManagedDataTest::TempHandler02[id=1000].serializeSelfManagedData()   count [8]: saved self managed data byte array output stream (UTF) length [34]
MessageContextSelfManagedDataTest::TempHandler03[id=66].serializeSelfManagedData()   count [8]
MessageContextSelfManagedDataTest::TempHandler03[id=66].serializeSelfManagedData()   count [8]:  No self managed data to serialize
MessageContextSelfManagedDataTest::TempHandler02[id=67].serializeSelfManagedData()   count [8]
MessageContextSelfManagedDataTest::TempHandler02[id=67].serializeSelfManagedData()   count [8]:  No self managed data to serialize
MessageContextSelfManagedDataTest::TempHandler03[id=68].serializeSelfManagedData()   count [8]
MessageContextSelfManagedDataTest::TempHandler03[id=68].serializeSelfManagedData()   count [8]:  No self managed data to serialize
MessageContextSelfManagedDataTest::saveAndRestore::[TempHandler02[id=666].invoke()]   ....saved message context .....
MessageContextSelfManagedDataTest::saveAndRestore::[TempHandler02[id=666].invoke()]   restoring message context .....
MessageContextSelfManagedDataTest::TempHandler02[id=61].deserializeSelfManagedData()   count [8]
MessageContextSelfManagedDataTest::TempHandler03[id=62].deserializeSelfManagedData()   count [7]
MessageContextSelfManagedDataTest::TempHandler02[id=63].deserializeSelfManagedData()   count [6]
MessageContextSelfManagedDataTest::TempHandler02[id=666].deserializeSelfManagedData()   count [5]
MessageContextSelfManagedDataTest::TempHandler03[id=64].deserializeSelfManagedData()   count [4]
MessageContextSelfManagedDataTest::TempHandler02[id=65].deserializeSelfManagedData()   count [3]
MessageContextSelfManagedDataTest::TempHandler02[id=1000].deserializeSelfManagedData()   count [2]
MessageContextSelfManagedDataTest::saveAndRestore::[TempHandler02[id=666].invoke()]   ....restored message context .....
MessageContextSelfManagedDataTest::TempHandler02[id=666].invoke(): Completed
MessageContextSelfManagedDataTest::TempHandler03[id=66].invoke()
MessageContextSelfManagedDataTest::TempHandler03[id=66].invoke():   Setting self managed data using key [66]
MessageContextSelfManagedDataTest::saveAndRestore::[TempHandler03[id=66].invoke()]   
MessageContextSelfManagedDataTest::saveAndRestore::[TempHandler03[id=66].invoke()]   temp file = [TempHandler03_22907.tmp]
MessageContextSelfManagedDataTest::saveAndRestore::[TempHandler03[id=66].invoke()]   saving message context ....
MessageContextSelfManagedDataTest::TempHandler02[id=61].serializeSelfManagedData()   count [9]
MessageContextSelfManagedDataTest::TempHandler02[id=61].serializeSelfManagedData()   count [9]: saved self managed data string length [24]
MessageContextSelfManagedDataTest::TempHandler02[id=61].serializeSelfManagedData()   count [9]: saved self managed data byte array output stream (UTF) length [32]
MessageContextSelfManagedDataTest::TempHandler03[id=62].serializeSelfManagedData()   count [9]
MessageContextSelfManagedDataTest::TempHandler03[id=62].serializeSelfManagedData()   count [9]: saved self managed data byte [] length [25]
MessageContextSelfManagedDataTest::TempHandler03[id=62].serializeSelfManagedData()   count [9]: saved self managed data byte array output stream length [25]
MessageContextSelfManagedDataTest::TempHandler02[id=63].serializeSelfManagedData()   count [9]
MessageContextSelfManagedDataTest::TempHandler02[id=63].serializeSelfManagedData()   count [9]: saved self managed data string length [24]
MessageContextSelfManagedDataTest::TempHandler02[id=63].serializeSelfManagedData()   count [9]: saved self managed data byte array output stream (UTF) length [32]
MessageContextSelfManagedDataTest::TempHandler02[id=666].serializeSelfManagedData()   count [9]
MessageContextSelfManagedDataTest::TempHandler02[id=666].serializeSelfManagedData()   count [9]: saved self managed data string length [48]
MessageContextSelfManagedDataTest::TempHandler02[id=666].serializeSelfManagedData()   count [9]: saved self managed data byte array output stream (UTF) length [56]
MessageContextSelfManagedDataTest::TempHandler03[id=64].serializeSelfManagedData()   count [9]
MessageContextSelfManagedDataTest::TempHandler03[id=64].serializeSelfManagedData()   count [9]: saved self managed data byte [] length [25]
MessageContextSelfManagedDataTest::TempHandler03[id=64].serializeSelfManagedData()   count [9]: saved self managed data byte array output stream length [25]
MessageContextSelfManagedDataTest::TempHandler02[id=65].serializeSelfManagedData()   count [9]
MessageContextSelfManagedDataTest::TempHandler02[id=65].serializeSelfManagedData()   count [9]: saved self managed data string length [24]
MessageContextSelfManagedDataTest::TempHandler02[id=65].serializeSelfManagedData()   count [9]: saved self managed data byte array output stream (UTF) length [32]
MessageContextSelfManagedDataTest::TempHandler02[id=1000].serializeSelfManagedData()   count [9]
MessageContextSelfManagedDataTest::TempHandler02[id=1000].serializeSelfManagedData()   count [9]: saved self managed data string length [26]
MessageContextSelfManagedDataTest::TempHandler02[id=1000].serializeSelfManagedData()   count [9]: saved self managed data byte array output stream (UTF) length [34]
MessageContextSelfManagedDataTest::TempHandler03[id=66].serializeSelfManagedData()   count [9]
MessageContextSelfManagedDataTest::TempHandler03[id=66].serializeSelfManagedData()   count [9]: saved self managed data byte [] length [25]
MessageContextSelfManagedDataTest::TempHandler03[id=66].serializeSelfManagedData()   count [9]: saved self managed data byte array output stream length [25]
MessageContextSelfManagedDataTest::TempHandler02[id=67].serializeSelfManagedData()   count [9]
MessageContextSelfManagedDataTest::TempHandler02[id=67].serializeSelfManagedData()   count [9]:  No self managed data to serialize
MessageContextSelfManagedDataTest::TempHandler03[id=68].serializeSelfManagedData()   count [9]
MessageContextSelfManagedDataTest::TempHandler03[id=68].serializeSelfManagedData()   count [9]:  No self managed data to serialize
MessageContextSelfManagedDataTest::saveAndRestore::[TempHandler03[id=66].invoke()]   ....saved message context .....
MessageContextSelfManagedDataTest::saveAndRestore::[TempHandler03[id=66].invoke()]   restoring message context .....
MessageContextSelfManagedDataTest::TempHandler02[id=61].deserializeSelfManagedData()   count [9]
MessageContextSelfManagedDataTest::TempHandler03[id=62].deserializeSelfManagedData()   count [8]
MessageContextSelfManagedDataTest::TempHandler02[id=63].deserializeSelfManagedData()   count [7]
MessageContextSelfManagedDataTest::TempHandler02[id=666].deserializeSelfManagedData()   count [6]
MessageContextSelfManagedDataTest::TempHandler03[id=64].deserializeSelfManagedData()   count [5]
MessageContextSelfManagedDataTest::TempHandler02[id=65].deserializeSelfManagedData()   count [4]
MessageContextSelfManagedDataTest::TempHandler02[id=1000].deserializeSelfManagedData()   count [3]
MessageContextSelfManagedDataTest::TempHandler03[id=66].deserializeSelfManagedData()   count [1]
MessageContextSelfManagedDataTest::saveAndRestore::[TempHandler03[id=66].invoke()]   ....restored message context .....
MessageContextSelfManagedDataTest::TempHandler03[id=66].invoke(): Completed
MessageContextSelfManagedDataTest::TempHandler02[id=67].invoke()
MessageContextSelfManagedDataTest::TempHandler02[id=67].invoke():   Setting self managed data using key [67]
MessageContextSelfManagedDataTest::saveAndRestore::[TempHandler02[id=67].invoke()]   
MessageContextSelfManagedDataTest::saveAndRestore::[TempHandler02[id=67].invoke()]   temp file = [TempHandler02_22908.tmp]
MessageContextSelfManagedDataTest::saveAndRestore::[TempHandler02[id=67].invoke()]   saving message context ....
MessageContextSelfManagedDataTest::TempHandler02[id=61].serializeSelfManagedData()   count [10]
MessageContextSelfManagedDataTest::TempHandler02[id=61].serializeSelfManagedData()   count [10]: saved self managed data string length [24]
MessageContextSelfManagedDataTest::TempHandler02[id=61].serializeSelfManagedData()   count [10]: saved self managed data byte array output stream (UTF) length [32]
MessageContextSelfManagedDataTest::TempHandler03[id=62].serializeSelfManagedData()   count [10]
MessageContextSelfManagedDataTest::TempHandler03[id=62].serializeSelfManagedData()   count [10]: saved self managed data byte [] length [25]
MessageContextSelfManagedDataTest::TempHandler03[id=62].serializeSelfManagedData()   count [10]: saved self managed data byte array output stream length [25]
MessageContextSelfManagedDataTest::TempHandler02[id=63].serializeSelfManagedData()   count [10]
MessageContextSelfManagedDataTest::TempHandler02[id=63].serializeSelfManagedData()   count [10]: saved self managed data string length [24]
MessageContextSelfManagedDataTest::TempHandler02[id=63].serializeSelfManagedData()   count [10]: saved self managed data byte array output stream (UTF) length [32]
MessageContextSelfManagedDataTest::TempHandler02[id=666].serializeSelfManagedData()   count [10]
MessageContextSelfManagedDataTest::TempHandler02[id=666].serializeSelfManagedData()   count [10]: saved self managed data string length [48]
MessageContextSelfManagedDataTest::TempHandler02[id=666].serializeSelfManagedData()   count [10]: saved self managed data byte array output stream (UTF) length [56]
MessageContextSelfManagedDataTest::TempHandler03[id=64].serializeSelfManagedData()   count [10]
MessageContextSelfManagedDataTest::TempHandler03[id=64].serializeSelfManagedData()   count [10]: saved self managed data byte [] length [25]
MessageContextSelfManagedDataTest::TempHandler03[id=64].serializeSelfManagedData()   count [10]: saved self managed data byte array output stream length [25]
MessageContextSelfManagedDataTest::TempHandler02[id=65].serializeSelfManagedData()   count [10]
MessageContextSelfManagedDataTest::TempHandler02[id=65].serializeSelfManagedData()   count [10]: saved self managed data string length [24]
MessageContextSelfManagedDataTest::TempHandler02[id=65].serializeSelfManagedData()   count [10]: saved self managed data byte array output stream (UTF) length [32]
MessageContextSelfManagedDataTest::TempHandler02[id=1000].serializeSelfManagedData()   count [10]
MessageContextSelfManagedDataTest::TempHandler02[id=1000].serializeSelfManagedData()   count [10]: saved self managed data string length [26]
MessageContextSelfManagedDataTest::TempHandler02[id=1000].serializeSelfManagedData()   count [10]: saved self managed data byte array output stream (UTF) length [34]
MessageContextSelfManagedDataTest::TempHandler03[id=66].serializeSelfManagedData()   count [10]
MessageContextSelfManagedDataTest::TempHandler03[id=66].serializeSelfManagedData()   count [10]: saved self managed data byte [] length [25]
MessageContextSelfManagedDataTest::TempHandler03[id=66].serializeSelfManagedData()   count [10]: saved self managed data byte array output stream length [25]
MessageContextSelfManagedDataTest::TempHandler02[id=67].serializeSelfManagedData()   count [10]
MessageContextSelfManagedDataTest::TempHandler02[id=67].serializeSelfManagedData()   count [10]: saved self managed data string length [24]
MessageContextSelfManagedDataTest::TempHandler02[id=67].serializeSelfManagedData()   count [10]: saved self managed data byte array output stream (UTF) length [32]
MessageContextSelfManagedDataTest::TempHandler03[id=68].serializeSelfManagedData()   count [10]
MessageContextSelfManagedDataTest::TempHandler03[id=68].serializeSelfManagedData()   count [10]:  No self managed data to serialize
MessageContextSelfManagedDataTest::saveAndRestore::[TempHandler02[id=67].invoke()]   ....saved message context .....
MessageContextSelfManagedDataTest::saveAndRestore::[TempHandler02[id=67].invoke()]   restoring message context .....
MessageContextSelfManagedDataTest::TempHandler02[id=61].deserializeSelfManagedData()   count [10]
MessageContextSelfManagedDataTest::TempHandler03[id=62].deserializeSelfManagedData()   count [9]
MessageContextSelfManagedDataTest::TempHandler02[id=63].deserializeSelfManagedData()   count [8]
MessageContextSelfManagedDataTest::TempHandler02[id=666].deserializeSelfManagedData()   count [7]
MessageContextSelfManagedDataTest::TempHandler03[id=64].deserializeSelfManagedData()   count [6]
MessageContextSelfManagedDataTest::TempHandler02[id=65].deserializeSelfManagedData()   count [5]
MessageContextSelfManagedDataTest::TempHandler02[id=1000].deserializeSelfManagedData()   count [4]
MessageContextSelfManagedDataTest::TempHandler03[id=66].deserializeSelfManagedData()   count [2]
MessageContextSelfManagedDataTest::TempHandler02[id=67].deserializeSelfManagedData()   count [1]
MessageContextSelfManagedDataTest::saveAndRestore::[TempHandler02[id=67].invoke()]   ....restored message context .....
MessageContextSelfManagedDataTest::TempHandler02[id=67].invoke(): Completed
MessageContextSelfManagedDataTest::TempHandler03[id=68].invoke()
MessageContextSelfManagedDataTest::TempHandler03[id=68].invoke():   Setting self managed data using key [68]
MessageContextSelfManagedDataTest::saveAndRestore::[TempHandler03[id=68].invoke()]   
MessageContextSelfManagedDataTest::saveAndRestore::[TempHandler03[id=68].invoke()]   temp file = [TempHandler03_22909.tmp]
MessageContextSelfManagedDataTest::saveAndRestore::[TempHandler03[id=68].invoke()]   saving message context ....
MessageContextSelfManagedDataTest::TempHandler02[id=61].serializeSelfManagedData()   count [11]
MessageContextSelfManagedDataTest::TempHandler02[id=61].serializeSelfManagedData()   count [11]: saved self managed data string length [24]
MessageContextSelfManagedDataTest::TempHandler02[id=61].serializeSelfManagedData()   count [11]: saved self managed data byte array output stream (UTF) length [32]
MessageContextSelfManagedDataTest::TempHandler03[id=62].serializeSelfManagedData()   count [11]
MessageContextSelfManagedDataTest::TempHandler03[id=62].serializeSelfManagedData()   count [11]: saved self managed data byte [] length [25]
MessageContextSelfManagedDataTest::TempHandler03[id=62].serializeSelfManagedData()   count [11]: saved self managed data byte array output stream length [25]
MessageContextSelfManagedDataTest::TempHandler02[id=63].serializeSelfManagedData()   count [11]
MessageContextSelfManagedDataTest::TempHandler02[id=63].serializeSelfManagedData()   count [11]: saved self managed data string length [24]
MessageContextSelfManagedDataTest::TempHandler02[id=63].serializeSelfManagedData()   count [11]: saved self managed data byte array output stream (UTF) length [32]
MessageContextSelfManagedDataTest::TempHandler02[id=666].serializeSelfManagedData()   count [11]
MessageContextSelfManagedDataTest::TempHandler02[id=666].serializeSelfManagedData()   count [11]: saved self managed data string length [48]
MessageContextSelfManagedDataTest::TempHandler02[id=666].serializeSelfManagedData()   count [11]: saved self managed data byte array output stream (UTF) length [56]
MessageContextSelfManagedDataTest::TempHandler03[id=64].serializeSelfManagedData()   count [11]
MessageContextSelfManagedDataTest::TempHandler03[id=64].serializeSelfManagedData()   count [11]: saved self managed data byte [] length [25]
MessageContextSelfManagedDataTest::TempHandler03[id=64].serializeSelfManagedData()   count [11]: saved self managed data byte array output stream length [25]
MessageContextSelfManagedDataTest::TempHandler02[id=65].serializeSelfManagedData()   count [11]
MessageContextSelfManagedDataTest::TempHandler02[id=65].serializeSelfManagedData()   count [11]: saved self managed data string length [24]
MessageContextSelfManagedDataTest::TempHandler02[id=65].serializeSelfManagedData()   count [11]: saved self managed data byte array output stream (UTF) length [32]
MessageContextSelfManagedDataTest::TempHandler02[id=1000].serializeSelfManagedData()   count [11]
MessageContextSelfManagedDataTest::TempHandler02[id=1000].serializeSelfManagedData()   count [11]: saved self managed data string length [26]
MessageContextSelfManagedDataTest::TempHandler02[id=1000].serializeSelfManagedData()   count [11]: saved self managed data byte array output stream (UTF) length [34]
MessageContextSelfManagedDataTest::TempHandler03[id=66].serializeSelfManagedData()   count [11]
MessageContextSelfManagedDataTest::TempHandler03[id=66].serializeSelfManagedData()   count [11]: saved self managed data byte [] length [25]
MessageContextSelfManagedDataTest::TempHandler03[id=66].serializeSelfManagedData()   count [11]: saved self managed data byte array output stream length [25]
MessageContextSelfManagedDataTest::TempHandler02[id=67].serializeSelfManagedData()   count [11]
MessageContextSelfManagedDataTest::TempHandler02[id=67].serializeSelfManagedData()   count [11]: saved self managed data string length [24]
MessageContextSelfManagedDataTest::TempHandler02[id=67].serializeSelfManagedData()   count [11]: saved self managed data byte array output stream (UTF) length [32]
MessageContextSelfManagedDataTest::TempHandler03[id=68].serializeSelfManagedData()   count [11]
MessageContextSelfManagedDataTest::TempHandler03[id=68].serializeSelfManagedData()   count [11]: saved self managed data byte [] length [25]
MessageContextSelfManagedDataTest::TempHandler03[id=68].serializeSelfManagedData()   count [11]: saved self managed data byte array output stream length [25]
MessageContextSelfManagedDataTest::saveAndRestore::[TempHandler03[id=68].invoke()]   ....saved message context .....
MessageContextSelfManagedDataTest::saveAndRestore::[TempHandler03[id=68].invoke()]   restoring message context .....
MessageContextSelfManagedDataTest::TempHandler02[id=61].deserializeSelfManagedData()   count [11]
MessageContextSelfManagedDataTest::TempHandler03[id=62].deserializeSelfManagedData()   count [10]
MessageContextSelfManagedDataTest::TempHandler02[id=63].deserializeSelfManagedData()   count [9]
MessageContextSelfManagedDataTest::TempHandler02[id=666].deserializeSelfManagedData()   count [8]
MessageContextSelfManagedDataTest::TempHandler03[id=64].deserializeSelfManagedData()   count [7]
MessageContextSelfManagedDataTest::TempHandler02[id=65].deserializeSelfManagedData()   count [6]
MessageContextSelfManagedDataTest::TempHandler02[id=1000].deserializeSelfManagedData()   count [5]
MessageContextSelfManagedDataTest::TempHandler03[id=66].deserializeSelfManagedData()   count [3]
MessageContextSelfManagedDataTest::TempHandler02[id=67].deserializeSelfManagedData()   count [2]
MessageContextSelfManagedDataTest::TempHandler03[id=68].deserializeSelfManagedData()   count [1]
MessageContextSelfManagedDataTest::saveAndRestore::[TempHandler03[id=68].invoke()]   ....restored message context .....
MessageContextSelfManagedDataTest::TempHandler03[id=68].invoke(): Completed
MessagecontextSelfManagedDataTest::compareHandlers:  class [org.apache.axis2.engine.MessageContextSelfManagedDataTest$TempHandler02] match 
MessagecontextSelfManagedDataTest::compareHandlers:  id [61] match
MessagecontextSelfManagedDataTest::compareHandlers:  class [org.apache.axis2.engine.MessageContextSelfManagedDataTest$TempHandler03] match 
MessagecontextSelfManagedDataTest::compareHandlers:  id [62] match
MessagecontextSelfManagedDataTest::compareHandlers:  class [org.apache.axis2.engine.MessageContextSelfManagedDataTest$TempHandler02] match 
MessagecontextSelfManagedDataTest::compareHandlers:  id [63] match
MessagecontextSelfManagedDataTest::compareHandlers:  class [org.apache.axis2.engine.MessageContextSelfManagedDataTest$TempHandler02] match 
MessagecontextSelfManagedDataTest::compareHandlers:  id [666] match
MessagecontextSelfManagedDataTest::compareHandlers:  class [org.apache.axis2.engine.MessageContextSelfManagedDataTest$TempHandler03] match 
MessagecontextSelfManagedDataTest::compareHandlers:  id [64] match
MessagecontextSelfManagedDataTest::compareHandlers:  class [org.apache.axis2.engine.MessageContextSelfManagedDataTest$TempHandler02] match 
MessagecontextSelfManagedDataTest::compareHandlers:  id [65] match
MessagecontextSelfManagedDataTest::compareHandlers:  class [org.apache.axis2.engine.MessageContextSelfManagedDataTest$TempHandler02] match 
MessagecontextSelfManagedDataTest::compareHandlers:  id [1000] match
MessagecontextSelfManagedDataTest::compareHandlers:  class [org.apache.axis2.engine.MessageContextSelfManagedDataTest$TempHandler02] match 
MessagecontextSelfManagedDataTest::compareHandlers:  id [666] match
MessagecontextSelfManagedDataTest::compareHandlers:  class [org.apache.axis2.engine.MessageContextSelfManagedDataTest$TempHandler03] match 
MessagecontextSelfManagedDataTest::compareHandlers:  id [66] match
MessagecontextSelfManagedDataTest::compareHandlers:  class [org.apache.axis2.engine.MessageContextSelfManagedDataTest$TempHandler02] match 
MessagecontextSelfManagedDataTest::compareHandlers:  id [1000] match
MessagecontextSelfManagedDataTest::compareHandlers:  class [org.apache.axis2.engine.MessageContextSelfManagedDataTest$TempHandler02] match 
MessagecontextSelfManagedDataTest::compareHandlers:  id [67] match
MessagecontextSelfManagedDataTest::compareHandlers:  class [org.apache.axis2.engine.MessageContextSelfManagedDataTest$TempHandler03] match 
MessagecontextSelfManagedDataTest::compareHandlers:  id [68] match
MessageContextSelfManagedDataTest::testPause06_saveRestorePhases()::  invokecallcount [11]
MessageContextSelfManagedDataTest::testPause06_saveRestorePhases()::  handlerA serialize call count [11]
MessageContextSelfManagedDataTest::testPause06_saveRestorePhases()::  handlerA deserialize call count [8]
MessageContextSelfManagedDataTest::testSelfManagedData07()=======================================
MessageContextSelfManagedDataTest::TempHandler03[id=103].invoke()
MessageContextSelfManagedDataTest::TempHandler03[id=103].invoke():   Setting self managed data using key [103]
MessageContextSelfManagedDataTest::saveAndRestore::[TempHandler03[id=103].invoke()]   
MessageContextSelfManagedDataTest::saveAndRestore::[TempHandler03[id=103].invoke()]   temp file = [TempHandler03_22910.tmp]
MessageContextSelfManagedDataTest::saveAndRestore::[TempHandler03[id=103].invoke()]   saving message context ....
MessageContextSelfManagedDataTest::TempHandler03[id=103].serializeSelfManagedData()   count [1]
MessageContextSelfManagedDataTest::TempHandler03[id=103].serializeSelfManagedData()   count [1]: saved self managed data byte [] length [25]
MessageContextSelfManagedDataTest::TempHandler03[id=103].serializeSelfManagedData()   count [1]: saved self managed data byte array output stream length [25]
MessageContextSelfManagedDataTest::saveAndRestore::[TempHandler03[id=103].invoke()]   ....saved message context .....
MessageContextSelfManagedDataTest::saveAndRestore::[TempHandler03[id=103].invoke()]   restoring message context .....
MessageContextSelfManagedDataTest::TempHandler03[id=103].deserializeSelfManagedData()   count [1]
MessageContextSelfManagedDataTest::saveAndRestore::[TempHandler03[id=103].invoke()]   ....restored message context .....
MessageContextSelfManagedDataTest::TempHandler03[id=103].invoke(): Completed
MessageContextSelfManagedDataTest::testSelfManagedData08()=======================================
MessageContextSelfManagedDataTest::TempHandler04[id=104].invoke()
MessageContextSelfManagedDataTest::TempHandler04[id=104].invoke():   Setting self managed data using key [104]
MessageContextSelfManagedDataTest::saveAndRestore::[TempHandler04[id=104].invoke()]   
MessageContextSelfManagedDataTest::saveAndRestore::[TempHandler04[id=104].invoke()]   temp file = [TempHandler04_22911.tmp]
MessageContextSelfManagedDataTest::saveAndRestore::[TempHandler04[id=104].invoke()]   saving message context ....
MessageContextSelfManagedDataTest::TempHandler04[id=104].serializeSelfManagedData()   count [1]
MessageContextSelfManagedDataTest::TempHandler04[id=104].serializeSelfManagedData()   count [1]: saved self managed data byte [] length [4]
MessageContextSelfManagedDataTest::TempHandler04[id=104].serializeSelfManagedData()   count [1]: saved self managed data byte array output stream length [42]
MessageContextSelfManagedDataTest::saveAndRestore::[TempHandler04[id=104].invoke()]   ....saved message context .....
MessageContextSelfManagedDataTest::saveAndRestore::[TempHandler04[id=104].invoke()]   restoring message context .....
MessageContextSelfManagedDataTest::TempHandler04[id=104].deserializeSelfManagedData()   count [1]
MessageContextSelfManagedDataTest::saveAndRestore::[TempHandler04[id=104].invoke()]   ....restored message context .....
MessageContextSelfManagedDataTest::TempHandler04[id=104].invoke(): Completed
MessageContextSelfManagedDataTest::testSelfManagedData09()=======================================
MessageContextSelfManagedDataTest::TempHandler03[id=103].invoke()
MessageContextSelfManagedDataTest::TempHandler03[id=103].invoke():   Setting self managed data using key [103]
MessageContextSelfManagedDataTest::saveAndRestore::[TempHandler03[id=103].invoke()]   
MessageContextSelfManagedDataTest::saveAndRestore::[TempHandler03[id=103].invoke()]   temp file = [TempHandler03_22912.tmp]
MessageContextSelfManagedDataTest::saveAndRestore::[TempHandler03[id=103].invoke()]   saving message context ....
MessageContextSelfManagedDataTest::TempHandler03[id=103].serializeSelfManagedData()   count [1]
MessageContextSelfManagedDataTest::TempHandler03[id=103].serializeSelfManagedData()   count [1]: saved self managed data byte [] length [25]
MessageContextSelfManagedDataTest::TempHandler03[id=103].serializeSelfManagedData()   count [1]: saved self managed data byte array output stream length [25]
MessageContextSelfManagedDataTest::TempHandler04[id=104].serializeSelfManagedData()   count [1]
MessageContextSelfManagedDataTest::TempHandler04[id=104].serializeSelfManagedData()   count [1]:  No self managed data to serialize
MessageContextSelfManagedDataTest::saveAndRestore::[TempHandler03[id=103].invoke()]   ....saved message context .....
MessageContextSelfManagedDataTest::saveAndRestore::[TempHandler03[id=103].invoke()]   restoring message context .....
MessageContextSelfManagedDataTest::TempHandler03[id=103].deserializeSelfManagedData()   count [1]
MessageContextSelfManagedDataTest::saveAndRestore::[TempHandler03[id=103].invoke()]   ....restored message context .....
MessageContextSelfManagedDataTest::TempHandler03[id=103].invoke(): Completed
MessageContextSelfManagedDataTest::TempHandler04[id=104].invoke()
MessageContextSelfManagedDataTest::TempHandler04[id=104].invoke():   Setting self managed data using key [104]
MessageContextSelfManagedDataTest::saveAndRestore::[TempHandler04[id=104].invoke()]   
MessageContextSelfManagedDataTest::saveAndRestore::[TempHandler04[id=104].invoke()]   temp file = [TempHandler04_22913.tmp]
MessageContextSelfManagedDataTest::saveAndRestore::[TempHandler04[id=104].invoke()]   saving message context ....
MessageContextSelfManagedDataTest::TempHandler03[id=103].serializeSelfManagedData()   count [2]
MessageContextSelfManagedDataTest::TempHandler03[id=103].serializeSelfManagedData()   count [2]: saved self managed data byte [] length [25]
MessageContextSelfManagedDataTest::TempHandler03[id=103].serializeSelfManagedData()   count [2]: saved self managed data byte array output stream length [25]
MessageContextSelfManagedDataTest::TempHandler04[id=104].serializeSelfManagedData()   count [2]
MessageContextSelfManagedDataTest::TempHandler04[id=104].serializeSelfManagedData()   count [2]: saved self managed data byte [] length [4]
MessageContextSelfManagedDataTest::TempHandler04[id=104].serializeSelfManagedData()   count [2]: saved self managed data byte array output stream length [42]
MessageContextSelfManagedDataTest::saveAndRestore::[TempHandler04[id=104].invoke()]   ....saved message context .....
MessageContextSelfManagedDataTest::saveAndRestore::[TempHandler04[id=104].invoke()]   restoring message context .....
MessageContextSelfManagedDataTest::TempHandler03[id=103].deserializeSelfManagedData()   count [2]
MessageContextSelfManagedDataTest::TempHandler04[id=104].deserializeSelfManagedData()   count [1]
MessageContextSelfManagedDataTest::saveAndRestore::[TempHandler04[id=104].invoke()]   ....restored message context .....
MessageContextSelfManagedDataTest::TempHandler04[id=104].invoke(): Completed
[surefire] Tests run: 10, Failures: 0, Errors: 0, Time elapsed: 0.794 sec
[surefire] Running org.apache.axis2.engine.SOAPActionBasedDispatcherTest
[surefire] Tests run: 4, Failures: 0, Errors: 0, Time elapsed: 0.006 sec
[surefire] Running org.apache.axis2.engine.ModuleEngageTest
[surefire] Tests run: 1, Failures: 0, Errors: 0, Time elapsed: 0.023 sec
[surefire] Running org.apache.axis2.engine.ParameterAddTest
[surefire] Tests run: 4, Failures: 0, Errors: 0, Time elapsed: 0.004 sec
[surefire] Running org.apache.axis2.engine.MessageContextSaveATest
MessageContextSaveATest:testReceive(): start - - engine.receive(mc) - - - - - - - - - - - - - - - -
TempHandler[1]:invoke(): pause = [false]
TempHandler[1]:invoke(): executedHandlers.add(1)
TempHandler[2]:invoke(): pause = [false]
TempHandler[2]:invoke(): executedHandlers.add(2)
TempHandler[3]:invoke(): pause = [false]
TempHandler[3]:invoke(): executedHandlers.add(3)
TempHandler[4]:invoke(): pause = [false]
TempHandler[4]:invoke(): executedHandlers.add(4)
TempHandler[5]:invoke(): pause = [false]
TempHandler[5]:invoke(): executedHandlers.add(5)
TempHandler[6]:invoke(): pause = [false]
TempHandler[6]:invoke(): executedHandlers.add(6)
TempHandler[7]:invoke(): pause = [false]
TempHandler[7]:invoke(): executedHandlers.add(7)
TempHandler[8]:invoke(): pause = [false]
TempHandler[8]:invoke(): executedHandlers.add(8)
TempHandler[9]:invoke(): pause = [false]
TempHandler[9]:invoke(): executedHandlers.add(9)
TempHandler[10]:invoke(): pause = [false]
TempHandler[10]:invoke(): executedHandlers.add(10)
TempHandler[11]:invoke(): pause = [false]
TempHandler[11]:invoke(): executedHandlers.add(11)
TempHandler[12]:invoke(): pause = [false]
TempHandler[12]:invoke(): executedHandlers.add(12)
TempHandler[13]:invoke(): pause = [false]
TempHandler[13]:invoke(): executedHandlers.add(13)
TempHandler[14]:invoke(): pause = [false]
TempHandler[14]:invoke(): executedHandlers.add(14)
TempHandler[15]:invoke(): pause = [true]
TempHandler[15]:invoke(): msgContext.pause()
TempHandler[15]:invoke(): temp file = [mcSave22914.tmp]
TempHandler[15]:invoke(): saving message context.....
TempHandler[15]:invoke(): ....saved message context.....
TempHandler[15]:invoke(): file size after save [22453]   temp file = [mcSave22914.tmp]
TempHandler[15]:invoke(): restoring a message context.....
TempHandler[15]:invoke(): ....restored message context.....
TempHandler[15]:invoke(): execution chain equivalency [true]
MessageContextSaveATest::compareHandlers:  class [org.apache.axis2.engine.MessageContextSaveATest$TempHandler] match 
MessageContextSaveATest::compareHandlers:  id [10] match
MessageContextSaveATest::compareHandlers:  class [org.apache.axis2.engine.MessageContextSaveATest$TempHandler] match 
MessageContextSaveATest::compareHandlers:  id [11] match
MessageContextSaveATest::compareHandlers:  class [org.apache.axis2.engine.MessageContextSaveATest$TempHandler] match 
MessageContextSaveATest::compareHandlers:  id [12] match
MessageContextSaveATest::compareHandlers:  class [org.apache.axis2.engine.MessageContextSaveATest$TempHandler] match 
MessageContextSaveATest::compareHandlers:  id [13] match
MessageContextSaveATest::compareHandlers:  class [org.apache.axis2.engine.MessageContextSaveATest$TempHandler] match 
MessageContextSaveATest::compareHandlers:  id [14] match
MessageContextSaveATest::compareHandlers:  class [org.apache.axis2.engine.MessageContextSaveATest$TempHandler] match 
MessageContextSaveATest::compareHandlers:  id [15] match
MessageContextSaveATest::compareHandlers:  class [org.apache.axis2.engine.MessageContextSaveATest$TempHandler] match 
MessageContextSaveATest::compareHandlers:  id [16] match
MessageContextSaveATest::compareHandlers:  class [org.apache.axis2.engine.MessageContextSaveATest$TempHandler] match 
MessageContextSaveATest::compareHandlers:  id [17] match
MessageContextSaveATest::compareHandlers:  class [org.apache.axis2.engine.MessageContextSaveATest$TempHandler] match 
MessageContextSaveATest::compareHandlers:  id [18] match
MessageContextSaveATest: comparePhases:  Phase1[middlePhase2] == Phase2[middlePhase2] - matched handler lists
TempHandler[15]:invoke(): executed phase list:  compare phases [true]
MessageContextSaveATest::compareHandlers:  class [org.apache.axis2.engine.MessageContextSaveATest$TempHandler] match 
MessageContextSaveATest::compareHandlers:  id [1] match
MessageContextSaveATest::compareHandlers:  class [org.apache.axis2.engine.MessageContextSaveATest$TempHandler] match 
MessageContextSaveATest::compareHandlers:  id [2] match
MessageContextSaveATest::compareHandlers:  class [org.apache.axis2.engine.MessageContextSaveATest$TempHandler] match 
MessageContextSaveATest::compareHandlers:  id [3] match
MessageContextSaveATest::compareHandlers:  class [org.apache.axis2.engine.MessageContextSaveATest$TempHandler] match 
MessageContextSaveATest::compareHandlers:  id [4] match
MessageContextSaveATest::compareHandlers:  class [org.apache.axis2.engine.MessageContextSaveATest$TempHandler] match 
MessageContextSaveATest::compareHandlers:  id [5] match
MessageContextSaveATest::compareHandlers:  class [org.apache.axis2.engine.MessageContextSaveATest$TempHandler] match 
MessageContextSaveATest::compareHandlers:  id [6] match
MessageContextSaveATest::compareHandlers:  class [org.apache.axis2.engine.MessageContextSaveATest$TempHandler] match 
MessageContextSaveATest::compareHandlers:  id [7] match
MessageContextSaveATest::compareHandlers:  class [org.apache.axis2.engine.MessageContextSaveATest$TempHandler] match 
MessageContextSaveATest::compareHandlers:  id [8] match
MessageContextSaveATest::compareHandlers:  class [org.apache.axis2.engine.MessageContextSaveATest$TempHandler] match 
MessageContextSaveATest::compareHandlers:  id [9] match
MessageContextSaveATest: comparePhases:  Phase1[beginPhase1] == Phase2[beginPhase1] - matched handler lists
TempHandler[15]:invoke(): executed phase list:  compare phases [true]
MessageContextSaveATest:testReceive(): resume - - engine.resume(mc) - - - - - - - - - - - - - - - -
TempHandler[15]:invoke(): pause = [false]
TempHandler[15]:invoke(): executedHandlers.add(15)
TempHandler[16]:invoke(): pause = [false]
TempHandler[16]:invoke(): executedHandlers.add(16)
TempHandler[17]:invoke(): pause = [false]
TempHandler[17]:invoke(): executedHandlers.add(17)
TempHandler[18]:invoke(): pause = [false]
TempHandler[18]:invoke(): executedHandlers.add(18)
TempHandler[19]:invoke(): pause = [false]
TempHandler[19]:invoke(): executedHandlers.add(19)
TempHandler[20]:invoke(): pause = [false]
TempHandler[20]:invoke(): executedHandlers.add(20)
TempHandler[21]:invoke(): pause = [false]
TempHandler[21]:invoke(): executedHandlers.add(21)
TempHandler[22]:invoke(): pause = [false]
TempHandler[22]:invoke(): executedHandlers.add(22)
TempHandler[23]:invoke(): pause = [false]
TempHandler[23]:invoke(): executedHandlers.add(23)
TempHandler[24]:invoke(): pause = [false]
TempHandler[24]:invoke(): executedHandlers.add(24)
TempHandler[25]:invoke(): pause = [false]
TempHandler[25]:invoke(): executedHandlers.add(25)
TempHandler[26]:invoke(): pause = [false]
TempHandler[26]:invoke(): executedHandlers.add(26)
TempHandler[27]:invoke(): pause = [false]
TempHandler[27]:invoke(): executedHandlers.add(27)
TempHandler[28]:invoke(): pause = [false]
TempHandler[28]:invoke(): executedHandlers.add(28)
TempHandler[29]:invoke(): pause = [false]
TempHandler[29]:invoke(): executedHandlers.add(29)
TempHandler[30]:invoke(): pause = [false]
TempHandler[30]:invoke(): executedHandlers.add(30)
TempHandler[31]:invoke(): pause = [true]
TempHandler[31]:invoke(): msgContext.pause()
TempHandler[31]:invoke(): temp file = [mcSave22915.tmp]
TempHandler[31]:invoke(): saving message context.....
TempHandler[31]:invoke(): ....saved message context.....
TempHandler[31]:invoke(): file size after save [26603]   temp file = [mcSave22915.tmp]
TempHandler[31]:invoke(): restoring a message context.....
TempHandler[31]:invoke(): ....restored message context.....
TempHandler[31]:invoke(): execution chain equivalency [true]
MessageContextSaveATest::compareHandlers:  class [org.apache.axis2.engine.MessageContextSaveATest$TempHandler] match 
MessageContextSaveATest::compareHandlers:  id [31] match
MessageContextSaveATest::compareHandlers:  class [org.apache.axis2.engine.MessageContextSaveATest$TempHandler] match 
MessageContextSaveATest::compareHandlers:  id [32] match
MessageContextSaveATest: comparePhases:  Phase1[extraPhase3] == Phase2[extraPhase3] - matched handler lists
TempHandler[31]:invoke(): executed phase list:  compare phases [true]
MessageContextSaveATest::compareHandlers:  class [org.apache.axis2.engine.MessageContextSaveATest$TempHandler] match 
MessageContextSaveATest::compareHandlers:  id [30] match
MessageContextSaveATest: comparePhases:  Phase1[extraPhase2] == Phase2[extraPhase2] - matched handler lists
TempHandler[31]:invoke(): executed phase list:  compare phases [true]
MessageContextSaveATest::compareHandlers:  class [org.apache.axis2.engine.MessageContextSaveATest$TempHandler] match 
MessageContextSaveATest::compareHandlers:  id [28] match
MessageContextSaveATest::compareHandlers:  class [org.apache.axis2.engine.MessageContextSaveATest$TempHandler] match 
MessageContextSaveATest::compareHandlers:  id [29] match
MessageContextSaveATest: comparePhases:  Phase1[extraPhase1] == Phase2[extraPhase1] - matched handler lists
TempHandler[31]:invoke(): executed phase list:  compare phases [true]
MessageContextSaveATest::compareHandlers:  class [org.apache.axis2.engine.MessageContextSaveATest$TempHandler] match 
MessageContextSaveATest::compareHandlers:  id [19] match
MessageContextSaveATest::compareHandlers:  class [org.apache.axis2.engine.MessageContextSaveATest$TempHandler] match 
MessageContextSaveATest::compareHandlers:  id [20] match
MessageContextSaveATest::compareHandlers:  class [org.apache.axis2.engine.MessageContextSaveATest$TempHandler] match 
MessageContextSaveATest::compareHandlers:  id [21] match
MessageContextSaveATest::compareHandlers:  class [org.apache.axis2.engine.MessageContextSaveATest$TempHandler] match 
MessageContextSaveATest::compareHandlers:  id [22] match
MessageContextSaveATest::compareHandlers:  class [org.apache.axis2.engine.MessageContextSaveATest$TempHandler] match 
MessageContextSaveATest::compareHandlers:  id [23] match
MessageContextSaveATest::compareHandlers:  class [org.apache.axis2.engine.MessageContextSaveATest$TempHandler] match 
MessageContextSaveATest::compareHandlers:  id [24] match
MessageContextSaveATest::compareHandlers:  class [org.apache.axis2.engine.MessageContextSaveATest$TempHandler] match 
MessageContextSaveATest::compareHandlers:  id [25] match
MessageContextSaveATest::compareHandlers:  class [org.apache.axis2.engine.MessageContextSaveATest$TempHandler] match 
MessageContextSaveATest::compareHandlers:  id [26] match
MessageContextSaveATest::compareHandlers:  class [org.apache.axis2.engine.MessageContextSaveATest$TempHandler] match 
MessageContextSaveATest::compareHandlers:  id [27] match
MessageContextSaveATest: comparePhases:  Phase1[lastPhase3] == Phase2[lastPhase3] - matched handler lists
TempHandler[31]:invoke(): executed phase list:  compare phases [true]
MessageContextSaveATest::compareHandlers:  class [org.apache.axis2.engine.MessageContextSaveATest$TempHandler] match 
MessageContextSaveATest::compareHandlers:  id [10] match
MessageContextSaveATest::compareHandlers:  class [org.apache.axis2.engine.MessageContextSaveATest$TempHandler] match 
MessageContextSaveATest::compareHandlers:  id [11] match
MessageContextSaveATest::compareHandlers:  class [org.apache.axis2.engine.MessageContextSaveATest$TempHandler] match 
MessageContextSaveATest::compareHandlers:  id [12] match
MessageContextSaveATest::compareHandlers:  class [org.apache.axis2.engine.MessageContextSaveATest$TempHandler] match 
MessageContextSaveATest::compareHandlers:  id [13] match
MessageContextSaveATest::compareHandlers:  class [org.apache.axis2.engine.MessageContextSaveATest$TempHandler] match 
MessageContextSaveATest::compareHandlers:  id [14] match
MessageContextSaveATest::compareHandlers:  class [org.apache.axis2.engine.MessageContextSaveATest$TempHandler] match 
MessageContextSaveATest::compareHandlers:  id [15] match
MessageContextSaveATest::compareHandlers:  class [org.apache.axis2.engine.MessageContextSaveATest$TempHandler] match 
MessageContextSaveATest::compareHandlers:  id [16] match
MessageContextSaveATest::compareHandlers:  class [org.apache.axis2.engine.MessageContextSaveATest$TempHandler] match 
MessageContextSaveATest::compareHandlers:  id [17] match
MessageContextSaveATest::compareHandlers:  class [org.apache.axis2.engine.MessageContextSaveATest$TempHandler] match 
MessageContextSaveATest::compareHandlers:  id [18] match
MessageContextSaveATest: comparePhases:  Phase1[middlePhase2] == Phase2[middlePhase2] - matched handler lists
TempHandler[31]:invoke(): executed phase list:  compare phases [true]
MessageContextSaveATest::compareHandlers:  class [org.apache.axis2.engine.MessageContextSaveATest$TempHandler] match 
MessageContextSaveATest::compareHandlers:  id [1] match
MessageContextSaveATest::compareHandlers:  class [org.apache.axis2.engine.MessageContextSaveATest$TempHandler] match 
MessageContextSaveATest::compareHandlers:  id [2] match
MessageContextSaveATest::compareHandlers:  class [org.apache.axis2.engine.MessageContextSaveATest$TempHandler] match 
MessageContextSaveATest::compareHandlers:  id [3] match
MessageContextSaveATest::compareHandlers:  class [org.apache.axis2.engine.MessageContextSaveATest$TempHandler] match 
MessageContextSaveATest::compareHandlers:  id [4] match
MessageContextSaveATest::compareHandlers:  class [org.apache.axis2.engine.MessageContextSaveATest$TempHandler] match 
MessageContextSaveATest::compareHandlers:  id [5] match
MessageContextSaveATest::compareHandlers:  class [org.apache.axis2.engine.MessageContextSaveATest$TempHandler] match 
MessageContextSaveATest::compareHandlers:  id [6] match
MessageContextSaveATest::compareHandlers:  class [org.apache.axis2.engine.MessageContextSaveATest$TempHandler] match 
MessageContextSaveATest::compareHandlers:  id [7] match
MessageContextSaveATest::compareHandlers:  class [org.apache.axis2.engine.MessageContextSaveATest$TempHandler] match 
MessageContextSaveATest::compareHandlers:  id [8] match
MessageContextSaveATest::compareHandlers:  class [org.apache.axis2.engine.MessageContextSaveATest$TempHandler] match 
MessageContextSaveATest::compareHandlers:  id [9] match
MessageContextSaveATest: comparePhases:  Phase1[beginPhase1] == Phase2[beginPhase1] - matched handler lists
TempHandler[31]:invoke(): executed phase list:  compare phases [true]
MessageContextSaveATest::compareHandlers:  class [org.apache.axis2.engine.MessageContextSaveATest$TempHandler] match 
MessageContextSaveATest::compareHandlers:  id [1] match
MessageContextSaveATest::compareHandlers:  class [org.apache.axis2.engine.MessageContextSaveATest$TempHandler] match 
MessageContextSaveATest::compareHandlers:  id [2] match
MessageContextSaveATest::compareHandlers:  class [org.apache.axis2.engine.MessageContextSaveATest$TempHandler] match 
MessageContextSaveATest::compareHandlers:  id [3] match
MessageContextSaveATest::compareHandlers:  class [org.apache.axis2.engine.MessageContextSaveATest$TempHandler] match 
MessageContextSaveATest::compareHandlers:  id [4] match
MessageContextSaveATest::compareHandlers:  class [org.apache.axis2.engine.MessageContextSaveATest$TempHandler] match 
MessageContextSaveATest::compareHandlers:  id [5] match
MessageContextSaveATest::compareHandlers:  class [org.apache.axis2.engine.MessageContextSaveATest$TempHandler] match 
MessageContextSaveATest::compareHandlers:  id [6] match
MessageContextSaveATest::compareHandlers:  class [org.apache.axis2.engine.MessageContextSaveATest$TempHandler] match 
MessageContextSaveATest::compareHandlers:  id [7] match
MessageContextSaveATest::compareHandlers:  class [org.apache.axis2.engine.MessageContextSaveATest$TempHandler] match 
MessageContextSaveATest::compareHandlers:  id [8] match
MessageContextSaveATest::compareHandlers:  class [org.apache.axis2.engine.MessageContextSaveATest$TempHandler] match 
MessageContextSaveATest::compareHandlers:  id [9] match
MessageContextSaveATest: comparePhases:  Phase1[beginPhase1] == Phase2[beginPhase1] - matched handler lists
MessageContextSaveATest::compareHandlers:  class [org.apache.axis2.engine.MessageContextSaveATest$TempHandler] match 
MessageContextSaveATest::compareHandlers:  id [10] match
MessageContextSaveATest::compareHandlers:  class [org.apache.axis2.engine.MessageContextSaveATest$TempHandler] match 
MessageContextSaveATest::compareHandlers:  id [11] match
MessageContextSaveATest::compareHandlers:  class [org.apache.axis2.engine.MessageContextSaveATest$TempHandler] match 
MessageContextSaveATest::compareHandlers:  id [12] match
MessageContextSaveATest::compareHandlers:  class [org.apache.axis2.engine.MessageContextSaveATest$TempHandler] match 
MessageContextSaveATest::compareHandlers:  id [13] match
MessageContextSaveATest::compareHandlers:  class [org.apache.axis2.engine.MessageContextSaveATest$TempHandler] match 
MessageContextSaveATest::compareHandlers:  id [14] match
MessageContextSaveATest::compareHandlers:  class [org.apache.axis2.engine.MessageContextSaveATest$TempHandler] match 
MessageContextSaveATest::compareHandlers:  id [15] match
MessageContextSaveATest::compareHandlers:  class [org.apache.axis2.engine.MessageContextSaveATest$TempHandler] match 
MessageContextSaveATest::compareHandlers:  id [16] match
MessageContextSaveATest::compareHandlers:  class [org.apache.axis2.engine.MessageContextSaveATest$TempHandler] match 
MessageContextSaveATest::compareHandlers:  id [17] match
MessageContextSaveATest::compareHandlers:  class [org.apache.axis2.engine.MessageContextSaveATest$TempHandler] match 
MessageContextSaveATest::compareHandlers:  id [18] match
MessageContextSaveATest: comparePhases:  Phase1[middlePhase2] == Phase2[middlePhase2] - matched handler lists
MessageContextSaveATest::compareHandlers:  class [org.apache.axis2.engine.MessageContextSaveATest$TempHandler] match 
MessageContextSaveATest::compareHandlers:  id [19] match
MessageContextSaveATest::compareHandlers:  class [org.apache.axis2.engine.MessageContextSaveATest$TempHandler] match 
MessageContextSaveATest::compareHandlers:  id [20] match
MessageContextSaveATest::compareHandlers:  class [org.apache.axis2.engine.MessageContextSaveATest$TempHandler] match 
MessageContextSaveATest::compareHandlers:  id [21] match
MessageContextSaveATest::compareHandlers:  class [org.apache.axis2.engine.MessageContextSaveATest$TempHandler] match 
MessageContextSaveATest::compareHandlers:  id [22] match
MessageContextSaveATest::compareHandlers:  class [org.apache.axis2.engine.MessageContextSaveATest$TempHandler] match 
MessageContextSaveATest::compareHandlers:  id [23] match
MessageContextSaveATest::compareHandlers:  class [org.apache.axis2.engine.MessageContextSaveATest$TempHandler] match 
MessageContextSaveATest::compareHandlers:  id [24] match
MessageContextSaveATest::compareHandlers:  class [org.apache.axis2.engine.MessageContextSaveATest$TempHandler] match 
MessageContextSaveATest::compareHandlers:  id [25] match
MessageContextSaveATest::compareHandlers:  class [org.apache.axis2.engine.MessageContextSaveATest$TempHandler] match 
MessageContextSaveATest::compareHandlers:  id [26] match
MessageContextSaveATest::compareHandlers:  class [org.apache.axis2.engine.MessageContextSaveATest$TempHandler] match 
MessageContextSaveATest::compareHandlers:  id [27] match
MessageContextSaveATest: comparePhases:  Phase1[lastPhase3] == Phase2[lastPhase3] - matched handler lists
MessageContextSaveATest::compareHandlers:  class [org.apache.axis2.engine.MessageContextSaveATest$TempHandler] match 
MessageContextSaveATest::compareHandlers:  id [28] match
MessageContextSaveATest::compareHandlers:  class [org.apache.axis2.engine.MessageContextSaveATest$TempHandler] match 
MessageContextSaveATest::compareHandlers:  id [29] match
MessageContextSaveATest: comparePhases:  Phase1[extraPhase1] == Phase2[extraPhase1] - matched handler lists
MessageContextSaveATest::compareHandlers:  class [org.apache.axis2.engine.MessageContextSaveATest$TempHandler] match 
MessageContextSaveATest::compareHandlers:  id [30] match
MessageContextSaveATest: comparePhases:  Phase1[extraPhase2] == Phase2[extraPhase2] - matched handler lists
MessageContextSaveATest::compareHandlers:  class [org.apache.axis2.engine.MessageContextSaveATest$TempHandler] match 
MessageContextSaveATest::compareHandlers:  id [31] match
MessageContextSaveATest::compareHandlers:  class [org.apache.axis2.engine.MessageContextSaveATest$TempHandler] match 
MessageContextSaveATest::compareHandlers:  id [32] match
MessageContextSaveATest: comparePhases:  Phase1[extraPhase3] == Phase2[extraPhase3] - matched handler lists
MessageContextSaveATest::compareHandlers:  class [org.apache.axis2.engine.MessageContextSaveATest$TempHandler] match 
MessageContextSaveATest::compareHandlers:  id [33] match
MessageContextSaveATest::compareHandlers:  class [org.apache.axis2.engine.MessageContextSaveATest$TempHandler] match 
MessageContextSaveATest::compareHandlers:  id [34] match
MessageContextSaveATest::compareHandlers:  class [org.apache.axis2.engine.MessageContextSaveATest$TempHandler] match 
MessageContextSaveATest::compareHandlers:  id [35] match
MessageContextSaveATest: comparePhases:  Phase1[extraPhase4] == Phase2[extraPhase4] - matched handler lists
MessageContextSaveATest:testReceive(): resume - - engine.resume(mc) - - - - - - - - - - - - - - - -
TempHandler[31]:invoke(): pause = [false]
TempHandler[31]:invoke(): executedHandlers.add(31)
TempHandler[32]:invoke(): pause = [false]
TempHandler[32]:invoke(): executedHandlers.add(32)
TempHandler[33]:invoke(): pause = [false]
TempHandler[33]:invoke(): executedHandlers.add(33)
TempHandler[34]:invoke(): pause = [false]
TempHandler[34]:invoke(): executedHandlers.add(34)
TempHandler[35]:invoke(): pause = [false]
TempHandler[35]:invoke(): executedHandlers.add(35)
MessageContextSaveATest::compareHandlers:  class [org.apache.axis2.engine.MessageContextSaveATest$TempHandler] match 
MessageContextSaveATest::compareHandlers:  id [1] match
MessageContextSaveATest::compareHandlers:  class [org.apache.axis2.engine.MessageContextSaveATest$TempHandler] match 
MessageContextSaveATest::compareHandlers:  id [2] match
MessageContextSaveATest::compareHandlers:  class [org.apache.axis2.engine.MessageContextSaveATest$TempHandler] match 
MessageContextSaveATest::compareHandlers:  id [3] match
MessageContextSaveATest::compareHandlers:  class [org.apache.axis2.engine.MessageContextSaveATest$TempHandler] match 
MessageContextSaveATest::compareHandlers:  id [4] match
MessageContextSaveATest::compareHandlers:  class [org.apache.axis2.engine.MessageContextSaveATest$TempHandler] match 
MessageContextSaveATest::compareHandlers:  id [5] match
MessageContextSaveATest::compareHandlers:  class [org.apache.axis2.engine.MessageContextSaveATest$TempHandler] match 
MessageContextSaveATest::compareHandlers:  id [6] match
MessageContextSaveATest::compareHandlers:  class [org.apache.axis2.engine.MessageContextSaveATest$TempHandler] match 
MessageContextSaveATest::compareHandlers:  id [7] match
MessageContextSaveATest::compareHandlers:  class [org.apache.axis2.engine.MessageContextSaveATest$TempHandler] match 
MessageContextSaveATest::compareHandlers:  id [8] match
MessageContextSaveATest::compareHandlers:  class [org.apache.axis2.engine.MessageContextSaveATest$TempHandler] match 
MessageContextSaveATest::compareHandlers:  id [9] match
MessageContextSaveATest: comparePhases:  Phase1[beginPhase1] == Phase2[beginPhase1] - matched handler lists
MessageContextSaveATest::compareHandlers:  class [org.apache.axis2.engine.MessageContextSaveATest$TempHandler] match 
MessageContextSaveATest::compareHandlers:  id [10] match
MessageContextSaveATest::compareHandlers:  class [org.apache.axis2.engine.MessageContextSaveATest$TempHandler] match 
MessageContextSaveATest::compareHandlers:  id [11] match
MessageContextSaveATest::compareHandlers:  class [org.apache.axis2.engine.MessageContextSaveATest$TempHandler] match 
MessageContextSaveATest::compareHandlers:  id [12] match
MessageContextSaveATest::compareHandlers:  class [org.apache.axis2.engine.MessageContextSaveATest$TempHandler] match 
MessageContextSaveATest::compareHandlers:  id [13] match
MessageContextSaveATest::compareHandlers:  class [org.apache.axis2.engine.MessageContextSaveATest$TempHandler] match 
MessageContextSaveATest::compareHandlers:  id [14] match
MessageContextSaveATest::compareHandlers:  class [org.apache.axis2.engine.MessageContextSaveATest$TempHandler] match 
MessageContextSaveATest::compareHandlers:  id [15] match
MessageContextSaveATest::compareHandlers:  class [org.apache.axis2.engine.MessageContextSaveATest$TempHandler] match 
MessageContextSaveATest::compareHandlers:  id [16] match
MessageContextSaveATest::compareHandlers:  class [org.apache.axis2.engine.MessageContextSaveATest$TempHandler] match 
MessageContextSaveATest::compareHandlers:  id [17] match
MessageContextSaveATest::compareHandlers:  class [org.apache.axis2.engine.MessageContextSaveATest$TempHandler] match 
MessageContextSaveATest::compareHandlers:  id [18] match
MessageContextSaveATest: comparePhases:  Phase1[middlePhase2] == Phase2[middlePhase2] - matched handler lists
MessageContextSaveATest::compareHandlers:  class [org.apache.axis2.engine.MessageContextSaveATest$TempHandler] match 
MessageContextSaveATest::compareHandlers:  id [19] match
MessageContextSaveATest::compareHandlers:  class [org.apache.axis2.engine.MessageContextSaveATest$TempHandler] match 
MessageContextSaveATest::compareHandlers:  id [20] match
MessageContextSaveATest::compareHandlers:  class [org.apache.axis2.engine.MessageContextSaveATest$TempHandler] match 
MessageContextSaveATest::compareHandlers:  id [21] match
MessageContextSaveATest::compareHandlers:  class [org.apache.axis2.engine.MessageContextSaveATest$TempHandler] match 
MessageContextSaveATest::compareHandlers:  id [22] match
MessageContextSaveATest::compareHandlers:  class [org.apache.axis2.engine.MessageContextSaveATest$TempHandler] match 
MessageContextSaveATest::compareHandlers:  id [23] match
MessageContextSaveATest::compareHandlers:  class [org.apache.axis2.engine.MessageContextSaveATest$TempHandler] match 
MessageContextSaveATest::compareHandlers:  id [24] match
MessageContextSaveATest::compareHandlers:  class [org.apache.axis2.engine.MessageContextSaveATest$TempHandler] match 
MessageContextSaveATest::compareHandlers:  id [25] match
MessageContextSaveATest::compareHandlers:  class [org.apache.axis2.engine.MessageContextSaveATest$TempHandler] match 
MessageContextSaveATest::compareHandlers:  id [26] match
MessageContextSaveATest::compareHandlers:  class [org.apache.axis2.engine.MessageContextSaveATest$TempHandler] match 
MessageContextSaveATest::compareHandlers:  id [27] match
MessageContextSaveATest: comparePhases:  Phase1[lastPhase3] == Phase2[lastPhase3] - matched handler lists
MessageContextSaveATest::compareHandlers:  class [org.apache.axis2.engine.MessageContextSaveATest$TempHandler] match 
MessageContextSaveATest::compareHandlers:  id [28] match
MessageContextSaveATest::compareHandlers:  class [org.apache.axis2.engine.MessageContextSaveATest$TempHandler] match 
MessageContextSaveATest::compareHandlers:  id [29] match
MessageContextSaveATest: comparePhases:  Phase1[extraPhase1] == Phase2[extraPhase1] - matched handler lists
MessageContextSaveATest::compareHandlers:  class [org.apache.axis2.engine.MessageContextSaveATest$TempHandler] match 
MessageContextSaveATest::compareHandlers:  id [30] match
MessageContextSaveATest: comparePhases:  Phase1[extraPhase2] == Phase2[extraPhase2] - matched handler lists
MessageContextSaveATest::compareHandlers:  class [org.apache.axis2.engine.MessageContextSaveATest$TempHandler] match 
MessageContextSaveATest::compareHandlers:  id [31] match
MessageContextSaveATest::compareHandlers:  class [org.apache.axis2.engine.MessageContextSaveATest$TempHandler] match 
MessageContextSaveATest::compareHandlers:  id [32] match
MessageContextSaveATest: comparePhases:  Phase1[extraPhase3] == Phase2[extraPhase3] - matched handler lists
MessageContextSaveATest::compareHandlers:  class [org.apache.axis2.engine.MessageContextSaveATest$TempHandler] match 
MessageContextSaveATest::compareHandlers:  id [33] match
MessageContextSaveATest::compareHandlers:  class [org.apache.axis2.engine.MessageContextSaveATest$TempHandler] match 
MessageContextSaveATest::compareHandlers:  id [34] match
MessageContextSaveATest::compareHandlers:  class [org.apache.axis2.engine.MessageContextSaveATest$TempHandler] match 
MessageContextSaveATest::compareHandlers:  id [35] match
MessageContextSaveATest: comparePhases:  Phase1[extraPhase4] == Phase2[extraPhase4] - matched handler lists
MessageContextSaveATest:testSimpleMC(): start - - - - - - - - - - - - - - - -
MessageContextSaveATest:testSimpleMC(): temp file = [Simple22916.tmp]
MessageContextSaveATest:testSimpleMC(): saving message context.....
MessageContextSaveATest:testSimpleMC(): ....saved message context.....
MessageContextSaveATest:testSimpleMC(): file size after save [3298]   temp file = [Simple22916.tmp]
MessageContextSaveATest:testSimpleMC(): restoring a message context.....
MessageContextSaveATest:testSimpleMC(): ....restored message context.....
MessageContextSaveATest:testSimpleMC(): execution chain equivalency [true]
MessageContextSaveATest:testSimpleMC(): end - - - - - - - - - - - - - - - -
MessageContextSaveATest:testMcProperties(): start - - - - - - - - - - - - - - - -
MessageContextSaveATest:testMcProperties(): temp file = [McProps22917.tmp]
MessageContextSaveATest:testMcProperties(): saving message context.....
MessageContextSaveATest:testMcProperties(): ....saved message context.....
MessageContextSaveATest:testMcProperties(): file size after save [3547]   temp file = [McProps22917.tmp]
MessageContextSaveATest:testMcProperties(): restoring a message context.....
MessageContextSaveATest:testMcProperties(): ....restored message context.....
MessageContextSaveATest:testMcProperties(): execution chain equivalency [true]
MessageContextSaveATest:testMcProperties(): end - - - - - - - - - - - - - - - -
MessageContextSaveATest:testMapping(): start - - - - - - - - - - - - - - - -
MessageContextSaveATest:testMapping(): - - - - - original message contexts table- - - - - - - - - - -
MessageContextSaveATest: showMcMap:  Message context   ID[urn:uuid:2842E4A067ECD0FD771173111713980]   Key Label [In]
MessageContextSaveATest:testMapping(): temp file = [McMappings22918.tmp]
MessageContextSaveATest:testMapping(): saving message context.....
MessageContextSaveATest:testMapping(): ....saved message context.....
MessageContextSaveATest:testMapping(): file size after save [8506]   temp file = [McMappings22918.tmp]
MessageContextSaveATest:testMapping(): restoring a message context.....
MessageContextSaveATest:testMapping(): ....restored message context.....
MessageContextSaveATest:testMapping(): - - - - - restored message contexts table- - - - - - - - - - -
MessageContextSaveATest: showMcMap:  Message context   ID[urn:uuid:2842E4A067ECD0FD771173111713980]   Key Label [In]
MessageContextSaveATest:testMapping(): end - - - - - - - - - - - - - - - -
[surefire] Tests run: 4, Failures: 0, Errors: 0, Time elapsed: 0.149 sec
[surefire] Running org.apache.axis2.engine.OperationContextSaveTest
OperationContextSaveTest:testSaveAndRestore():  BEGIN ---------------
OperationContextSaveTest:testSaveAndRestore(): temp file = [OpCtxSave22919.tmp]
OperationContextSaveTest:testSaveAndRestore(): saving .....
OperationContextSaveTest:testSaveAndRestore(): ....save operation completed.....
OperationContextSaveTest:testSaveAndRestore(): file size after save [6965]   temp file = [OpCtxSave22919.tmp]
OperationContextSaveTest:testSaveAndRestore(): restoring .....
OperationContextSaveTest:testSaveAndRestore(): ....restored operation completed.....
OperationContextSaveTest:testSaveAndRestore():  OperationContext equivalency [true]
OperationContextSaveTest:testSaveAndRestore():  ServiceContext equivalency [true]
OperationContextSaveTest:testSaveAndRestore():  ServiceGroupContext equivalency [true]
OperationContextSaveTest:testSaveAndRestore():  END ---------------
[surefire] Tests run: 1, Failures: 0, Errors: 0, Time elapsed: 0.019 sec
[surefire] Running org.apache.axis2.engine.ModuleConfigTest
[surefire] Tests run: 2, Failures: 0, Errors: 0, Time elapsed: 0.018 sec
[surefire] Running org.apache.axis2.engine.ObjectSaveTest
ObjectSaveTest:testObjectSerializable():  BEGIN ---------------
ObjectSaveTest:testObjectSerializable(): temp file = [objectTest22920.tmp]
ObjectSaveTest:testObjectSerializable(): saving .....
ObjectSaveTest:testObjectSerializable(): ....save operation completed.....
ObjectSaveTest:testObjectSerializable(): file size after save [265]   temp file = [objectTest22920.tmp]
ObjectSaveTest:testObjectSerializable(): restoring .....
ObjectSaveTest:testObjectSerializable(): ....restored operation completed.....
ObjectSaveTest:testObjectSerializable():  END ---------------
ObjectSaveTest:testObjectNotSerializable():  BEGIN ---------------
ObjectSaveTest:testObjectNotSerializable(): temp file = [objectTest22921.tmp]
ObjectSaveTest:testObjectNotSerializable(): saving .....
ObjectSaveTest:testObjectSerializable(): restoring .....
ObjectSaveTest:testObjectNotSerializable(): ....restored operation completed.....
ObjectSaveTest:testObjectNotSerializable():  END ---------------
ObjectSaveTest:testArrayList():  BEGIN ---------------
ObjectSaveTest:testArrayList(): temp file = [arraylistTest22922.tmp]
ObjectSaveTest:testArrayList(): saving .....
ObjectSaveTest:testArrayList(): ....save operation completed.....
ObjectSaveTest:testArrayList(): file size after save [199]   temp file = [arraylistTest22922.tmp]
ObjectSaveTest:testArrayList(): restoring .....
ObjectSaveTest:testArrayList(): ....restored operation completed.....
ObjectSaveTest:testArrayList():  END ---------------
ObjectSaveTest:testHashMap():  BEGIN ---------------
ObjectSaveTest:testHashMap(): temp file = [hashmapTest22923.tmp]
ObjectSaveTest:testHashMap(): saving .....
ObjectSaveTest:testHashMap(): ....save operation completed.....
ObjectSaveTest:testHashMap(): file size after save [253]   temp file = [hashmapTest22923.tmp]
ObjectSaveTest:testHashMap(): restoring .....
ObjectSaveTest:testHashMap(): ....restored operation completed.....
ObjectSaveTest:testHashMap():  END ---------------
ObjectSaveTest:testLinkedList():  BEGIN ---------------
ObjectSaveTest:testLinkedList(): temp file = [linkedlistTest22924.tmp]
ObjectSaveTest:testLinkedList(): saving .....
ObjectSaveTest:testLinkedList(): ....save operation completed.....
ObjectSaveTest:testLinkedList(): file size after save [200]   temp file = [linkedlistTest22924.tmp]
ObjectSaveTest:testLinkedList(): restoring .....
ObjectSaveTest:testLinkedList(): ....restored operation completed.....
ObjectSaveTest:testLinkedList():  END ---------------
[surefire] Tests run: 5, Failures: 0, Errors: 0, Time elapsed: 0.017 sec
[surefire] Running org.apache.axis2.engine.MessageContextChangeTest
[surefire] Tests run: 1, Failures: 0, Errors: 0, Time elapsed: 0.137 sec
[surefire] Running org.apache.axis2.engine.MessageContextSaveBTest
original properties ======================================
original properties: key-value pair [serviceKey2][serviceValue2_before]
original properties: key-value pair [serviceKey3][serviceValue3_before]
original properties: key-value pair [serviceKey1][serviceValue1_before]
original properties ======================================
MessageContextSaveBTest: testServiceProperties(): start - - engine.receive(mc) - - - - - - - - - - - - - - - -
TempHandler[1]:invoke(): executedHandlers.add(1)
HandlerMCS[2]:invoke(): pause = [true]
HandlerMCS[2]:invoke(): msgContext.pause()
HandlerMCS[2]:invoke(): temp file = [mcSave22925.tmp]
HandlerMCS[2]:invoke(): saving message context.....
HandlerMCS[2]:invoke(): ....saved message context.....
HandlerMCS[2]:invoke(): file size after save [11197]   temp file = [mcSave22925.tmp]
HandlerMCS[2]:invoke(): restoring a message context.....
HandlerMCS[2]:invoke(): ....restored message context.....
restored properties ======================================
restored properties: key-value pair [serviceKey2][serviceValue2_before]
restored properties: key-value pair [Property.ID[1].2][ServiceLevelSetting[2]]
restored properties: key-value pair [serviceKey3][serviceValue3_before]
restored properties: key-value pair [serviceKey1][serviceValue1_before]
restored properties: key-value pair [Property.ID[1].1][ServiceLevelSetting[1]]
restored properties ======================================
MessageContextSaveBTest: testServiceProperties(): resume - - engine.resume(mc) - - - - - - - - - - - - - - - -
HandlerMCS[2]:invoke(): pause = [false]
HandlerMCS[2]:invoke(): executedHandlers.add(2)
TempHandler[3]:invoke(): executedHandlers.add(3)
restored service properties post-resume ======================================
restored service properties post-resume: key-value pair [serviceKey2][serviceValue2_postReceive]
restored service properties post-resume: key-value pair [Property.ID[1].2][ServiceLevelSetting[2]]
restored service properties post-resume: key-value pair [Property.ID[3].2][ServiceLevelSetting[2]]
restored service properties post-resume: key-value pair [serviceKey3][serviceValue3_postReceive]
restored service properties post-resume: key-value pair [Property.ID[3].1][ServiceLevelSetting[1]]
restored service properties post-resume: key-value pair [serviceKey1][serviceValue1_postReceive]
restored service properties post-resume: key-value pair [Property.ID[1].1][ServiceLevelSetting[1]]
restored service properties post-resume ======================================
service properties from other active MsgCtx ======================================
service properties from other active MsgCtx: key-value pair [serviceKey2][serviceValue2_postReceive]
service properties from other active MsgCtx: key-value pair [Property.ID[1].2][ServiceLevelSetting[2]]
service properties from other active MsgCtx: key-value pair [Property.ID[3].2][ServiceLevelSetting[2]]
service properties from other active MsgCtx: key-value pair [Property.ID[3].1][ServiceLevelSetting[1]]
service properties from other active MsgCtx: key-value pair [serviceKey3][serviceValue3_postReceive]
service properties from other active MsgCtx: key-value pair [Property.ID[1].1][ServiceLevelSetting[1]]
service properties from other active MsgCtx: key-value pair [serviceKey1][serviceValue1_postReceive]
service properties from other active MsgCtx ======================================
[surefire] Tests run: 1, Failures: 0, Errors: 0, Time elapsed: 0.02 sec
[surefire] Running org.apache.axis2.dispatchers.RequestURIBasedServiceDispatcherTest
[surefire] Tests run: 1, Failures: 0, Errors: 0, Time elapsed: 0.005 sec
[surefire] Running org.apache.axis2.dispatchers.SOAPMessageBodyBasedOperationDispatcherTest
[surefire] Tests run: 1, Failures: 0, Errors: 0, Time elapsed: 0.005 sec
[surefire] Running org.apache.axis2.dispatchers.RelatesToBasedServiceDispatcherTest
[surefire] Tests run: 1, Failures: 0, Errors: 0, Time elapsed: 0.005 sec
[surefire] Running org.apache.axis2.dispatchers.RequestURIBasedOperationDispatcherTest
[surefire] Tests run: 1, Failures: 0, Errors: 0, Time elapsed: 0.004 sec
[surefire] Running org.apache.axis2.dispatchers.RelatesToBasedOperationDispatcherTest
[surefire] Tests run: 1, Failures: 0, Errors: 0, Time elapsed: 0.042 sec
[surefire] Running org.apache.axis2.dispatchers.SOAPMessageBodyBasedServiceDispatcherTest
[surefire] Tests run: 1, Failures: 0, Errors: 0, Time elapsed: 0.004 sec
[surefire] Running org.apache.axis2.dispatchers.ActionBasedOperationDispatchTest
[surefire] Tests run: 1, Failures: 0, Errors: 0, Time elapsed: 0.004 sec
[surefire] Running org.apache.axis2.context.OperationContextTest
[surefire] Tests run: 1, Failures: 0, Errors: 0, Time elapsed: 0.002 sec
[surefire] Running org.apache.axis2.context.ContextHierarchyTest
[surefire] Tests run: 2, Failures: 0, Errors: 0, Time elapsed: 0.003 sec
[surefire] Running org.apache.axis2.description.WSDLToAllServicesBuilderTest
[SimpleHTTPServer] Stop called
[SimpleHTTPServer] Stop called
[surefire] Tests run: 2, Failures: 0, Errors: 0, Time elapsed: 3.254 sec
[surefire] Running org.apache.axis2.description.RegistryTest
[surefire] Tests run: 5, Failures: 0, Errors: 0, Time elapsed: 0.004 sec
[surefire] Running org.apache.axis2.util.ThreadContextMigratorTest
[surefire] Tests run: 2, Failures: 0, Errors: 0, Time elapsed: 0.007 sec
[surefire] Running org.apache.axis2.addressing.EndpointReferenceHelperTest
[surefire] Tests run: 2, Failures: 0, Errors: 0, Time elapsed: 0.009 sec
[surefire] Running org.apache.axis2.addressing.miheaders.RelatesToTest
[surefire] Tests run: 3, Failures: 0, Errors: 0, Time elapsed: 0.375 sec
[surefire] Running org.apache.axis2.addressing.wsdl.WSDL11ActionHelperTest
[surefire] Tests run: 8, Failures: 0, Errors: 0, Time elapsed: 0.57 sec
[surefire] Running org.apache.axis2.addressing.EndpointReferenceTypeTest
[surefire] Tests run: 5, Failures: 0, Errors: 0, Time elapsed: 0.008 sec
[surefire] Running org.apache.axis2.addressing.AddressingHelperTest
[surefire] Tests run: 6, Failures: 0, Errors: 0, Time elapsed: 0.005 sec
[surefire] Running org.apache.axis2.transport.tcp.TCPTransportTest
[surefire] Tests run: 1, Failures: 0, Errors: 0, Time elapsed: 0.002 sec
[surefire] Running org.apache.axis2.misc.MiscTest
[surefire] Tests run: 1, Failures: 0, Errors: 0, Time elapsed: 0.002 sec
[INFO] [jar:jar]
[INFO] Building jar: /export/home/illsleyd/continuum/continuum-1.0.3/apps/continuum/working-directory/61/modules/kernel/target/axis2-kernel-SNAPSHOT.jar
[INFO] [install:install]
[INFO] Installing /export/home/illsleyd/continuum/continuum-1.0.3/apps/continuum/working-directory/61/modules/kernel/target/axis2-kernel-SNAPSHOT.jar to /export/home/illsleyd/.m2/repository/org/apache/axis2/axis2-kernel/SNAPSHOT/axis2-kernel-SNAPSHOT.jar
[INFO] ----------------------------------------------------------------------------
[INFO] Building Apache Axis 2.0 - Data Binding
[INFO]    task-segment: [clean, install]
[INFO] ----------------------------------------------------------------------------
[INFO] [clean:clean]
[INFO] Deleting directory /export/home/illsleyd/continuum/continuum-1.0.3/apps/continuum/working-directory/61/modules/adb/target
[INFO] Deleting directory /export/home/illsleyd/continuum/continuum-1.0.3/apps/continuum/working-directory/61/modules/adb/target/classes
[INFO] Deleting directory /export/home/illsleyd/continuum/continuum-1.0.3/apps/continuum/working-directory/61/modules/adb/target/test-classes
[INFO] [resources:resources]
[INFO] Using default encoding to copy filtered resources.
[INFO] [compiler:compile]
[INFO] Compiling 66 source files to /export/home/illsleyd/continuum/continuum-1.0.3/apps/continuum/working-directory/61/modules/adb/target/classes
[INFO] [resources:testResources]
[INFO] Using default encoding to copy filtered resources.
[INFO] [compiler:testCompile]
[INFO] Compiling 9 source files to /export/home/illsleyd/continuum/continuum-1.0.3/apps/continuum/working-directory/61/modules/adb/target/test-classes
[INFO] ------------------------------------------------------------------------
[ERROR] BUILD FAILURE
[INFO] ------------------------------------------------------------------------
[INFO] Compilation failure

/export/home/illsleyd/continuum/continuum-1.0.3/apps/continuum/working-directory/61/modules/adb/test/org/apache/axis2/databinding/utils/NamedStaxOMBuilderTest.java:[9,24] package javax.xml.stream does not exist

/export/home/illsleyd/continuum/continuum-1.0.3/apps/continuum/working-directory/61/modules/adb/test/org/apache/axis2/databinding/utils/NamedStaxOMBuilderTest.java:[10,24] package javax.xml.stream does not exist

/export/home/illsleyd/continuum/continuum-1.0.3/apps/continuum/working-directory/61/modules/adb/test/org/apache/axis2/databinding/ADBSOAPModelBuilderTest.java:[181,15] cannot find symbol
symbol  : class XMLStreamReader
location: class org.apache.axis2.databinding.ADBSOAPModelBuilderTest.DummyADBBean

/export/home/illsleyd/continuum/continuum-1.0.3/apps/continuum/working-directory/61/modules/adb/test/org/apache/axis2/databinding/utils/SimpleElementReaderStateMachineTest.java:[7,24] package javax.xml.stream does not exist

/export/home/illsleyd/continuum/continuum-1.0.3/apps/continuum/working-directory/61/modules/adb/test/org/apache/axis2/databinding/utils/reader/ADBXMLStreamReaderTest.java:[9,24] package javax.activation does not exist

/export/home/illsleyd/continuum/continuum-1.0.3/apps/continuum/working-directory/61/modules/adb/test/org/apache/axis2/databinding/utils/reader/ADBXMLStreamReaderTest.java:[16,24] package javax.xml.stream does not exist

/export/home/illsleyd/continuum/continuum-1.0.3/apps/continuum/working-directory/61/modules/adb/test/org/apache/axis2/databinding/utils/reader/ADBXMLStreamReaderTest.java:[311,44] cannot find symbol
symbol  : class XMLStreamException
location: class org.apache.axis2.databinding.utils.reader.ADBXMLStreamReaderTest

/export/home/illsleyd/continuum/continuum-1.0.3/apps/continuum/working-directory/61/modules/adb/test/org/apache/axis2/databinding/utils/reader/ADBXMLStreamReaderTest.java:[590,40] cannot find symbol
symbol  : class XMLStreamException
location: class org.apache.axis2.databinding.utils.reader.ADBXMLStreamReaderTest

/export/home/illsleyd/continuum/continuum-1.0.3/apps/continuum/working-directory/61/modules/adb/test/org/apache/axis2/databinding/utils/reader/ADBXMLStreamReaderTest.java:[806,32] cannot find symbol
symbol  : class XMLStreamReader
location: class org.apache.axis2.databinding.utils.reader.ADBXMLStreamReaderTest

/export/home/illsleyd/continuum/continuum-1.0.3/apps/continuum/working-directory/61/modules/adb/test/org/apache/axis2/databinding/utils/reader/ADBXMLStreamReaderTest.java:[806,63] cannot find symbol
symbol  : class XMLStreamException
location: class org.apache.axis2.databinding.utils.reader.ADBXMLStreamReaderTest

/export/home/illsleyd/continuum/continuum-1.0.3/apps/continuum/working-directory/61/modules/adb/test/org/apache/axis2/databinding/utils/reader/ADBXMLStreamReaderTest.java:[306,15] cannot find symbol
symbol  : class XMLStreamReader
location: class org.apache.axis2.databinding.utils.reader.ADBXMLStreamReaderTest.DummyADBBean

/export/home/illsleyd/continuum/continuum-1.0.3/apps/continuum/working-directory/61/modules/adb/test/org/apache/axis2/databinding/utils/SimpleArrayReaderStateMachineTest.java:[7,24] package javax.xml.stream does not exist

/export/home/illsleyd/continuum/continuum-1.0.3/apps/continuum/working-directory/61/modules/adb/test/org/apache/axis2/databinding/utils/PrintEvents.java:[25,29] cannot find symbol
symbol  : class XMLStreamReader
location: class org.apache.axis2.databinding.utils.PrintEvents

/export/home/illsleyd/continuum/continuum-1.0.3/apps/continuum/working-directory/61/modules/adb/test/org/apache/axis2/databinding/utils/PrintEvents.java:[25,58] cannot find symbol
symbol  : class XMLStreamException
location: class org.apache.axis2.databinding.utils.PrintEvents

/export/home/illsleyd/continuum/continuum-1.0.3/apps/continuum/working-directory/61/modules/adb/test/org/apache/axis2/databinding/utils/PrintEvents.java:[32,35] cannot find symbol
symbol  : class XMLStreamReader
location: class org.apache.axis2.databinding.utils.PrintEvents

/export/home/illsleyd/continuum/continuum-1.0.3/apps/continuum/working-directory/61/modules/adb/test/org/apache/axis2/databinding/utils/PrintEvents.java:[109,34] cannot find symbol
symbol  : class XMLStreamReader
location: class org.apache.axis2.databinding.utils.PrintEvents

/export/home/illsleyd/continuum/continuum-1.0.3/apps/continuum/working-directory/61/modules/adb/test/org/apache/axis2/databinding/utils/PrintEvents.java:[126,40] cannot find symbol
symbol  : class XMLStreamReader
location: class org.apache.axis2.databinding.utils.PrintEvents

/export/home/illsleyd/continuum/continuum-1.0.3/apps/continuum/working-directory/61/modules/adb/test/org/apache/axis2/databinding/utils/PrintEvents.java:[132,39] cannot find symbol
symbol  : class XMLStreamReader
location: class org.apache.axis2.databinding.utils.PrintEvents

/export/home/illsleyd/continuum/continuum-1.0.3/apps/continuum/working-directory/61/modules/adb/test/org/apache/axis2/databinding/utils/PrintEvents.java:[142,40] cannot find symbol
symbol  : class XMLStreamReader
location: class org.apache.axis2.databinding.utils.PrintEvents

/export/home/illsleyd/continuum/continuum-1.0.3/apps/continuum/working-directory/61/modules/adb/test/org/apache/axis2/databinding/utils/PrintEvents.java:[148,39] cannot find symbol
symbol  : class XMLStreamReader
location: class org.apache.axis2.databinding.utils.PrintEvents

/export/home/illsleyd/continuum/continuum-1.0.3/apps/continuum/working-directory/61/modules/adb/test/org/apache/axis2/databinding/utils/NamedStaxOMBuilderTest.java:[33,8] cannot find symbol
symbol  : class XMLStreamReader
location: class org.apache.axis2.databinding.utils.NamedStaxOMBuilderTest

/export/home/illsleyd/continuum/continuum-1.0.3/apps/continuum/working-directory/61/modules/adb/test/org/apache/axis2/databinding/utils/NamedStaxOMBuilderTest.java:[50,8] cannot find symbol
symbol  : class XMLStreamReader
location: class org.apache.axis2.databinding.utils.NamedStaxOMBuilderTest

/export/home/illsleyd/continuum/continuum-1.0.3/apps/continuum/working-directory/61/modules/adb/test/org/apache/axis2/databinding/utils/NamedStaxOMBuilderTest.java:[68,33] cannot find symbol
symbol  : constructor NamedStaxOMBuilder(org.apache.axis2.util.StreamWrapper,javax.xml.namespace.QName)
location: class org.apache.axis2.databinding.utils.NamedStaxOMBuilder

/export/home/illsleyd/continuum/continuum-1.0.3/apps/continuum/working-directory/61/modules/adb/test/org/apache/axis2/databinding/ADBSOAPModelBuilderTest.java:[70,8] cannot find symbol
symbol  : class XMLStreamReader
location: class org.apache.axis2.databinding.ADBSOAPModelBuilderTest

/export/home/illsleyd/continuum/continuum-1.0.3/apps/continuum/working-directory/61/modules/adb/test/org/apache/axis2/databinding/ADBSOAPModelBuilderTest.java:[82,8] cannot find symbol
symbol  : class XMLStreamReader
location: class org.apache.axis2.databinding.ADBSOAPModelBuilderTest

/export/home/illsleyd/continuum/continuum-1.0.3/apps/continuum/working-directory/61/modules/adb/test/org/apache/axis2/databinding/ADBSOAPModelBuilderTest.java:[88,8] cannot find symbol
symbol  : class XMLStreamReader
location: class org.apache.axis2.databinding.ADBSOAPModelBuilderTest

/export/home/illsleyd/continuum/continuum-1.0.3/apps/continuum/working-directory/61/modules/adb/test/org/apache/axis2/databinding/ADBSOAPModelBuilderTest.java:[155,8] cannot find symbol
symbol  : class XMLStreamReader
location: class org.apache.axis2.databinding.ADBSOAPModelBuilderTest

/export/home/illsleyd/continuum/continuum-1.0.3/apps/continuum/working-directory/61/modules/adb/test/org/apache/axis2/databinding/CreateAccountRequest.java:[102,16] cannot access javax.activation.DataHandler
file javax/activation/DataHandler.class not found
                .convertToString(localPassword));

/export/home/illsleyd/continuum/continuum-1.0.3/apps/continuum/working-directory/61/modules/adb/test/org/apache/axis2/databinding/utils/SimpleElementReaderStateMachineTest.java:[32,8] cannot find symbol
symbol  : class XMLStreamReader
location: class org.apache.axis2.databinding.utils.SimpleElementReaderStateMachineTest

/export/home/illsleyd/continuum/continuum-1.0.3/apps/continuum/working-directory/61/modules/adb/test/org/apache/axis2/databinding/utils/SimpleElementReaderStateMachineTest.java:[38,17] cannot find symbol
symbol  : class XMLStreamException
location: class org.apache.axis2.databinding.utils.SimpleElementReaderStateMachineTest

/export/home/illsleyd/continuum/continuum-1.0.3/apps/continuum/working-directory/61/modules/adb/test/org/apache/axis2/databinding/utils/SimpleElementReaderStateMachineTest.java:[47,8] cannot find symbol
symbol  : class XMLStreamReader
location: class org.apache.axis2.databinding.utils.SimpleElementReaderStateMachineTest

/export/home/illsleyd/continuum/continuum-1.0.3/apps/continuum/working-directory/61/modules/adb/test/org/apache/axis2/databinding/utils/SimpleElementReaderStateMachineTest.java:[53,17] cannot find symbol
symbol  : class XMLStreamException
location: class org.apache.axis2.databinding.utils.SimpleElementReaderStateMachineTest

/export/home/illsleyd/continuum/continuum-1.0.3/apps/continuum/working-directory/61/modules/adb/test/org/apache/axis2/databinding/utils/SimpleElementReaderStateMachineTest.java:[62,8] cannot find symbol
symbol  : class XMLStreamReader
location: class org.apache.axis2.databinding.utils.SimpleElementReaderStateMachineTest

/export/home/illsleyd/continuum/continuum-1.0.3/apps/continuum/working-directory/61/modules/adb/test/org/apache/axis2/databinding/utils/reader/ADBXMLStreamReaderTest.java:[114,12] cannot find symbol
symbol  : class XMLStreamReader
location: class org.apache.axis2.databinding.utils.reader.ADBXMLStreamReaderTest

/export/home/illsleyd/continuum/continuum-1.0.3/apps/continuum/working-directory/61/modules/adb/test/org/apache/axis2/databinding/utils/reader/ADBXMLStreamReaderTest.java:[174,12] cannot find symbol
symbol  : class XMLStreamReader
location: class org.apache.axis2.databinding.utils.reader.ADBXMLStreamReaderTest

/export/home/illsleyd/continuum/continuum-1.0.3/apps/continuum/working-directory/61/modules/adb/test/org/apache/axis2/databinding/utils/reader/ADBXMLStreamReaderTest.java:[218,12] cannot find symbol
symbol  : class XMLStreamReader
location: class org.apache.axis2.databinding.utils.reader.ADBXMLStreamReaderTest

/export/home/illsleyd/continuum/continuum-1.0.3/apps/continuum/working-directory/61/modules/adb/test/org/apache/axis2/databinding/utils/reader/ADBXMLStreamReaderTest.java:[270,12] cannot find symbol
symbol  : class XMLStreamReader
location: class org.apache.axis2.databinding.utils.reader.ADBXMLStreamReaderTest

/export/home/illsleyd/continuum/continuum-1.0.3/apps/continuum/working-directory/61/modules/adb/test/org/apache/axis2/databinding/utils/reader/ADBXMLStreamReaderTest.java:[281,17] cannot find symbol
symbol  : class XMLStreamException
location: class org.apache.axis2.databinding.utils.reader.ADBXMLStreamReaderTest

/export/home/illsleyd/continuum/continuum-1.0.3/apps/continuum/working-directory/61/modules/adb/test/org/apache/axis2/databinding/utils/reader/ADBXMLStreamReaderTest.java:[342,8] cannot find symbol
symbol  : class XMLStreamReader
location: class org.apache.axis2.databinding.utils.reader.ADBXMLStreamReaderTest

/export/home/illsleyd/continuum/continuum-1.0.3/apps/continuum/working-directory/61/modules/adb/test/org/apache/axis2/databinding/utils/reader/ADBXMLStreamReaderTest.java:[378,12] cannot find symbol
symbol  : class XMLStreamReader
location: class org.apache.axis2.databinding.utils.reader.ADBXMLStreamReaderTest

/export/home/illsleyd/continuum/continuum-1.0.3/apps/continuum/working-directory/61/modules/adb/test/org/apache/axis2/databinding/utils/reader/ADBXMLStreamReaderTest.java:[389,18] cannot find symbol
symbol  : class XMLStreamException
location: class org.apache.axis2.databinding.utils.reader.ADBXMLStreamReaderTest

/export/home/illsleyd/continuum/continuum-1.0.3/apps/continuum/working-directory/61/modules/adb/test/org/apache/axis2/databinding/utils/reader/ADBXMLStreamReaderTest.java:[416,12] cannot find symbol
symbol  : class XMLStreamReader
location: class org.apache.axis2.databinding.utils.reader.ADBXMLStreamReaderTest

/export/home/illsleyd/continuum/continuum-1.0.3/apps/continuum/working-directory/61/modules/adb/test/org/apache/axis2/databinding/utils/reader/ADBXMLStreamReaderTest.java:[430,16] cannot find symbol
symbol  : class XMLStreamException
location: class org.apache.axis2.databinding.utils.reader.ADBXMLStreamReaderTest

/export/home/illsleyd/continuum/continuum-1.0.3/apps/continuum/working-directory/61/modules/adb/test/org/apache/axis2/databinding/utils/reader/ADBXMLStreamReaderTest.java:[460,12] cannot find symbol
symbol  : class XMLStreamReader
location: class org.apache.axis2.databinding.utils.reader.ADBXMLStreamReaderTest

/export/home/illsleyd/continuum/continuum-1.0.3/apps/continuum/working-directory/61/modules/adb/test/org/apache/axis2/databinding/utils/reader/ADBXMLStreamReaderTest.java:[474,16] cannot find symbol
symbol  : class XMLStreamException
location: class org.apache.axis2.databinding.utils.reader.ADBXMLStreamReaderTest

/export/home/illsleyd/continuum/continuum-1.0.3/apps/continuum/working-directory/61/modules/adb/test/org/apache/axis2/databinding/utils/reader/ADBXMLStreamReaderTest.java:[518,12] cannot find symbol
symbol  : class XMLStreamReader
location: class org.apache.axis2.databinding.utils.reader.ADBXMLStreamReaderTest

/export/home/illsleyd/continuum/continuum-1.0.3/apps/continuum/working-directory/61/modules/adb/test/org/apache/axis2/databinding/utils/reader/ADBXMLStreamReaderTest.java:[565,12] cannot find symbol
symbol  : class XMLStreamReader
location: class org.apache.axis2.databinding.utils.reader.ADBXMLStreamReaderTest

/export/home/illsleyd/continuum/continuum-1.0.3/apps/continuum/working-directory/61/modules/adb/test/org/apache/axis2/databinding/utils/reader/ADBXMLStreamReaderTest.java:[579,16] cannot find symbol
symbol  : class XMLStreamException
location: class org.apache.axis2.databinding.utils.reader.ADBXMLStreamReaderTest

/export/home/illsleyd/continuum/continuum-1.0.3/apps/continuum/working-directory/61/modules/adb/test/org/apache/axis2/databinding/utils/reader/ADBXMLStreamReaderTest.java:[640,12] cannot find symbol
symbol  : class XMLStreamReader
location: class org.apache.axis2.databinding.utils.reader.ADBXMLStreamReaderTest

/export/home/illsleyd/continuum/continuum-1.0.3/apps/continuum/working-directory/61/modules/adb/test/org/apache/axis2/databinding/utils/reader/ADBXMLStreamReaderTest.java:[717,12] cannot find symbol
symbol  : class XMLStreamReader
location: class org.apache.axis2.databinding.utils.reader.ADBXMLStreamReaderTest

/export/home/illsleyd/continuum/continuum-1.0.3/apps/continuum/working-directory/61/modules/adb/test/org/apache/axis2/databinding/utils/reader/ADBXMLStreamReaderTest.java:[749,31] cannot find symbol
symbol  : class DataHandler
location: class org.apache.axis2.databinding.utils.reader.ADBXMLStreamReaderTest

/export/home/illsleyd/continuum/continuum-1.0.3/apps/continuum/working-directory/61/modules/adb/test/org/apache/axis2/databinding/utils/reader/ADBXMLStreamReaderTest.java:[751,11] cannot find symbol
symbol  : class XMLStreamReader
location: class org.apache.axis2.databinding.utils.reader.ADBXMLStreamReaderTest

/export/home/illsleyd/continuum/continuum-1.0.3/apps/continuum/working-directory/61/modules/adb/test/org/apache/axis2/databinding/utils/reader/ADBXMLStreamReaderTest.java:[783,12] cannot find symbol
symbol  : class XMLStreamReader
location: class org.apache.axis2.databinding.utils.reader.ADBXMLStreamReaderTest

/export/home/illsleyd/continuum/continuum-1.0.3/apps/continuum/working-directory/61/modules/adb/test/org/apache/axis2/databinding/utils/reader/ADBXMLStreamReaderTest.java:[816,8] cannot find symbol
symbol  : class XMLStreamWriter
location: class org.apache.axis2.databinding.utils.reader.ADBXMLStreamReaderTest

/export/home/illsleyd/continuum/continuum-1.0.3/apps/continuum/working-directory/61/modules/adb/test/org/apache/axis2/databinding/utils/SimpleArrayReaderStateMachineTest.java:[34,8] cannot find symbol
symbol  : class XMLStreamReader
location: class org.apache.axis2.databinding.utils.SimpleArrayReaderStateMachineTest

/export/home/illsleyd/continuum/continuum-1.0.3/apps/continuum/working-directory/61/modules/adb/test/org/apache/axis2/databinding/utils/SimpleArrayReaderStateMachineTest.java:[40,17] cannot find symbol
symbol  : class XMLStreamException
location: class org.apache.axis2.databinding.utils.SimpleArrayReaderStateMachineTest

/export/home/illsleyd/continuum/continuum-1.0.3/apps/continuum/working-directory/61/modules/adb/test/org/apache/axis2/databinding/utils/SimpleArrayReaderStateMachineTest.java:[51,8] cannot find symbol
symbol  : class XMLStreamReader
location: class org.apache.axis2.databinding.utils.SimpleArrayReaderStateMachineTest

/export/home/illsleyd/continuum/continuum-1.0.3/apps/continuum/working-directory/61/modules/adb/test/org/apache/axis2/databinding/utils/SimpleArrayReaderStateMachineTest.java:[56,24] cannot find symbol
symbol  : variable XMLStreamConstants
location: class org.apache.axis2.databinding.utils.SimpleArrayReaderStateMachineTest

/export/home/illsleyd/continuum/continuum-1.0.3/apps/continuum/working-directory/61/modules/adb/test/org/apache/axis2/databinding/utils/SimpleArrayReaderStateMachineTest.java:[66,17] cannot find symbol
symbol  : class XMLStreamException
location: class org.apache.axis2.databinding.utils.SimpleArrayReaderStateMachineTest

/export/home/illsleyd/continuum/continuum-1.0.3/apps/continuum/working-directory/61/modules/adb/test/org/apache/axis2/databinding/utils/SimpleArrayReaderStateMachineTest.java:[76,8] cannot find symbol
symbol  : class XMLStreamReader
location: class org.apache.axis2.databinding.utils.SimpleArrayReaderStateMachineTest

/export/home/illsleyd/continuum/continuum-1.0.3/apps/continuum/working-directory/61/modules/adb/test/org/apache/axis2/databinding/utils/SimpleArrayReaderStateMachineTest.java:[82,17] cannot find symbol
symbol  : class XMLStreamException
location: class org.apache.axis2.databinding.utils.SimpleArrayReaderStateMachineTest

/export/home/illsleyd/continuum/continuum-1.0.3/apps/continuum/working-directory/61/modules/adb/test/org/apache/axis2/databinding/utils/SimpleArrayReaderStateMachineTest.java:[91,8] cannot find symbol
symbol  : class XMLStreamReader
location: class org.apache.axis2.databinding.utils.SimpleArrayReaderStateMachineTest

/export/home/illsleyd/continuum/continuum-1.0.3/apps/continuum/working-directory/61/modules/adb/test/org/apache/axis2/databinding/utils/PrintEvents.java:[40,17] cannot find symbol
symbol  : variable XMLStreamConstants
location: class org.apache.axis2.databinding.utils.PrintEvents

/export/home/illsleyd/continuum/continuum-1.0.3/apps/continuum/working-directory/61/modules/adb/test/org/apache/axis2/databinding/utils/PrintEvents.java:[48,17] cannot find symbol
symbol  : variable XMLStreamConstants
location: class org.apache.axis2.databinding.utils.PrintEvents

/export/home/illsleyd/continuum/continuum-1.0.3/apps/continuum/working-directory/61/modules/adb/test/org/apache/axis2/databinding/utils/PrintEvents.java:[54,17] cannot find symbol
symbol  : variable XMLStreamConstants
location: class org.apache.axis2.databinding.utils.PrintEvents

/export/home/illsleyd/continuum/continuum-1.0.3/apps/continuum/working-directory/61/modules/adb/test/org/apache/axis2/databinding/utils/PrintEvents.java:[56,17] cannot find symbol
symbol  : variable XMLStreamConstants
location: class org.apache.axis2.databinding.utils.PrintEvents

/export/home/illsleyd/continuum/continuum-1.0.3/apps/continuum/working-directory/61/modules/adb/test/org/apache/axis2/databinding/utils/PrintEvents.java:[64,17] cannot find symbol
symbol  : variable XMLStreamConstants
location: class org.apache.axis2.databinding.utils.PrintEvents

/export/home/illsleyd/continuum/continuum-1.0.3/apps/continuum/working-directory/61/modules/adb/test/org/apache/axis2/databinding/utils/PrintEvents.java:[71,17] cannot find symbol
symbol  : variable XMLStreamConstants
location: class org.apache.axis2.databinding.utils.PrintEvents

/export/home/illsleyd/continuum/continuum-1.0.3/apps/continuum/working-directory/61/modules/adb/test/org/apache/axis2/databinding/utils/PrintEvents.java:[81,17] cannot find symbol
symbol  : variable XMLStreamConstants
location: class org.apache.axis2.databinding.utils.PrintEvents

/export/home/illsleyd/continuum/continuum-1.0.3/apps/continuum/working-directory/61/modules/adb/test/org/apache/axis2/databinding/utils/PrintEvents.java:[88,17] cannot find symbol
symbol  : variable XMLStreamConstants
location: class org.apache.axis2.databinding.utils.PrintEvents

/export/home/illsleyd/continuum/continuum-1.0.3/apps/continuum/working-directory/61/modules/adb/test/org/apache/axis2/databinding/utils/PrintEvents.java:[94,17] cannot find symbol
symbol  : variable XMLStreamConstants
location: class org.apache.axis2.databinding.utils.PrintEvents


[INFO] ------------------------------------------------------------------------
[INFO] For more information, run Maven with the -e switch
[INFO] ------------------------------------------------------------------------
[INFO] Total time: 1 minute 39 seconds
[INFO] Finished at: Mon Mar 05 16:22:15 GMT+00:00 2007
[INFO] Final Memory: 31M/307M
[INFO] ------------------------------------------------------------------------

****************************************************************************



---------------------------------------------------------------------
To unsubscribe, e-mail: axis-cvs-unsubscribe@ws.apache.org
For additional commands, e-mail: axis-cvs-help@ws.apache.org


Mime
View raw message