axis-java-dev mailing list archives

Site index · List index
Message view « Date » · « Thread »
Top « Date » · « Thread »
From "davidillsley (Continuum)" <davidills...@apache.org>
Subject [Apache Axis 2.0 - Root][continuum] BUILD FAILURE
Date Tue, 27 Mar 2007 16:06:08 GMT
Online report : http://ws.zones.apache.org:10000/continuum/servlet/continuum/target/ProjectBuild.vm/view/ProjectBuild/id/61/buildId/1612
Build statistics:
  State: Failed
  Previous State: Failed
  Started at: Tue, 27 Mar 2007 16:01:27 +0000
  Finished at: Tue, 27 Mar 2007 16:06:08 +0000
  Total time: 4m 40s
  Build Trigger: Schedule
  Exit code: 1
  Building machine hostname: ws.zones.apache.org
  Operating system : SunOS(unknown)
  Java version : 1.5.0_09(Sun Microsystems Inc.)

Changes
         amilas          put attribute type support only to simple restriction

             /webservices/axis2/trunk/java/modules/adb-codegen/src/org/apache/axis2/schema/SchemaCompiler.java
            /webservices/axis2/trunk/java/modules/adb-codegen/src/org/apache/axis2/schema/template/ADBBeanTemplate.xsl
        
****************************************************************************
Output:
****************************************************************************
Snipped Output:
tool/axis2-wsdl2code-maven-plugin/target/axis2-wsdl2code-maven-plugin-SNAPSHOT.jar to /export/home/illsleyd/.m2/repository/org/apache/axis2/maven2/axis2-wsdl2code-maven-plugin/SNAPSHOT/axis2-wsdl2code-maven-plugin-SNAPSHOT.jar
[INFO] [plugin:updateRegistry]
[INFO] ----------------------------------------------------------------------------
[INFO] Building Apache Axis 2.0 - tool - MAR Maven Plugin
[INFO]    task-segment: [clean, install]
[INFO] ----------------------------------------------------------------------------
[INFO] [clean:clean]
[INFO] Deleting directory /export/home/illsleyd/continuum/continuum-1.0.3/apps/continuum/working-directory/61/modules/tool/axis2-mar-maven-plugin/target
[INFO] Deleting directory /export/home/illsleyd/continuum/continuum-1.0.3/apps/continuum/working-directory/61/modules/tool/axis2-mar-maven-plugin/target/classes
[INFO] Deleting directory /export/home/illsleyd/continuum/continuum-1.0.3/apps/continuum/working-directory/61/modules/tool/axis2-mar-maven-plugin/target/test-classes
[INFO] [plugin:descriptor]
[INFO] Using 2 extractors.
[INFO] Applying extractor for language: java
[INFO] Extractor for language: java found 3 mojo descriptors.
[INFO] Applying extractor for language: bsh
[INFO] Extractor for language: bsh found 0 mojo descriptors.
[INFO] [resources:resources]
[INFO] Using default encoding to copy filtered resources.
[INFO] [compiler:compile]
[INFO] Compiling 5 source files to /export/home/illsleyd/continuum/continuum-1.0.3/apps/continuum/working-directory/61/modules/tool/axis2-mar-maven-plugin/target/classes
[INFO] [resources:testResources]
[INFO] Using default encoding to copy filtered resources.
[INFO] [compiler:testCompile]
[INFO] No sources to compile
[INFO] [surefire:test]
[INFO] No tests to run.
[INFO] [jar:jar]
[INFO] Building jar: /export/home/illsleyd/continuum/continuum-1.0.3/apps/continuum/working-directory/61/modules/tool/axis2-mar-maven-plugin/target/axis2-mar-maven-plugin-SNAPSHOT.jar
[INFO] [plugin:addPluginArtifactMetadata]
[INFO] [install:install]
[INFO] Installing /export/home/illsleyd/continuum/continuum-1.0.3/apps/continuum/working-directory/61/modules/tool/axis2-mar-maven-plugin/target/axis2-mar-maven-plugin-SNAPSHOT.jar
to /export/home/illsleyd/.m2/repository/org/apache/axis2/maven2/axis2-mar-maven-plugin/SNAPSHOT/axis2-mar-maven-plugin-SNAPSHOT.jar
[INFO] [plugin:updateRegistry]
[INFO] ----------------------------------------------------------------------------
[INFO] Building Apache Axis 2.0 - Addressing
[INFO]    task-segment: [clean, install]
[INFO] ----------------------------------------------------------------------------
[INFO] Reloading plugin container for: org.apache.axis2.maven2:axis2-mar-maven-plugin. The
plugin artifact has changed.
[INFO] [clean:clean]
[INFO] Deleting directory /export/home/illsleyd/continuum/continuum-1.0.3/apps/continuum/working-directory/61/modules/addressing/target
[INFO] Deleting directory /export/home/illsleyd/continuum/continuum-1.0.3/apps/continuum/working-directory/61/modules/addressing/target/classes
[INFO] Deleting directory /export/home/illsleyd/continuum/continuum-1.0.3/apps/continuum/working-directory/61/modules/addressing/target/test-classes
[INFO] [resources:resources]
[INFO] Using default encoding to copy filtered resources.
[INFO] [compiler:compile]
[INFO] Compiling 9 source files to /export/home/illsleyd/continuum/continuum-1.0.3/apps/continuum/working-directory/61/modules/addressing/target/classes
[INFO] [resources:testResources]
[INFO] Using default encoding to copy filtered resources.
[INFO] [compiler:testCompile]
[INFO] Compiling 8 source files to /export/home/illsleyd/continuum/continuum-1.0.3/apps/continuum/working-directory/61/modules/addressing/target/test-classes
[INFO] [surefire:test]
[INFO] Setting reports dir: /export/home/illsleyd/continuum/continuum-1.0.3/apps/continuum/working-directory/61/modules/addressing/target/surefire-reports

-------------------------------------------------------
 T E S T S
-------------------------------------------------------
[surefire] Running org.apache.axis2.handlers.addressing.AddressingValidationHandlerTest
log4j:WARN No appenders could be found for logger (org.apache.axiom.om.util.StAXUtils).
log4j:WARN Please initialize the log4j system properly.
[surefire] Tests run: 5, Failures: 0, Errors: 0, Time elapsed: 0.335 sec
[surefire] Running org.apache.axis2.handlers.addressing.AddressingInFaultHandlerTest
[surefire] Tests run: 4, Failures: 2, Errors: 0, Time elapsed: 0.046 sec <<<<<<<<
FAILURE !! 
[surefire] Running org.apache.axis2.handlers.addressing.AddressingOutHandlerTest
[surefire] Tests run: 6, Failures: 0, Errors: 0, Time elapsed: 0.226 sec
[surefire] Running org.apache.axis2.handlers.addressing.AddressingFinalInHandlerTest
Address: http://localhost:8081/axis/services/BankPort, Address Attributes: [org.apache.axiom.om.impl.llom.OMAttributeImpl@22c1c5,
org.apache.axiom.om.impl.llom.OMAttributeImpl@1df894d], Reference Parameters: {{http://ws.apache.org/namespaces/axis2}ParamOne=<axis2:ParamOne
xmlns:axis2="http://ws.apache.org/namespaces/axis2" xmlns:wsa="http://www.w3.org/2005/08/addressing"
wsa:IsReferenceParameter="true">123456789</axis2:ParamOne>, {http://ws.apache.org/namespaces/axis2}ParamTwo=<axis2:ParamTwo
xmlns:axis2="http://ws.apache.org/namespaces/axis2" xmlns:wsa="http://www.w3.org/2005/08/addressing"
wsa:IsReferenceParameter="true">ABCDEFG</axis2:ParamTwo>}
Address: http://localhost:8081/axis/services/BankPort, Address Attributes: [org.apache.axiom.om.impl.llom.OMAttributeImpl@1e43acf,
org.apache.axiom.om.impl.llom.OMAttributeImpl@d12c9b], Reference Parameters: {{http://ws.apache.org/namespaces/axis2}ParamOne=<axis2:ParamOne
xmlns:axis2="http://ws.apache.org/namespaces/axis2" xmlns:wsa="http://www.w3.org/2005/08/addressing"
wsa:IsReferenceParameter="true">123456789</axis2:ParamOne>, {http://ws.apache.org/namespaces/axis2}ParamTwo=<axis2:ParamTwo
xmlns:axis2="http://ws.apache.org/namespaces/axis2" xmlns:wsa="http://www.w3.org/2005/08/addressing"
wsa:IsReferenceParameter="true">ABCDEFG</axis2:ParamTwo>}
Address: http://localhost:8081/axis/services/BankPort, Address Attributes: [org.apache.axiom.om.impl.llom.OMAttributeImpl@111bfdf,
org.apache.axiom.om.impl.llom.OMAttributeImpl@4bd54e], Reference Parameters: {{http://ws.apache.org/namespaces/axis2}ParamOne=<axis2:ParamOne
xmlns:axis2="http://ws.apache.org/namespaces/axis2" xmlns:wsa="http://www.w3.org/2005/08/addressing"
wsa:IsReferenceParameter="true">123456789</axis2:ParamOne>, {http://ws.apache.org/namespaces/axis2}ParamTwo=<axis2:ParamTwo
xmlns:axis2="http://ws.apache.org/namespaces/axis2" xmlns:wsa="http://www.w3.org/2005/08/addressing"
wsa:IsReferenceParameter="true">ABCDEFG</axis2:ParamTwo>}
Address: http://localhost:8081/axis/services/BankPort, Address Attributes: [org.apache.axiom.om.impl.llom.OMAttributeImpl@cce275,
org.apache.axiom.om.impl.llom.OMAttributeImpl@1279ad1], Reference Parameters: {{http://ws.apache.org/namespaces/axis2}ParamOne=<axis2:ParamOne
xmlns:axis2="http://ws.apache.org/namespaces/axis2" xmlns:wsa="http://www.w3.org/2005/08/addressing"
wsa:IsReferenceParameter="true">123456789</axis2:ParamOne>, {http://ws.apache.org/namespaces/axis2}ParamTwo=<axis2:ParamTwo
xmlns:axis2="http://ws.apache.org/namespaces/axis2" xmlns:wsa="http://www.w3.org/2005/08/addressing"
wsa:IsReferenceParameter="true">ABCDEFG</axis2:ParamTwo>}
Address: http://localhost:8081/axis/services/BankPort, Address Attributes: [org.apache.axiom.om.impl.llom.OMAttributeImpl@1253c0a,
org.apache.axiom.om.impl.llom.OMAttributeImpl@188ea74], Reference Parameters: {{http://ws.apache.org/namespaces/axis2}ParamOne=<axis2:ParamOne
xmlns:axis2="http://ws.apache.org/namespaces/axis2" xmlns:wsa="http://www.w3.org/2005/08/addressing"
wsa:IsReferenceParameter="true">123456789</axis2:ParamOne>, {http://ws.apache.org/namespaces/axis2}ParamTwo=<axis2:ParamTwo
xmlns:axis2="http://ws.apache.org/namespaces/axis2" xmlns:wsa="http://www.w3.org/2005/08/addressing"
wsa:IsReferenceParameter="true">ABCDEFG</axis2:ParamTwo>}
[surefire] Tests run: 17, Failures: 0, Errors: 0, Time elapsed: 0.064 sec
[surefire] Running org.apache.axis2.handlers.addressing.AddressingSubmissionInHandlerTest
Address: http://localhost:8081/axis/services/BankPort, Address Attributes: [org.apache.axiom.om.impl.llom.OMAttributeImpl@11624be,
org.apache.axiom.om.impl.llom.OMAttributeImpl@c64d12]
Address: http://localhost:8081/axis/services/BankPort, Address Attributes: [org.apache.axiom.om.impl.llom.OMAttributeImpl@581b27,
org.apache.axiom.om.impl.llom.OMAttributeImpl@5ebd6b]
Address: http://localhost:8081/axis/services/BankPort, Address Attributes: [org.apache.axiom.om.impl.llom.OMAttributeImpl@e9c293,
org.apache.axiom.om.impl.llom.OMAttributeImpl@e56337]
Address: http://localhost:8081/axis/services/BankPort, Address Attributes: [org.apache.axiom.om.impl.llom.OMAttributeImpl@850919,
org.apache.axiom.om.impl.llom.OMAttributeImpl@186131]
Address: http://localhost:8081/axis/services/BankPort, Address Attributes: [org.apache.axiom.om.impl.llom.OMAttributeImpl@95106f,
org.apache.axiom.om.impl.llom.OMAttributeImpl@69e8bc]
[surefire] Tests run: 14, Failures: 0, Errors: 0, Time elapsed: 0.041 sec
[surefire] Running org.apache.axis2.addressing.AddressingFaultsTest
[surefire] Tests run: 6, Failures: 0, Errors: 0, Time elapsed: 0.004 sec
[INFO] ------------------------------------------------------------------------
[ERROR] BUILD ERROR
[INFO] ------------------------------------------------------------------------
[INFO] There are test failures.
[INFO] ------------------------------------------------------------------------
[INFO] For more information, run Maven with the -e switch
[INFO] ------------------------------------------------------------------------
[INFO] Total time: 4 minutes 36 seconds
[INFO] Finished at: Tue Mar 27 16:06:07 GMT+00:00 2007
[INFO] Final Memory: 33M/682M
[INFO] ------------------------------------------------------------------------

****************************************************************************



---------------------------------------------------------------------
To unsubscribe, e-mail: axis-cvs-unsubscribe@ws.apache.org
For additional commands, e-mail: axis-cvs-help@ws.apache.org


Mime
View raw message