axis-java-dev mailing list archives

Site index · List index
Message view « Date » · « Thread »
Top « Date » · « Thread »
From "davidillsley (Continuum)" <davidills...@apache.org>
Subject [Apache Axis 2.0 - Root][continuum] BUILD FAILURE
Date Wed, 21 Mar 2007 06:16:47 GMT
Online report : http://ws.zones.apache.org:10000/continuum/servlet/continuum/target/ProjectBuild.vm/view/ProjectBuild/id/61/buildId/1510
Build statistics:
  State: Failed
  Previous State: Ok
  Started at: Wed, 21 Mar 2007 06:14:37 +0000
  Finished at: Wed, 21 Mar 2007 06:16:46 +0000
  Total time: 2m 9s
  Build Trigger: Schedule
  Exit code: 1
  Building machine hostname: ws.zones.apache.org
  Operating system : SunOS(unknown)
  Java version : 1.5.0_09(Sun Microsystems Inc.)

Changes
         milinda          Fix for AXIS2C-551 issue.
             /webservices/axis2/trunk/java/modules/adb-codegen/src/org/apache/axis2/schema/template/CADBBeanTemplateSource.xsl
           milinda          Fix for AXIS2C-542 issue.
             /webservices/axis2/trunk/java/modules/adb-codegen/src/org/apache/axis2/schema/writer/CStructWriter.java
        
****************************************************************************
Output:
****************************************************************************
Snipped Output:
om ws-zones
[INFO] [site:attach-descriptor]
[INFO] [install:install]
[INFO] Installing /export/home/illsleyd/continuum/continuum-1.0.3/apps/continuum/working-directory/61/modules/parent/pom.xml
to /export/home/illsleyd/.m2/repository/org/apache/axis2/axis2-parent/SNAPSHOT/axis2-parent-SNAPSHOT.pom
[INFO] ----------------------------------------------------------------------------
[INFO] Building Apache Axis 2.0 - tool - AAR Maven Plugin
[INFO]    task-segment: [clean, install]
[INFO] ----------------------------------------------------------------------------
[INFO] [clean:clean]
[INFO] Deleting directory /export/home/illsleyd/continuum/continuum-1.0.3/apps/continuum/working-directory/61/modules/tool/axis2-aar-maven-plugin/target
[INFO] Deleting directory /export/home/illsleyd/continuum/continuum-1.0.3/apps/continuum/working-directory/61/modules/tool/axis2-aar-maven-plugin/target/classes
[INFO] Deleting directory /export/home/illsleyd/continuum/continuum-1.0.3/apps/continuum/working-directory/61/modules/tool/axis2-aar-maven-plugin/target/test-classes
[INFO] artifact org.apache.maven.plugins:maven-plugin-plugin: checking for updates from apache-m2
[INFO] artifact org.apache.maven.plugins:maven-plugin-plugin: checking for updates from ws-zones
[INFO] artifact org.apache.maven.plugins:maven-resources-plugin: checking for updates from
apache-m2
[INFO] artifact org.apache.maven.plugins:maven-resources-plugin: checking for updates from
ws-zones
[INFO] artifact org.apache.maven.plugins:maven-jar-plugin: checking for updates from apache-m2
[INFO] artifact org.apache.maven.plugins:maven-jar-plugin: checking for updates from ws-zones
[INFO] [plugin:descriptor]
[INFO] Using 2 extractors.
[INFO] Applying extractor for language: java
[INFO] Extractor for language: java found 3 mojo descriptors.
[INFO] Applying extractor for language: bsh
[INFO] Extractor for language: bsh found 0 mojo descriptors.
[INFO] [resources:resources]
[INFO] Using default encoding to copy filtered resources.
[WARNING] 
	Artifact junit:junit:jar:3.8.2:test retains local scope 'test' overriding broader scope 'compile'
	given by a dependency. If this is not intended, modify or remove the local scope.

[INFO] [compiler:compile]
[INFO] Compiling 5 source files to /export/home/illsleyd/continuum/continuum-1.0.3/apps/continuum/working-directory/61/modules/tool/axis2-aar-maven-plugin/target/classes
[INFO] [resources:testResources]
[INFO] Using default encoding to copy filtered resources.
[INFO] [compiler:testCompile]
[INFO] No sources to compile
[INFO] [surefire:test]
[INFO] Tests are skipped.
[INFO] [jar:jar]
[INFO] Building jar: /export/home/illsleyd/continuum/continuum-1.0.3/apps/continuum/working-directory/61/modules/tool/axis2-aar-maven-plugin/target/axis2-aar-maven-plugin-SNAPSHOT.jar
[INFO] [plugin:addPluginArtifactMetadata]
[INFO] [install:install]
[INFO] Installing /export/home/illsleyd/continuum/continuum-1.0.3/apps/continuum/working-directory/61/modules/tool/axis2-aar-maven-plugin/target/axis2-aar-maven-plugin-SNAPSHOT.jar
to /export/home/illsleyd/.m2/repository/org/apache/axis2/maven2/axis2-aar-maven-plugin/SNAPSHOT/axis2-aar-maven-plugin-SNAPSHOT.jar
[INFO] [plugin:updateRegistry]
[INFO] ----------------------------------------------------------------------------
[INFO] Building Apache Axis 2.0 - Java2WSDL
[INFO]    task-segment: [clean, install]
[INFO] ----------------------------------------------------------------------------
[INFO] [clean:clean]
[INFO] Deleting directory /export/home/illsleyd/continuum/continuum-1.0.3/apps/continuum/working-directory/61/modules/java2wsdl/target
[INFO] Deleting directory /export/home/illsleyd/continuum/continuum-1.0.3/apps/continuum/working-directory/61/modules/java2wsdl/target/classes
[INFO] Deleting directory /export/home/illsleyd/continuum/continuum-1.0.3/apps/continuum/working-directory/61/modules/java2wsdl/target/test-classes
[INFO] [resources:resources]
[INFO] Using default encoding to copy filtered resources.
[INFO] snapshot org.apache.geronimo.specs:geronimo-javamail_1.4_spec:1.0-SNAPSHOT: checking
for updates from apache.snapshots
Downloading: http://ws.zones.apache.org/repository2//jaxen/jaxen/1.1-beta-10/jaxen-1.1-beta-10.pom
[WARNING] Unable to get resource from repository apache-ws-snapshots2 (http://ws.zones.apache.org/repository2/)
Downloading: http://repo1.maven.org/maven2//jaxen/jaxen/1.1-beta-10/jaxen-1.1-beta-10.pom
[WARNING] Unable to get resource from repository maven2 (http://repo1.maven.org/maven2/)
Downloading: http://repo1.maven.org/maven2/jaxen/jaxen/1.1-beta-10/jaxen-1.1-beta-10.pom
[WARNING] Unable to get resource from repository central (http://repo1.maven.org/maven2)
[WARNING] While downloading woodstox:wstx-asl:3.2.0
  This artifact has been relocated to org.codehaus.woodstox:wstx-asl:3.2.0.


[INFO] snapshot org.apache.ws.commons.axiom:axiom-api:SNAPSHOT: checking for updates from
apache.snapshots
[INFO] snapshot org.apache.ws.commons.axiom:axiom-parent:SNAPSHOT: checking for updates from
apache.snapshots
[INFO] snapshot org.apache.ws.commons.axiom:axiom-impl:SNAPSHOT: checking for updates from
apache.snapshots
[INFO] snapshot org.apache.ws.commons.schema:XmlSchema:SNAPSHOT: checking for updates from
apache.snapshots
[INFO] [compiler:compile]
[INFO] Compiling 23 source files to /export/home/illsleyd/continuum/continuum-1.0.3/apps/continuum/working-directory/61/modules/java2wsdl/target/classes
[INFO] [resources:testResources]
[INFO] Using default encoding to copy filtered resources.
Downloading: http://ws.zones.apache.org/repository2//org/apache/ws/commons/schema/XmlSchema/20070315.143359-28/XmlSchema-20070315.143359-28.pom
[WARNING] Unable to get resource from repository apache-ws-snapshots2 (http://ws.zones.apache.org/repository2/)
Downloading: http://repo1.maven.org/maven2//org/apache/ws/commons/schema/XmlSchema/20070315.143359-28/XmlSchema-20070315.143359-28.pom
[WARNING] Unable to get resource from repository maven2 (http://repo1.maven.org/maven2/)
Downloading: http://repo1.maven.org/maven2/org/apache/ws/commons/schema/XmlSchema/20070315.143359-28/XmlSchema-20070315.143359-28.pom
[WARNING] Unable to get resource from repository central (http://repo1.maven.org/maven2)
[INFO] [compiler:testCompile]
[INFO] No sources to compile
[INFO] [surefire:test]
[INFO] Tests are skipped.
[INFO] [jar:jar]
[INFO] Building jar: /export/home/illsleyd/continuum/continuum-1.0.3/apps/continuum/working-directory/61/modules/java2wsdl/target/axis2-java2wsdl-SNAPSHOT.jar
[INFO] [install:install]
[INFO] Installing /export/home/illsleyd/continuum/continuum-1.0.3/apps/continuum/working-directory/61/modules/java2wsdl/target/axis2-java2wsdl-SNAPSHOT.jar
to /export/home/illsleyd/.m2/repository/org/apache/axis2/axis2-java2wsdl/SNAPSHOT/axis2-java2wsdl-SNAPSHOT.jar
[INFO] ----------------------------------------------------------------------------
[INFO] Building Apache Axis 2.0 - Kernel
[INFO]    task-segment: [clean, install]
[INFO] ----------------------------------------------------------------------------
[INFO] [clean:clean]
[INFO] Deleting directory /export/home/illsleyd/continuum/continuum-1.0.3/apps/continuum/working-directory/61/modules/kernel/target
[INFO] Deleting directory /export/home/illsleyd/continuum/continuum-1.0.3/apps/continuum/working-directory/61/modules/kernel/target/classes
[INFO] Deleting directory /export/home/illsleyd/continuum/continuum-1.0.3/apps/continuum/working-directory/61/modules/kernel/target/test-classes
[INFO] [resources:resources]
[INFO] Using default encoding to copy filtered resources.
[INFO] snapshot org.apache.ws.commons.axiom:axiom-dom:SNAPSHOT: checking for updates from
apache.snapshots
[WARNING] While downloading woodstox:wstx-asl:3.2.0
  This artifact has been relocated to org.codehaus.woodstox:wstx-asl:3.2.0.


[WARNING] 
	Artifact javax.servlet:servlet-api:jar:2.3:provided retains local scope 'provided' overriding
broader scope 'compile'
	given by a dependency. If this is not intended, modify or remove the local scope.

Downloading: http://ws.zones.apache.org/repository2//org/apache/neethi/neethi/2.0/neethi-2.0.pom
[WARNING] Unable to get resource from repository apache-ws-snapshots2 (http://ws.zones.apache.org/repository2/)
Downloading: http://repo1.maven.org/maven2//org/apache/neethi/neethi/2.0/neethi-2.0.pom
[WARNING] Unable to get resource from repository maven2 (http://repo1.maven.org/maven2/)
Downloading: http://repo1.maven.org/maven2/org/apache/neethi/neethi/2.0/neethi-2.0.pom
[WARNING] Unable to get resource from repository central (http://repo1.maven.org/maven2)
[INFO] [compiler:compile]
[INFO] Compiling 336 source files to /export/home/illsleyd/continuum/continuum-1.0.3/apps/continuum/working-directory/61/modules/kernel/target/classes
[INFO] ------------------------------------------------------------------------
[ERROR] BUILD FAILURE
[INFO] ------------------------------------------------------------------------
[INFO] Compilation failure

/export/home/illsleyd/continuum/continuum-1.0.3/apps/continuum/working-directory/61/modules/kernel/src/org/apache/axis2/description/WSDL20ToAxisServiceBuilder.java:[540,58]
cannot find symbol
symbol  : method getLocationTemplate()
location: class org.apache.woden.wsdl20.extensions.http.HTTPLocation

/export/home/illsleyd/continuum/continuum-1.0.3/apps/continuum/working-directory/61/modules/kernel/src/org/apache/axis2/description/WSDL20ToAxisServiceBuilder.java:[718,58]
cannot find symbol
symbol  : method getLocationTemplate()
location: class org.apache.woden.wsdl20.extensions.http.HTTPLocation


[INFO] ------------------------------------------------------------------------
[INFO] For more information, run Maven with the -e switch
[INFO] ------------------------------------------------------------------------
[INFO] Total time: 1 minute 57 seconds
[INFO] Finished at: Wed Mar 21 06:16:45 GMT+00:00 2007
[INFO] Final Memory: 18M/331M
[INFO] ------------------------------------------------------------------------

****************************************************************************



---------------------------------------------------------------------
To unsubscribe, e-mail: axis-cvs-unsubscribe@ws.apache.org
For additional commands, e-mail: axis-cvs-help@ws.apache.org


Mime
View raw message