axis-java-dev mailing list archives

Site index · List index
Message view « Date » · « Thread »
Top « Date » · « Thread »
From "davidillsley (Continuum)" <davidills...@apache.org>
Subject [Apache Axis 2.0 - Root][continuum] BUILD FAILURE
Date Thu, 22 Mar 2007 07:15:34 GMT
Online report : http://ws.zones.apache.org:10000/continuum/servlet/continuum/target/ProjectBuild.vm/view/ProjectBuild/id/61/buildId/1536
Build statistics:
  State: Failed
  Previous State: Failed
  Started at: Thu, 22 Mar 2007 07:02:36 +0000
  Finished at: Thu, 22 Mar 2007 07:15:32 +0000
  Total time: 12m 55s
  Build Trigger: Schedule
  Exit code: 1
  Building machine hostname: ws.zones.apache.org
  Operating system : SunOS(unknown)
  Java version : 1.5.0_09(Sun Microsystems Inc.)

Changes
         keithc          Rewriting AxisService2WSDL2 to create a WSDL2 document from an axisService.
Tested with services built using WSDL 2.0 documents and a few WSDL 1.1. documents. Need more

testing and may need to add more properties. The binding Heirachy is serialized in a way that
each component serializes itself. This will generate a WSDL which is an 
approximate of the original WSDL.

Added WSDLSerializationUtil.java and moven common code to it.


             /webservices/axis2/trunk/java/modules/kernel/src/org/apache/axis2/builder/BuilderUtil.java
            /webservices/axis2/trunk/java/modules/kernel/src/org/apache/axis2/description/AxisBinding.java
            /webservices/axis2/trunk/java/modules/kernel/src/org/apache/axis2/description/AxisBindingMessage.java
            /webservices/axis2/trunk/java/modules/kernel/src/org/apache/axis2/description/AxisBindingOperation.java
            /webservices/axis2/trunk/java/modules/kernel/src/org/apache/axis2/description/AxisEndpoint.java
            /webservices/axis2/trunk/java/modules/kernel/src/org/apache/axis2/description/AxisOperation.java
            /webservices/axis2/trunk/java/modules/kernel/src/org/apache/axis2/description/AxisService.java
            /webservices/axis2/trunk/java/modules/kernel/src/org/apache/axis2/description/AxisService2OM.java
            /webservices/axis2/trunk/java/modules/kernel/src/org/apache/axis2/description/AxisService2WSDL2.java
            /webservices/axis2/trunk/java/modules/kernel/src/org/apache/axis2/description/WSDL11ToAxisServiceBuilder.java
            /webservices/axis2/trunk/java/modules/kernel/src/org/apache/axis2/description/WSDL20DefaultValueHolder.java
            /webservices/axis2/trunk/java/modules/kernel/src/org/apache/axis2/description/WSDL20ToAxisServiceBuilder.java
            /webservices/axis2/trunk/java/modules/kernel/src/org/apache/axis2/description/WSDL2Constants.java
            /webservices/axis2/trunk/java/modules/kernel/src/org/apache/axis2/util/WSDLSerializationUtil.java
        
****************************************************************************
Output:
****************************************************************************
Snipped Output:
a" xmlns:soapenv="http://schemas.xmlsoap.org/soap/envelope/"><soapenv:Header>
  <shw:Hello xmlns:shw="http://www.jcommerce.net/soap/ns/SOAPHelloWorld">
    <shw:Myname>Tony</shw:Myname>
  </shw:Hello>
 </soapenv:Header><soapenv:Body>
<shw:Address xmlns:shw="http://www.jcommerce.net/soap/ns/SOAPHelloWorld" shw:t="test">
<shw:City>GENT</shw:City>
</shw:Address>
</soapenv:Body></soapenv:Envelope><soapenv:Envelope xmlns:xsi="http://www.w3.org/2001/XMLSchema-instance"
xmlns:xsd="http://www.w3.org/2001/XMLSchema" xmlns:soapenv="http://schemas.xmlsoap.org/soap/envelope/"><soapenv:Header>
  <shw:Hello xmlns:shw="http://www.jcommerce.net/soap/ns/SOAPHelloWorld">
    <shw:Myname>Tony</shw:Myname>
  </shw:Hello>
 </soapenv:Header><soapenv:Body>
<shw:Address xmlns:shw="http://www.jcommerce.net/soap/ns/SOAPHelloWorld" shw:t="test">
<shw:City>GENT</shw:City>
</shw:Address>
</soapenv:Body></soapenv:Envelope><soapenv:Envelope xmlns:xsi="http://www.w3.org/2001/XMLSchema-instance"
xmlns:xsd="http://www.w3.org/2001/XMLSchema" xmlns:soapenv="http://schemas.xmlsoap.org/soap/envelope/"
xmlns="http://somewhere.com/html"><soapenv:Body>
    <echo><arg0>Hello</arg0></echo> </soapenv:Body></soapenv:Envelope><soapenv:Envelope
xmlns:xsi="http://www.w3.org/2001/XMLSchema-instance" xmlns:xsd="http://www.w3.org/2001/XMLSchema"
xmlns:soapenv="http://schemas.xmlsoap.org/soap/envelope/"><soapenv:Body>
<!-- Comment -->    <t:echo xmlns:t="http://test.org/Test"><t:arg0>Hello</t:arg0></t:echo>
</soapenv:Body></soapenv:Envelope><soapenv:Envelope xmlns:xsi="http://www.w3.org/2001/XMLSchema-instance"
xmlns:xsd="http://www.w3.org/2001/XMLSchema" xmlns:soapenv="http://schemas.xmlsoap.org/soap/envelope/"><soapenv:Header>
<!-- Comment -->  <shw:Hello xmlns:shw="http://www.jcommerce.net/soap/ns/SOAPHelloWorld">
<!-- Comment -->    <shw:Myname><!-- Comment -->Tony</shw:Myname>
  </shw:Hello>
 </soapenv:Header><soapenv:Body>
<!-- Comment -->    <t:echo xmlns:t="http://test.org/Test"><t:arg0>Hello</t:arg0></t:echo>
</soapenv:Body></soapenv:Envelope>[surefire] Tests run: 16, Failures: 0, Errors:
0, Time elapsed: 0.143 sec
[surefire] Running org.apache.axis2.saaj.SOAPElementTest
[surefire] Tests run: 18, Failures: 0, Errors: 0, Time elapsed: 0.011 sec
[surefire] Running org.apache.axis2.saaj.SOAPFactoryTest
Create a DOMElement
[surefire] Tests run: 9, Failures: 0, Errors: 0, Time elapsed: 0.007 sec
[surefire] Running org.apache.axis2.saaj.SAAJResultTest
[surefire] Tests run: 1, Failures: 0, Errors: 0, Time elapsed: 0.002 sec
[surefire] Running org.apache.axis2.saaj.SOAPFaultDetailTest
[surefire] Tests run: 1, Failures: 0, Errors: 0, Time elapsed: 0.005 sec
[INFO] [jar:jar]
[INFO] Building jar: /export/home/illsleyd/continuum/continuum-1.0.3/apps/continuum/working-directory/61/modules/saaj/target/axis2-saaj-SNAPSHOT.jar
[INFO] [install:install]
[INFO] Installing /export/home/illsleyd/continuum/continuum-1.0.3/apps/continuum/working-directory/61/modules/saaj/target/axis2-saaj-SNAPSHOT.jar
to /export/home/illsleyd/.m2/repository/org/apache/axis2/axis2-saaj/SNAPSHOT/axis2-saaj-SNAPSHOT.jar
[INFO] ----------------------------------------------------------------------------
[INFO] Building Apache Axis 2.0 - JAXWS
[INFO]    task-segment: [clean, install]
[INFO] ----------------------------------------------------------------------------
[INFO] [clean:clean]
[INFO] Deleting directory /export/home/illsleyd/continuum/continuum-1.0.3/apps/continuum/working-directory/61/modules/jaxws/target
[INFO] Deleting directory /export/home/illsleyd/continuum/continuum-1.0.3/apps/continuum/working-directory/61/modules/jaxws/target/classes
[INFO] Deleting directory /export/home/illsleyd/continuum/continuum-1.0.3/apps/continuum/working-directory/61/modules/jaxws/target/test-classes
[INFO] [resources:resources]
[INFO] Using default encoding to copy filtered resources.
[INFO] [compiler:compile]
[INFO] Compiling 165 source files to /export/home/illsleyd/continuum/continuum-1.0.3/apps/continuum/working-directory/61/modules/jaxws/target/classes
[INFO] [antrun:run {execution: gen-ts}]
[INFO] Executing tasks
    [mkdir] Created dir: /export/home/illsleyd/continuum/continuum-1.0.3/apps/continuum/working-directory/61/modules/jaxws/target/schema
    [mkdir] Created dir: /export/home/illsleyd/continuum/continuum-1.0.3/apps/continuum/working-directory/61/modules/jaxws/target/schema/src
    [mkdir] Created dir: /export/home/illsleyd/continuum/continuum-1.0.3/apps/continuum/working-directory/61/modules/jaxws/target/schema/classes
     [echo] Generating JAX-B classes from XSDs
     [echo] Generating java from soap 11
     [echo] Generating java from echo.xsd
     [echo] Generating java from stock1.xsd
     [echo] Generating java from stock2.xsd
     [echo] Generating java from samplemtom.xsd
     [echo] Generating java from ProxyDocLitWrapped.wsdl
     [echo] Generating java from ProxyDocLitnonWrapped.wsdl
     [echo] Generating java from samplemtomjpeg.wsdl
     [echo] Generating java from RPCLit.wsdl
     [echo] Generating java from gorilla_dlw.wsdl
     [echo] Generating java from SOAP12Echo.wsdl
     [echo] Generating java from AddNumbers.wsdl
     [echo] Generating java from async_doclitwr.wsdl
     [echo] Generating java from FaultyWebService.wsdl
     [echo] Generating java from FaultsService.wsdl
     [echo] Generating java from jaxbsource
     [echo] Generating java from doclit_nonwrap.wsdl for javabean endpoint support
     [echo] Generating java from doclitwrap.wsdl for javabean endpoint support
     [echo] Generating java from doclitbare.wsdl for javabean endpoint support
     [echo] Generating java from greeterTypes.xsd
     [echo] Generating java from EchoMessage.wsdl for javabean endpoint support
     [echo] Generating java from resourceinjection.wsdl for javabean endpoint Resource Injection
support
     [echo] Generating java from AnyType.wsdl for javabean endpoint AnyType support
     [echo] Generating java from WSDLMultiTests.wsdl
     [echo] Generating java from Polymorphic shapes.wsdl for javabean endpoint support
     [echo] Generating java from SOAPActionTest.wsdl
[INFO] Executed tasks
[INFO] [resources:testResources]
[INFO] Using default encoding to copy filtered resources.
[INFO] [build-helper:add-test-source {execution: add-test-source}]
[INFO] Test Source directory: /export/home/illsleyd/continuum/continuum-1.0.3/apps/continuum/working-directory/61/modules/jaxws/target/schema/src
added.
[INFO] [compiler:testCompile]
[INFO] Compiling 442 source files to /export/home/illsleyd/continuum/continuum-1.0.3/apps/continuum/working-directory/61/modules/jaxws/target/test-classes
[INFO] ------------------------------------------------------------------------
[ERROR] BUILD FAILURE
[INFO] ------------------------------------------------------------------------
[INFO] Compilation failure

/export/home/illsleyd/continuum/continuum-1.0.3/apps/continuum/working-directory/61/modules/jaxws/test/org/apache/axis2/jaxws/rpclit/enumtype/sei/PortType.java:[10,30]
package org.test.rpclit.schema does not exist

/export/home/illsleyd/continuum/continuum-1.0.3/apps/continuum/working-directory/61/modules/jaxws/test/org/apache/axis2/jaxws/rpclit/enumtype/sei/PortType.java:[31,15]
cannot find symbol
symbol  : class ElementString
location: interface org.apache.axis2.jaxws.rpclit.enumtype.sei.PortType

/export/home/illsleyd/continuum/continuum-1.0.3/apps/continuum/working-directory/61/modules/jaxws/test/org/apache/axis2/jaxws/rpclit/enumtype/PortTypeImpl.java:[23,30]
package org.test.rpclit.schema does not exist

/export/home/illsleyd/continuum/continuum-1.0.3/apps/continuum/working-directory/61/modules/jaxws/test/org/apache/axis2/jaxws/rpclit/enumtype/PortTypeImpl.java:[31,34]
cannot find symbol
symbol  : class ElementString
location: class org.apache.axis2.jaxws.rpclit.enumtype.PortTypeImpl

/export/home/illsleyd/continuum/continuum-1.0.3/apps/continuum/working-directory/61/modules/jaxws/test/org/apache/axis2/jaxws/rpclit/enumtype/tests/RPCLitEnumTests.java:[25,30]
package org.test.rpclit.schema does not exist

/export/home/illsleyd/continuum/continuum-1.0.3/apps/continuum/working-directory/61/modules/jaxws/test/org/apache/axis2/jaxws/rpclit/enumtype/PortTypeImpl.java:[32,7]
cannot find symbol
symbol  : class ElementString
location: class org.apache.axis2.jaxws.rpclit.enumtype.PortTypeImpl

/export/home/illsleyd/continuum/continuum-1.0.3/apps/continuum/working-directory/61/modules/jaxws/test/org/apache/axis2/jaxws/rpclit/enumtype/tests/RPCLitEnumTests.java:[37,23]
cannot find symbol
symbol  : class ElementString
location: class org.apache.axis2.jaxws.rpclit.enumtype.tests.RPCLitEnumTests

/export/home/illsleyd/continuum/continuum-1.0.3/apps/continuum/working-directory/61/modules/jaxws/test/org/apache/axis2/jaxws/rpclit/enumtype/tests/RPCLitEnumTests.java:[37,59]
cannot find symbol
symbol  : class ElementString
location: class org.apache.axis2.jaxws.rpclit.enumtype.tests.RPCLitEnumTests

/export/home/illsleyd/continuum/continuum-1.0.3/apps/continuum/working-directory/61/modules/jaxws/test/org/apache/axis2/jaxws/rpclit/enumtype/tests/RPCLitEnumTests.java:[37,74]
cannot find symbol
symbol  : variable ElementString
location: class org.apache.axis2.jaxws.rpclit.enumtype.tests.RPCLitEnumTests

/export/home/illsleyd/continuum/continuum-1.0.3/apps/continuum/working-directory/61/modules/jaxws/test/org/apache/axis2/jaxws/rpclit/enumtype/tests/RPCLitEnumTests.java:[39,16]
cannot find symbol
symbol  : class ElementString
location: class org.apache.axis2.jaxws.rpclit.enumtype.tests.RPCLitEnumTests


[INFO] ------------------------------------------------------------------------
[INFO] For more information, run Maven with the -e switch
[INFO] ------------------------------------------------------------------------
[INFO] Total time: 12 minutes 44 seconds
[INFO] Finished at: Thu Mar 22 07:15:27 GMT+00:00 2007
[INFO] Final Memory: 37M/1000M
[INFO] ------------------------------------------------------------------------

****************************************************************************



---------------------------------------------------------------------
To unsubscribe, e-mail: axis-cvs-unsubscribe@ws.apache.org
For additional commands, e-mail: axis-cvs-help@ws.apache.org


Mime
View raw message