axis-java-dev mailing list archives

Site index · List index
Message view « Date » · « Thread »
Top « Date » · « Thread »
From "Thilina Gunarathne" <cset...@gmail.com>
Subject Re: [continuum] BUILD FAILURE: Axis2
Date Mon, 19 Feb 2007 10:34:07 GMT
I'm looking in to this failure...

Thanks,
Thilina

On 2/19/07, davidillsley (Continuum) <davidillsley@apache.org> wrote:
> Online report : http://localhost:8080/continuum/servlet/continuum/target/ProjectBuild.vm/view/ProjectBuild/id/1/buildId/987
> Build statistics:
>   State: Failed
>   Previous State: Failed
>   Started at: Mon, 19 Feb 2007 08:30:29 +0000
>   Finished at: Mon, 19 Feb 2007 08:53:41 +0000
>   Total time: 23m 11s
>   Build Trigger: Forced
>   Exit code: 70
>   Building machine hostname: ws.zones.apache.org
>   Operating system : SunOS(unknown)
>   Java version : 1.5.0_09(Sun Microsystems Inc.)
>
> Changes
>       No files changed
>
> ****************************************************************************
> Output:
> ****************************************************************************
>  __  __
> |  \/  |__ _Apache__ ___
> | |\/| / _` \ V / -_) ' \  ~ intelligent projects ~
> |_|  |_\__,_|\_/\___|_||_|  v. 1.1-beta-3
>
> DEPRECATED: the default goal should be specified in the <build> section of project.xml instead of maven.xml
> DEPRECATED: the default goal should be specified in the <build> section of project.xml instead of maven.xml
> Trying to get missing/snapshot dependencies required by Apache Axis2:
> Attempting to download maven-test-plugin-1.8.1-SNAPSHOT.jar.
> Skipping download as local copy is up to date!
> Attempting to download maven-multiproject-plugin-1.5-SNAPSHOT.jar.
> Skipping download as local copy is up to date!
> Attempting to download maven-jar-plugin-1.8-SNAPSHOT.jar.
> Skipping download as local copy is up to date!
> Attempting to download maven-plugin-plugin-1.8-SNAPSHOT.jar.
> Skipping download as local copy is up to date!
>     [echo] Current Java Version is: 1.5
>     [echo]
>             JDK 1.5 detected, including the following modules:
>             modules/metadata/project.xml,modules/saaj-api/project.xml,modules/saaj/project.xml,modules/jaxbri/project.xml,modules/jaxws/project.xml,modules/jaxws-api/project.xml,modules/json/project.xml
>
> build:start:
>
> clean:
> modules:clean:
> modules:reactor:init:
> plugin:download-artifact:
>
>     [echo] Adding to modules.reactor.includes: modules/adb-codegen/project.xml
>     [echo] Adding to modules.reactor.includes: modules/adb/project.xml
>     [echo] Adding to modules.reactor.includes: modules/addressing/project.xml
>     [echo] Adding to modules.reactor.includes: modules/codegen/project.xml
>     [echo] Adding to modules.reactor.includes: modules/integration/project.xml
>     [echo] Adding to modules.reactor.includes: modules/java2wsdl/project.xml
>     [echo] Adding to modules.reactor.includes: modules/jaxbri/project.xml
>     [echo] Adding to modules.reactor.includes: modules/jaxws-api/project.xml
>     [echo] Adding to modules.reactor.includes: modules/jaxws/project.xml
>     [echo] Adding to modules.reactor.includes: modules/jibx/project.xml
>     [echo] Adding to modules.reactor.includes: modules/json/project.xml
>     [echo] Adding to modules.reactor.includes: modules/kernel/project.xml
>     [echo] Adding to modules.reactor.includes: modules/metadata/project.xml
>     [echo] Adding to modules.reactor.includes: modules/mex/project.xml
>     [echo] Adding to modules.reactor.includes: modules/mtompolicy/project.xml
>     [echo] Adding to modules.reactor.includes: modules/saaj-api/project.xml
>     [echo] Adding to modules.reactor.includes: modules/saaj/project.xml
>     [echo] Adding to modules.reactor.includes: modules/samples/project.xml
>     [echo] Adding to modules.reactor.includes: modules/soapmonitor/project.xml
>     [echo] Adding to modules.reactor.includes: modules/spring/project.xml
>     [echo] Adding to modules.reactor.includes: modules/tool/project.xml
>     [echo] Adding to modules.reactor.includes: modules/webapp/project.xml
>     [echo] Adding to modules.reactor.includes: modules/xmlbeans/project.xml
>
>     [echo] +----------------------------------------
>     [echo] | Cleaning: modules/adb-codegen
>     [echo] +----------------------------------------
>     [delete] Deleting directory /export/home/illsleyd/continuum/continuum-1.0.3/apps/continuum/working-directory/1/modules/adb-codegen/target
>     [echo]
>     [echo] +----------------------------------------
>     [echo] | Cleaning: modules/adb
>     [echo] +----------------------------------------
>     [delete] Deleting directory /export/home/illsleyd/continuum/continuum-1.0.3/apps/continuum/working-directory/1/modules/adb/target
>     [echo]
>     [echo] +----------------------------------------
>     [echo] | Cleaning: modules/addressing
>     [echo] +----------------------------------------
>     [delete] Deleting directory /export/home/illsleyd/continuum/continuum-1.0.3/apps/continuum/working-directory/1/modules/addressing/target
>     [echo]
>     [echo] +----------------------------------------
>     [echo] | Cleaning: modules/codegen
>     [echo] +----------------------------------------
>     [delete] Deleting directory /export/home/illsleyd/continuum/continuum-1.0.3/apps/continuum/working-directory/1/modules/codegen/target
>     [echo]
>     [echo] +----------------------------------------
>     [echo] | Cleaning: modules/integration
>     [echo] +----------------------------------------
>     [delete] Deleting directory /export/home/illsleyd/continuum/continuum-1.0.3/apps/continuum/working-directory/1/modules/integration/target
>     [echo]
>     [echo] +----------------------------------------
>     [echo] | Cleaning: modules/java2wsdl
>     [echo] +----------------------------------------
>     [delete] Deleting directory /export/home/illsleyd/continuum/continuum-1.0.3/apps/continuum/working-directory/1/modules/java2wsdl/target
>     [echo]
>     [echo] +----------------------------------------
>     [echo] | Cleaning: modules/jaxbri
>     [echo] +----------------------------------------
>     [delete] Deleting directory /export/home/illsleyd/continuum/continuum-1.0.3/apps/continuum/working-directory/1/modules/jaxbri/target
>     [echo]
>     [echo] +----------------------------------------
>     [echo] | Cleaning: modules/jaxws-api
>     [echo] +----------------------------------------
>     [delete] Deleting directory /export/home/illsleyd/continuum/continuum-1.0.3/apps/continuum/working-directory/1/modules/jaxws-api/target
>     [echo]
>     [echo] +----------------------------------------
>     [echo] | Cleaning: modules/jaxws
>     [echo] +----------------------------------------
>     [delete] Deleting directory /export/home/illsleyd/continuum/continuum-1.0.3/apps/continuum/working-directory/1/modules/jaxws/target
>     [echo]
>     [echo] +----------------------------------------
>     [echo] | Cleaning: modules/jibx
>     [echo] +----------------------------------------
>     [echo]
>     [echo] +----------------------------------------
>     [echo] | Cleaning: modules/json
>     [echo] +----------------------------------------
>     [echo]
>     [echo] +----------------------------------------
>     [echo] | Cleaning: modules/kernel
>     [echo] +----------------------------------------
>     [delete] Deleting directory /export/home/illsleyd/continuum/continuum-1.0.3/apps/continuum/working-directory/1/modules/kernel/target
>     [echo]
>     [echo] +----------------------------------------
>     [echo] | Cleaning: modules/metadata
>     [echo] +----------------------------------------
>     [delete] Deleting directory /export/home/illsleyd/continuum/continuum-1.0.3/apps/continuum/working-directory/1/modules/metadata/target
>     [echo]
>     [echo] +----------------------------------------
>     [echo] | Cleaning: modules/mex
>     [echo] +----------------------------------------
>     [echo]
>     [echo] +----------------------------------------
>     [echo] | Cleaning: modules/mtompolicy
>     [echo] +----------------------------------------
>     [echo]
>     [echo] +----------------------------------------
>     [echo] | Cleaning: modules/saaj-api
>     [echo] +----------------------------------------
>     [delete] Deleting directory /export/home/illsleyd/continuum/continuum-1.0.3/apps/continuum/working-directory/1/modules/saaj-api/target
>     [echo]
>     [echo] +----------------------------------------
>     [echo] | Cleaning: modules/saaj
>     [echo] +----------------------------------------
>     [delete] Deleting directory /export/home/illsleyd/continuum/continuum-1.0.3/apps/continuum/working-directory/1/modules/saaj/target
>     [echo]
>     [echo] +----------------------------------------
>     [echo] | Cleaning: modules/samples
>     [echo] +----------------------------------------
>     [delete] Deleting directory /export/home/illsleyd/continuum/continuum-1.0.3/apps/continuum/working-directory/1/modules/samples/target
>     [echo]
>     [echo] +----------------------------------------
>     [echo] | Cleaning: modules/soapmonitor
>     [echo] +----------------------------------------
>     [echo]
>     [echo] +----------------------------------------
>     [echo] | Cleaning: modules/spring
>     [echo] +----------------------------------------
>     [delete] Deleting directory /export/home/illsleyd/continuum/continuum-1.0.3/apps/continuum/working-directory/1/modules/spring/target
>     [echo]
>     [echo] +----------------------------------------
>     [echo] | Cleaning: modules/tool
>     [echo] +----------------------------------------
>     [delete] Deleting directory /export/home/illsleyd/continuum/continuum-1.0.3/apps/continuum/working-directory/1/modules/tool/target
>     [echo]
>     [echo] +----------------------------------------
>     [echo] | Cleaning: modules/webapp
>     [echo] +----------------------------------------
>     [echo]
>     [echo] +----------------------------------------
>     [echo] | Cleaning: modules/xmlbeans
>     [echo] +----------------------------------------
>     [delete] Deleting directory /export/home/illsleyd/continuum/continuum-1.0.3/apps/continuum/working-directory/1/modules/xmlbeans/target
>     [echo]
>     [echo] +----------------------------------------
>     [echo] | Cleaning: target and etc/target
>     [echo] +----------------------------------------
>
>
> jar:
> multiproject:install:
> multiproject:projects-init:
>     [echo] Gathering project list
> Starting the reactor...
> Our processing order:
> Apache Axis 2.0 - Java2WSDL
> Apache Axis 2.0 - Kernel
> Apache Axis 2.0 - Data Binding
> Apache Axis 2.0 - Code Generation
> Apache Axis 2.0 - ADB Codegen
> Apache Axis 2.0 - Addressing
> Apache Axis 2.0 - Samples
> Apache Axis 2.0 - spring
> Apache Axis 2.0 - XMLBeans Data Binding
> Apache Axis 2.0 - Tools
> Apache Axis 2.0 - Integration
> Apache Axis 2.0 - JAXB-RI Data Binding
> Apache Axis 2.0 - SAAJ API
> Apache Axis 2.0 - JAXWS API
> Apache Axis 2.0 - SAAJ
> Apache Axis 2.0 - Metadata
> Apache Axis 2.0 - JAX-WS
> Apache Axis 2.0 - JiBX Data Binding
> Apache Axis 2.0 - JSON
> Apache Axis 2.0 - Metadata Exchange
> Apache Axis 2.0 - MTOM Policy
> Apache Axis 2.0 - soapmonitor
> +----------------------------------------
> | Gathering project list Apache Axis 2.0 - Java2WSDL
> | Memory: 15M/36M
> +----------------------------------------
> +----------------------------------------
> | Gathering project list Apache Axis 2.0 - Kernel
> | Memory: 15M/36M
> +----------------------------------------
> +----------------------------------------
> | Gathering project list Apache Axis 2.0 - Data Binding
> | Memory: 15M/36M
> +----------------------------------------
> +----------------------------------------
> | Gathering project list Apache Axis 2.0 - Code Generation
> | Memory: 15M/36M
> +----------------------------------------
> +----------------------------------------
> | Gathering project list Apache Axis 2.0 - ADB Codegen
> | Memory: 15M/36M
> +----------------------------------------
> +----------------------------------------
> | Gathering project list Apache Axis 2.0 - Addressing
> | Memory: 15M/36M
> +----------------------------------------
> +----------------------------------------
> | Gathering project list Apache Axis 2.0 - Samples
> | Memory: 15M/36M
> +----------------------------------------
> +----------------------------------------
> | Gathering project list Apache Axis 2.0 - spring
> | Memory: 15M/36M
> +----------------------------------------
> +----------------------------------------
> | Gathering project list Apache Axis 2.0 - XMLBeans Data Binding
> | Memory: 15M/36M
> +----------------------------------------
> +----------------------------------------
> | Gathering project list Apache Axis 2.0 - Tools
> | Memory: 15M/36M
> +----------------------------------------
> +----------------------------------------
> | Gathering project list Apache Axis 2.0 - Integration
> | Memory: 15M/36M
> +----------------------------------------
> +----------------------------------------
> | Gathering project list Apache Axis 2.0 - JAXB-RI Data Binding
> | Memory: 15M/36M
> +----------------------------------------
> +----------------------------------------
> | Gathering project list Apache Axis 2.0 - SAAJ API
> | Memory: 15M/36M
> +----------------------------------------
> +----------------------------------------
> | Gathering project list Apache Axis 2.0 - JAXWS API
> | Memory: 15M/36M
> +----------------------------------------
> +----------------------------------------
> | Gathering project list Apache Axis 2.0 - SAAJ
> | Memory: 15M/36M
> +----------------------------------------
> +----------------------------------------
> | Gathering project list Apache Axis 2.0 - Metadata
> | Memory: 15M/36M
> +----------------------------------------
> +----------------------------------------
> | Gathering project list Apache Axis 2.0 - JAX-WS
> | Memory: 15M/36M
> +----------------------------------------
> +----------------------------------------
> | Gathering project list Apache Axis 2.0 - JiBX Data Binding
> | Memory: 15M/36M
> +----------------------------------------
> +----------------------------------------
> | Gathering project list Apache Axis 2.0 - JSON
> | Memory: 15M/36M
> +----------------------------------------
> +----------------------------------------
> | Gathering project list Apache Axis 2.0 - Metadata Exchange
> | Memory: 15M/36M
> +----------------------------------------
> +----------------------------------------
> | Gathering project list Apache Axis 2.0 - MTOM Policy
> | Memory: 15M/36M
> +----------------------------------------
> +----------------------------------------
> | Gathering project list Apache Axis 2.0 - soapmonitor
> | Memory: 15M/36M
> +----------------------------------------
>
> multiproject:goal:
> Starting the reactor...
> Our processing order:
> Apache Axis 2.0 - Java2WSDL
> Apache Axis 2.0 - Kernel
> Apache Axis 2.0 - Data Binding
> Apache Axis 2.0 - Code Generation
> Apache Axis 2.0 - ADB Codegen
> Apache Axis 2.0 - Addressing
> Apache Axis 2.0 - Samples
> Apache Axis 2.0 - spring
> Apache Axis 2.0 - XMLBeans Data Binding
> Apache Axis 2.0 - Tools
> Apache Axis 2.0 - Integration
> Apache Axis 2.0 - JAXB-RI Data Binding
> Apache Axis 2.0 - SAAJ API
> Apache Axis 2.0 - JAXWS API
> Apache Axis 2.0 - SAAJ
> Apache Axis 2.0 - Metadata
> Apache Axis 2.0 - JAX-WS
> Apache Axis 2.0 - JiBX Data Binding
> Apache Axis 2.0 - JSON
> Apache Axis 2.0 - Metadata Exchange
> Apache Axis 2.0 - MTOM Policy
> Apache Axis 2.0 - soapmonitor
> +----------------------------------------
> | Executing multiproject:install-callback Apache Axis 2.0 - Java2WSDL
> | Memory: 15M/36M
> +----------------------------------------
> DEPRECATED: the default goal should be specified in the <build> section of project.xml instead of maven.xml
> DEPRECATED: the default goal should be specified in the <build> section of project.xml instead of maven.xml
> Trying to get missing/snapshot dependencies required by Apache Axis 2.0 - Java2WSDL:
> Attempting to download axiom-api-SNAPSHOT.jar.
> Skipping download as local copy is up to date!
> Attempting to download axiom-impl-SNAPSHOT.jar.
> Skipping download as local copy is up to date!
> build:start:
>
> multiproject:install-callback:
>     [echo] Running jar:install for Apache Axis 2.0 - Java2WSDL
> java:prepare-filesystem:
>     [mkdir] Created dir: /export/home/illsleyd/continuum/continuum-1.0.3/apps/continuum/working-directory/1/modules/java2wsdl/target/classes
> Running post goal: java:prepare-filesystem
>
> java:compile:
>     [echo] Compiling to /export/home/illsleyd/continuum/continuum-1.0.3/apps/continuum/working-directory/1/modules/java2wsdl/target/classes
>     [javac] Compiling 22 source files to /export/home/illsleyd/continuum/continuum-1.0.3/apps/continuum/working-directory/1/modules/java2wsdl/target/classes
>
> java:jar-resources:
> Copying 2 files to /export/home/illsleyd/continuum/continuum-1.0.3/apps/continuum/working-directory/1/modules/java2wsdl/target/classes/META-INF
>
> test:test:
>     [echo] No tests to run.
>
> jar:jar:
>     [jar] Building jar: /export/home/illsleyd/continuum/continuum-1.0.3/apps/continuum/working-directory/1/modules/java2wsdl/target/axis2-java2wsdl-SNAPSHOT.jar
>
> jar:install:
>     [echo] Installing...
> Uploading to org.apache.axis2/jars/axis2-java2wsdl-SNAPSHOT.jar:
> .................... (55K)
> Uploading to org.apache.axis2/poms/axis2-java2wsdl-SNAPSHOT.pom:
> .................... (14K)
>
> +----------------------------------------
> | Executing multiproject:install-callback Apache Axis 2.0 - Kernel
> | Memory: 15M/40M
> +----------------------------------------
> DEPRECATED: the default goal should be specified in the <build> section of project.xml instead of maven.xml
> DEPRECATED: the default goal should be specified in the <build> section of project.xml instead of maven.xml
>
> build:end:
>
> Trying to get missing/snapshot dependencies required by Apache Axis 2.0 - Kernel:
> Attempting to download axis2-java2wsdl-SNAPSHOT.jar.
> Skipping download as local copy is up to date!
> Attempting to download neethi-SNAPSHOT.jar.
> 4/28K
> 8/28K
> 12/28K
> 16/28K
> 20/28K
> 24/28K
> 28/28K
> 28/28K
> 28K downloaded
> *** CHECKSUM FAILED - Checksum failed on download: local = '1992f798e2ca8defb1172a09465a109b'; remote = '1f65b228ee693e9f83e0c8517ffdbc7c' - RETRYING
> 4/28K
> 8/28K
> 12/28K
> 16/28K
> 20/28K
> 22/28K
> 26/28K
> 26/28K
> 28/28K
> 28K downloaded
> Error retrieving artifact from [http://people.apache.org/repo/m1-snapshot-repository/]: org.apache.maven.verifier.ChecksumVerificationException: Checksum failed on download: local = '1992f798e2ca8defb1172a09465a109b'; remote = '1f65b228ee693e9f83e0c8517ffdbc7c'
> Attempting to download woden-1.0-incubating-SNAPSHOT.jar.
> 4/303K
> 8/303K
> 12/303K
> 16/303K
> 20/303K
> 24/303K
> 28/303K
> 32/303K
> 36/303K
> 40/303K
> 44/303K
> 48/303K
> 49/303K
> 51/303K
> 55/303K
> 58/303K
> 62/303K
> 66/303K
> 70/303K
> 72/303K
> 76/303K
> 79/303K
> 83/303K
> 86/303K
> 90/303K
> 93/303K
> 97/303K
> 100/303K
> 104/303K
> 108/303K
> 112/303K
> 115/303K
> 119/303K
> 122/303K
> 126/303K
> 129/303K
> 133/303K
> 136/303K
> 140/303K
> 143/303K
> 147/303K
> 150/303K
> 154/303K
> 157/303K
> 161/303K
> 165/303K
> 169/303K
> 172/303K
> 176/303K
> 179/303K
> 183/303K
> 186/303K
> 190/303K
> 194/303K
> 198/303K
> 200/303K
> 204/303K
> 207/303K
> 211/303K
> 215/303K
> 219/303K
> 222/303K
> 226/303K
> 229/303K
> 233/303K
> 236/303K
> 240/303K
> 243/303K
> 247/303K
> 250/303K
> 254/303K
> 257/303K
> 261/303K
> 264/303K
> 268/303K
> 272/303K
> 276/303K
> 279/303K
> 283/303K
> 286/303K
> 290/303K
> 293/303K
> 297/303K
> 300/303K
> 303/303K
> 303K downloaded
> *** CHECKSUM FAILED - Checksum failed on download: local = '16695ca7b196ed38d406f8c7d1b2b871'; remote = '2e8e82d339689520554360341f45746d' - RETRYING
> 4/303K
> 8/303K
> 12/303K
> 16/303K
> 20/303K
> 24/303K
> 28/303K
> 32/303K
> 36/303K
> 40/303K
> 44/303K
> 48/303K
> 52/303K
> 56/303K
> 60/303K
> 64/303K
> 68/303K
> 69/303K
> 73/303K
> 77/303K
> 81/303K
> 83/303K
> 87/303K
> 90/303K
> 94/303K
> 97/303K
> 101/303K
> 104/303K
> 108/303K
> 111/303K
> 115/303K
> 118/303K
> 122/303K
> 126/303K
> 130/303K
> 133/303K
> 137/303K
> 140/303K
> 144/303K
> 147/303K
> 151/303K
> 154/303K
> 158/303K
> 161/303K
> 165/303K
> 168/303K
> 172/303K
> 175/303K
> 179/303K
> 183/303K
> 187/303K
> 190/303K
> 194/303K
> 197/303K
> 201/303K
> 204/303K
> 208/303K
> 211/303K
> 215/303K
> 218/303K
> 222/303K
> 225/303K
> 229/303K
> 232/303K
> 236/303K
> 240/303K
> 244/303K
> 247/303K
> 251/303K
> 254/303K
> 258/303K
> 261/303K
> 265/303K
> 268/303K
> 272/303K
> 275/303K
> 279/303K
> 282/303K
> 286/303K
> 290/303K
> 294/303K
> 297/303K
> 301/303K
> 303/303K
> 303K downloaded
> Error retrieving artifact from [http://people.apache.org/repo/m1-snapshot-repository/]: org.apache.maven.verifier.ChecksumVerificationException: Checksum failed on download: local = '16695ca7b196ed38d406f8c7d1b2b871'; remote = '2e8e82d339689520554360341f45746d'
> build:start:
>
> multiproject:install-callback:
>     [echo] Running jar:install for Apache Axis 2.0 - Kernel
> java:prepare-filesystem:
>     [mkdir] Created dir: /export/home/illsleyd/continuum/continuum-1.0.3/apps/continuum/working-directory/1/modules/kernel/target/classes
> Running post goal: java:prepare-filesystem
>
> java:compile:
>     [echo] Compiling to /export/home/illsleyd/continuum/continuum-1.0.3/apps/continuum/working-directory/1/modules/kernel/target/classes
>     [javac] Compiling 309 source files to /export/home/illsleyd/continuum/continuum-1.0.3/apps/continuum/working-directory/1/modules/kernel/target/classes
>     [javac] Note: Some input files use or override a deprecated API.
>     [javac] Note: Recompile with -Xlint:deprecation for details.
>
> java:jar-resources:
> Copying 1 file to /export/home/illsleyd/continuum/continuum-1.0.3/apps/continuum/working-directory/1/modules/kernel/target/classes
> Copying 2 files to /export/home/illsleyd/continuum/continuum-1.0.3/apps/continuum/working-directory/1/modules/kernel/target/classes
> Copying 2 files to /export/home/illsleyd/continuum/continuum-1.0.3/apps/continuum/working-directory/1/modules/kernel/target/classes/META-INF
>
> test:test:
> java:prepare-filesystem:
> Running post goal: java:prepare-filesystem
>
> java:compile:
>     [echo] Compiling to /export/home/illsleyd/continuum/continuum-1.0.3/apps/continuum/working-directory/1/modules/kernel/target/classes
>     [javac] Compiling 1 source file to /export/home/illsleyd/continuum/continuum-1.0.3/apps/continuum/working-directory/1/modules/kernel/target/classes
>
> java:jar-resources:
>
> test:prepare-filesystem:
>     [mkdir] Created dir: /export/home/illsleyd/continuum/continuum-1.0.3/apps/continuum/working-directory/1/modules/kernel/target/test-classes
>     [mkdir] Created dir: /export/home/illsleyd/continuum/continuum-1.0.3/apps/continuum/working-directory/1/modules/kernel/target/test-reports
>
> test:test-resources:
> Copying 59 files to /export/home/illsleyd/continuum/continuum-1.0.3/apps/continuum/working-directory/1/modules/kernel/target/test-classes/../test-resources
>
> test:compile:
>     [javac] Compiling 93 source files to /export/home/illsleyd/continuum/continuum-1.0.3/apps/continuum/working-directory/1/modules/kernel/target/test-classes
>     [javac] Note: Some input files use or override a deprecated API.
>     [javac] Note: Recompile with -Xlint:deprecation for details.
> Running post goal: test:compile
>     [echo] the files are up to date = ${jars.uptodate}
>     [mkdir] Created dir: /export/home/illsleyd/continuum/continuum-1.0.3/apps/continuum/working-directory/1/modules/kernel/test-resources/deployment/service2/build/classes
>     [mkdir] Created dir: /export/home/illsleyd/continuum/continuum-1.0.3/apps/continuum/working-directory/1/modules/kernel/test-resources/deployment/service2/build/lib
>     [copy] Copying 1 file to /export/home/illsleyd/continuum/continuum-1.0.3/apps/continuum/working-directory/1/modules/kernel/test-resources/deployment/service2/build/classes/META-INF
>     [mkdir] Created dir: /export/home/illsleyd/continuum/continuum-1.0.3/apps/continuum/working-directory/1/modules/kernel/target/test-resources/deployment/services
>     [jar] Building jar: /export/home/illsleyd/continuum/continuum-1.0.3/apps/continuum/working-directory/1/modules/kernel/target/test-resources/deployment/services/service2.jar
>     [delete] Deleting directory /export/home/illsleyd/continuum/continuum-1.0.3/apps/continuum/working-directory/1/modules/kernel/test-resources/deployment/service2/build
>     [echo] the files are up to date = ${jars.uptodate}
>     [mkdir] Created dir: /export/home/illsleyd/continuum/continuum-1.0.3/apps/continuum/working-directory/1/modules/kernel/test-resources/deployment/echo/build/classes
>     [mkdir] Created dir: /export/home/illsleyd/continuum/continuum-1.0.3/apps/continuum/working-directory/1/modules/kernel/test-resources/deployment/echo/build/lib
>     [copy] Copying 1 file to /export/home/illsleyd/continuum/continuum-1.0.3/apps/continuum/working-directory/1/modules/kernel/test-resources/deployment/echo/build/classes/META-INF
>     [mkdir] Created dir: /export/home/illsleyd/continuum/continuum-1.0.3/apps/continuum/working-directory/1/modules/kernel/target/echo
>     [jar] Building jar: /export/home/illsleyd/continuum/continuum-1.0.3/apps/continuum/working-directory/1/modules/kernel/target/echo/echo.aar
>     [delete] Deleting directory /export/home/illsleyd/continuum/continuum-1.0.3/apps/continuum/working-directory/1/modules/kernel/test-resources/deployment/echo/build
>     [echo] the files are up to date = ${jars.uptodate}
>     [mkdir] Created dir: /export/home/illsleyd/continuum/continuum-1.0.3/apps/continuum/working-directory/1/modules/kernel/test-resources/deployment/invalidservice/build/classes
>     [mkdir] Created dir: /export/home/illsleyd/continuum/continuum-1.0.3/apps/continuum/working-directory/1/modules/kernel/test-resources/deployment/invalidservice/build/lib
>     [copy] Copying 1 file to /export/home/illsleyd/continuum/continuum-1.0.3/apps/continuum/working-directory/1/modules/kernel/test-resources/deployment/invalidservice/build/classes/META-INF
>     [mkdir] Created dir: /export/home/illsleyd/continuum/continuum-1.0.3/apps/continuum/working-directory/1/modules/kernel/target/test-resources/InvalidDeployment/services
>     [jar] Building jar: /export/home/illsleyd/continuum/continuum-1.0.3/apps/continuum/working-directory/1/modules/kernel/target/test-resources/InvalidDeployment/services/invalidService.jar
>     [delete] Deleting directory /export/home/illsleyd/continuum/continuum-1.0.3/apps/continuum/working-directory/1/modules/kernel/test-resources/deployment/invalidservice/build
>     [echo] the files are up to date = ${jars.uptodate}
>     [mkdir] Created dir: /export/home/illsleyd/continuum/continuum-1.0.3/apps/continuum/working-directory/1/modules/kernel/test-resources/deployment/module1/build/classes
>     [mkdir] Created dir: /export/home/illsleyd/continuum/continuum-1.0.3/apps/continuum/working-directory/1/modules/kernel/test-resources/deployment/module1/build/lib
>     [copy] Copying 1 file to /export/home/illsleyd/continuum/continuum-1.0.3/apps/continuum/working-directory/1/modules/kernel/test-resources/deployment/module1/build/classes/META-INF
>     [mkdir] Created dir: /export/home/illsleyd/continuum/continuum-1.0.3/apps/continuum/working-directory/1/modules/kernel/target/test-resources/deployment/modules
>     [jar] Building jar: /export/home/illsleyd/continuum/continuum-1.0.3/apps/continuum/working-directory/1/modules/kernel/target/test-resources/deployment/modules/module1.mar
>     [delete] Deleting directory /export/home/illsleyd/continuum/continuum-1.0.3/apps/continuum/working-directory/1/modules/kernel/test-resources/deployment/module1/build
>     [echo] the files are up to date = ${jars.uptodate}
>     [mkdir] Created dir: /export/home/illsleyd/continuum/continuum-1.0.3/apps/continuum/working-directory/1/modules/kernel/test-resources/deployment/serviceModule/build/classes
>     [mkdir] Created dir: /export/home/illsleyd/continuum/continuum-1.0.3/apps/continuum/working-directory/1/modules/kernel/test-resources/deployment/serviceModule/build/lib
>     [copy] Copying 1 file to /export/home/illsleyd/continuum/continuum-1.0.3/apps/continuum/working-directory/1/modules/kernel/test-resources/deployment/serviceModule/build/classes/META-INF
>     [mkdir] Created dir: /export/home/illsleyd/continuum/continuum-1.0.3/apps/continuum/working-directory/1/modules/kernel/target/test-resources/InvalidDeployment/modules
>     [jar] Building jar: /export/home/illsleyd/continuum/continuum-1.0.3/apps/continuum/working-directory/1/modules/kernel/target/test-resources/InvalidDeployment/modules/serviceModule.jar
>     [delete] Deleting directory /export/home/illsleyd/continuum/continuum-1.0.3/apps/continuum/working-directory/1/modules/kernel/test-resources/deployment/serviceModule/build
>     [mkdir] Created dir: /export/home/illsleyd/continuum/continuum-1.0.3/apps/continuum/working-directory/1/modules/kernel/target/test-resources/java2sec/more
>     [mkdir] Created dir: /export/home/illsleyd/continuum/continuum-1.0.3/apps/continuum/working-directory/1/modules/kernel/target/test-resources/java2sec/less
>     [jar] Building jar: /export/home/illsleyd/continuum/continuum-1.0.3/apps/continuum/working-directory/1/modules/kernel/target/test-resources/java2sec/more/MorePermission.jar
>     [delete] Deleting directory /export/home/illsleyd/continuum/continuum-1.0.3/apps/continuum/working-directory/1/modules/kernel/target/test-classes/org/apache/axis2/java/security/driver
>     [delete] Deleting directory /export/home/illsleyd/continuum/continuum-1.0.3/apps/continuum/working-directory/1/modules/kernel/target/test-classes/org/apache/axis2/java/security/more
>     [delete] Deleting directory /export/home/illsleyd/continuum/continuum-1.0.3/apps/continuum/working-directory/1/modules/kernel/target/test-classes/org/apache/axis2/java/security/action
>     [delete] Deleting directory /export/home/illsleyd/continuum/continuum-1.0.3/apps/continuum/working-directory/1/modules/kernel/target/test-classes/org/apache/axis2/java/security/interf
>     [jar] Building jar: /export/home/illsleyd/continuum/continuum-1.0.3/apps/continuum/working-directory/1/modules/kernel/target/test-resources/java2sec/less/LessPermission.jar
>     [delete] Deleting directory /export/home/illsleyd/continuum/continuum-1.0.3/apps/continuum/working-directory/1/modules/kernel/target/test-classes/org/apache/axis2/java/security/less
>
>     [junit] Running org.apache.axis2.addressing.AddressingHelperTest
>     [junit] Tests run: 6, Failures: 0, Errors: 0, Time elapsed: 0.489 sec
>     [junit] Running org.apache.axis2.addressing.EndpointReferenceHelperTest
>     [junit] Tests run: 2, Failures: 0, Errors: 0, Time elapsed: 0.419 sec
>     [junit] Running org.apache.axis2.addressing.EndpointReferenceTypeTest
>     [junit] Tests run: 4, Failures: 0, Errors: 0, Time elapsed: 0.407 sec
>     [junit] Running org.apache.axis2.addressing.miheaders.RelatesToTest
>     [junit] Tests run: 3, Failures: 0, Errors: 0, Time elapsed: 0.355 sec
>     [junit] Running org.apache.axis2.addressing.wsdl.WSDL11ActionHelperTest
>     [junit] Tests run: 8, Failures: 0, Errors: 0, Time elapsed: 0.818 sec
>     [junit] Running org.apache.axis2.context.ContextHierarchyTest
>     [junit] Tests run: 2, Failures: 0, Errors: 0, Time elapsed: 0.845 sec
>     [junit] Running org.apache.axis2.context.OperationContextTest
>     [junit] Tests run: 1, Failures: 0, Errors: 0, Time elapsed: 0.811 sec
>     [junit] Running org.apache.axis2.deployment.AddingObserverTest
>     [junit] Tests run: 1, Failures: 0, Errors: 0, Time elapsed: 0.966 sec
>     [junit] Running org.apache.axis2.deployment.AxisMessageTest
>     [junit] Tests run: 1, Failures: 0, Errors: 0, Time elapsed: 1.301 sec
>     [junit] Running org.apache.axis2.deployment.BadModuleTest
>     [junit] Tests run: 1, Failures: 0, Errors: 0, Time elapsed: 0.652 sec
>     [junit] Running org.apache.axis2.deployment.BuildERWithDeploymentTest
>     [junit] Tests run: 1, Failures: 0, Errors: 0, Time elapsed: 1.226 sec
>     [junit] Running org.apache.axis2.deployment.BuilderSelectorDeploymentTest
>     [junit] Tests run: 2, Failures: 0, Errors: 0, Time elapsed: 1.346 sec
>     [junit] Running org.apache.axis2.deployment.DeploymentTotalTest
>     [junit] Tests run: 1, Failures: 0, Errors: 0, Time elapsed: 1.205 sec
>     [junit] Running org.apache.axis2.deployment.MessageFormatterDeploymentTest
>     [junit] Tests run: 2, Failures: 0, Errors: 0, Time elapsed: 1.193 sec
>     [junit] Running org.apache.axis2.deployment.ModifiedConfigFileTest
>     [junit] Tests run: 1, Failures: 0, Errors: 0, Time elapsed: 0.771 sec
>     [junit] Running org.apache.axis2.deployment.ModuleDisengagementTest
>     [junit] Tests run: 7, Failures: 0, Errors: 0, Time elapsed: 1.359 sec
>     [junit] Running org.apache.axis2.deployment.ModuleversionTest
>     [junit] Tests run: 2, Failures: 0, Errors: 0, Time elapsed: 0.762 sec
>     [junit] Running org.apache.axis2.deployment.OperationExcludeTest
>     [junit] Tests run: 1, Failures: 0, Errors: 0, Time elapsed: 1.376 sec
>     [junit] Running org.apache.axis2.deployment.SameServiceAddingTest
>     [junit] Tests run: 1, Failures: 0, Errors: 0, Time elapsed: 0.84 sec
>     [junit] Running org.apache.axis2.deployment.ServiceGroupTest
>     [junit] Tests run: 1, Failures: 0, Errors: 0, Time elapsed: 1.516 sec
>     [junit] Running org.apache.axis2.deployment.SystemPhasesremovedTest
>     [junit] Tests run: 1, Failures: 0, Errors: 0, Time elapsed: 0.721 sec
>     [junit] Running org.apache.axis2.deployment.TransportDeploymentTest
>     [junit] Tests run: 1, Failures: 0, Errors: 0, Time elapsed: 1.148 sec
>     [junit] Running org.apache.axis2.description.RegistryTest
>     [junit] Tests run: 5, Failures: 0, Errors: 0, Time elapsed: 0.903 sec
>     [junit] Running org.apache.axis2.description.WSDLToAllServicesBuilderTest
>     [junit] Tests run: 2, Failures: 0, Errors: 0, Time elapsed: 3.971 sec
>     [junit] Running org.apache.axis2.dispatchers.ActionBasedOperationDispatchTest
>     [junit] Tests run: 1, Failures: 0, Errors: 0, Time elapsed: 0.708 sec
>     [junit] Running org.apache.axis2.dispatchers.RelatesToBasedOperationDispatcherTest
>     [junit] Tests run: 1, Failures: 0, Errors: 0, Time elapsed: 0.735 sec
>     [junit] Running org.apache.axis2.dispatchers.RelatesToBasedServiceDispatcherTest
>     [junit] Tests run: 1, Failures: 0, Errors: 0, Time elapsed: 0.75 sec
>     [junit] Running org.apache.axis2.dispatchers.RequestURIBasedOperationDispatcherTest
>     [junit] Tests run: 1, Failures: 0, Errors: 0, Time elapsed: 0.756 sec
>     [junit] Running org.apache.axis2.dispatchers.RequestURIBasedServiceDispatcherTest
>     [junit] Tests run: 1, Failures: 0, Errors: 0, Time elapsed: 0.504 sec
>     [junit] Running org.apache.axis2.dispatchers.SOAPMessageBodyBasedOperationDispatcherTest
>     [junit] Tests run: 1, Failures: 0, Errors: 0, Time elapsed: 0.902 sec
>     [junit] Running org.apache.axis2.dispatchers.SOAPMessageBodyBasedServiceDispatcherTest
>     [junit] Tests run: 1, Failures: 0, Errors: 0, Time elapsed: 0.519 sec
>     [junit] Running org.apache.axis2.engine.EnginePausingTest
>     [junit] Tests run: 1, Failures: 0, Errors: 0, Time elapsed: 0.798 sec
>     [junit] Running org.apache.axis2.engine.MessageContextChangeTest
>     [junit] Tests run: 1, Failures: 0, Errors: 0, Time elapsed: 0.421 sec
>     [junit] Running org.apache.axis2.engine.MessageContextSaveATest
>     [junit] Tests run: 4, Failures: 0, Errors: 0, Time elapsed: 0.841 sec
>     [junit] Running org.apache.axis2.engine.MessageContextSaveBTest
>     [junit] Tests run: 1, Failures: 0, Errors: 0, Time elapsed: 0.734 sec
>     [junit] Running org.apache.axis2.engine.MessageContextSaveCTest
>     [junit] Tests run: 2, Failures: 0, Errors: 0, Time elapsed: 1.131 sec
>     [junit] Running org.apache.axis2.engine.MessageContextSelfManagedDataTest
>     [junit] Tests run: 10, Failures: 0, Errors: 0, Time elapsed: 1.391 sec
>     [junit] Running org.apache.axis2.engine.MessageContextTest
>     [junit] Tests run: 1, Failures: 0, Errors: 0, Time elapsed: 0.535 sec
>     [junit] Running org.apache.axis2.engine.ModuleConfigTest
>     [junit] Tests run: 2, Failures: 0, Errors: 0, Time elapsed: 1.181 sec
>     [junit] Running org.apache.axis2.engine.ModuleEngageTest
>     [junit] Tests run: 1, Failures: 0, Errors: 0, Time elapsed: 1.191 sec
>     [junit] Running org.apache.axis2.engine.ObjectSaveTest
>     [junit] Tests run: 5, Failures: 0, Errors: 0, Time elapsed: 0.705 sec
>     [junit] Running org.apache.axis2.engine.OperationContextSaveTest
>     [junit] Tests run: 1, Failures: 0, Errors: 0, Time elapsed: 0.741 sec
>     [junit] Running org.apache.axis2.engine.OptionsSaveTest
>     [junit] Tests run: 1, Failures: 0, Errors: 0, Time elapsed: 0.924 sec
>     [junit] Running org.apache.axis2.engine.ParameterAddTest
>     [junit] Tests run: 4, Failures: 0, Errors: 0, Time elapsed: 0.708 sec
>     [junit] Running org.apache.axis2.engine.SOAPActionBasedDispatcherTest
>     [junit] Tests run: 4, Failures: 0, Errors: 0, Time elapsed: 0.731 sec
>     [junit] Running org.apache.axis2.java.security.driver.Java2SecTest
>     [junit] Tests run: 9, Failures: 0, Errors: 0, Time elapsed: 0.399 sec
>     [junit] Running org.apache.axis2.misc.MiscTest
>     [junit] Tests run: 1, Failures: 0, Errors: 0, Time elapsed: 0.331 sec
>     [junit] Running org.apache.axis2.phaserule.AddingHandlerToEachPhaseTest
>     [junit] Tests run: 3, Failures: 0, Errors: 0, Time elapsed: 0.389 sec
>     [junit] Running org.apache.axis2.phaserule.BeforeAfterTest
>     [junit] Tests run: 1, Failures: 0, Errors: 0, Time elapsed: 0.369 sec
>     [junit] Running org.apache.axis2.phaserule.BeforeTest
>     [junit] Tests run: 1, Failures: 0, Errors: 0, Time elapsed: 0.568 sec
>     [junit] Running org.apache.axis2.phaserule.BeforeWithNoFirstHandlerTest
>     [junit] Tests run: 1, Failures: 0, Errors: 0, Time elapsed: 0.472 sec
>     [junit] Running org.apache.axis2.phaserule.InvalidPhaseFirstRulesTest
>     [junit] Tests run: 1, Failures: 0, Errors: 0, Time elapsed: 0.431 sec
>     [junit] Running org.apache.axis2.phaserule.InvalidPhaseFirstTest
>     [junit] Tests run: 1, Failures: 0, Errors: 0, Time elapsed: 0.451 sec
>     [junit] Running org.apache.axis2.phaserule.InvalidPhaseLastRuleTest
>     [junit] Tests run: 1, Failures: 0, Errors: 0, Time elapsed: 0.441 sec
>     [junit] Running org.apache.axis2.phaserule.InvalidPhaseRuleTest
>     [junit] Tests run: 2, Failures: 0, Errors: 0, Time elapsed: 0.413 sec
>     [junit] Running org.apache.axis2.phaserule.InvalidPhaselastTest
>     [junit] Tests run: 1, Failures: 0, Errors: 0, Time elapsed: 0.444 sec
>     [junit] Running org.apache.axis2.phaserule.PhaseFirstTest
>     [junit] Tests run: 1, Failures: 0, Errors: 0, Time elapsed: 0.367 sec
>     [junit] Running org.apache.axis2.phaserule.PhaseLastTest
>     [junit] Tests run: 1, Failures: 0, Errors: 0, Time elapsed: 0.372 sec
>     [junit] Running org.apache.axis2.phaserule.PhaseRuleTest
>     [junit] Tests run: 1, Failures: 0, Errors: 0, Time elapsed: 0.412 sec
>     [junit] Running org.apache.axis2.phaserule.PreDispatchPhaseRuleTest
>     [junit] Tests run: 1, Failures: 0, Errors: 0, Time elapsed: 0.38 sec
>     [junit] Running org.apache.axis2.phaserule.SingleHandlerPhaseTest
>     [junit] Tests run: 1, Failures: 0, Errors: 0, Time elapsed: 0.436 sec
>     [junit] Running org.apache.axis2.transport.tcp.TCPTransportTest
>     [junit] Tests run: 1, Failures: 0, Errors: 0, Time elapsed: 0.323 sec
>     [junit] Running org.apache.axis2.util.ThreadContextMigratorTest
>     [junit] Tests run: 2, Failures: 0, Errors: 0, Time elapsed: 0.429 sec
>
> jar:jar:
>     [copy] Copying 1 file to /export/home/illsleyd/continuum/continuum-1.0.3/apps/continuum/working-directory/1/modules/kernel/target/classes/org/apache/axis2/i18n
>     [jar] Building jar: /export/home/illsleyd/continuum/continuum-1.0.3/apps/continuum/working-directory/1/modules/kernel/target/axis2-kernel-SNAPSHOT.jar
>
> jar:install:
>     [echo] Installing...
> Uploading to org.apache.axis2/jars/axis2-kernel-SNAPSHOT.jar:
> .................... (831K)
> Uploading to org.apache.axis2/poms/axis2-kernel-SNAPSHOT.pom:
> .................... (15K)
>
> +----------------------------------------
> | Executing multiproject:install-callback Apache Axis 2.0 - Data Binding
> | Memory: 14M/31M
> +----------------------------------------
> DEPRECATED: the default goal should be specified in the <build> section of project.xml instead of maven.xml
> DEPRECATED: the default goal should be specified in the <build> section of project.xml instead of maven.xml
>
> build:end:
>
> Trying to get missing/snapshot dependencies required by Apache Axis 2.0 - Data Binding:
> Attempting to download axiom-dom-SNAPSHOT.jar.
> Skipping download as local copy is up to date!
> Attempting to download axis2-kernel-SNAPSHOT.jar.
> Skipping download as local copy is up to date!
> build:start:
>
> multiproject:install-callback:
>     [echo] Running jar:install for Apache Axis 2.0 - Data Binding
> java:prepare-filesystem:
>     [mkdir] Created dir: /export/home/illsleyd/continuum/continuum-1.0.3/apps/continuum/working-directory/1/modules/adb/target/classes
> Running post goal: java:prepare-filesystem
>
> java:compile:
>     [echo] Compiling to /export/home/illsleyd/continuum/continuum-1.0.3/apps/continuum/working-directory/1/modules/adb/target/classes
>     [javac] Compiling 62 source files to /export/home/illsleyd/continuum/continuum-1.0.3/apps/continuum/working-directory/1/modules/adb/target/classes
>
> java:jar-resources:
> Copying 1 file to /export/home/illsleyd/continuum/continuum-1.0.3/apps/continuum/working-directory/1/modules/adb/target/classes
> Copying 2 files to /export/home/illsleyd/continuum/continuum-1.0.3/apps/continuum/working-directory/1/modules/adb/target/classes/META-INF
>
> test:test:
> java:prepare-filesystem:
> Running post goal: java:prepare-filesystem
>
> java:compile:
>     [echo] Compiling to /export/home/illsleyd/continuum/continuum-1.0.3/apps/continuum/working-directory/1/modules/adb/target/classes
>
> java:jar-resources:
>
> test:prepare-filesystem:
>     [mkdir] Created dir: /export/home/illsleyd/continuum/continuum-1.0.3/apps/continuum/working-directory/1/modules/adb/target/test-classes
>     [mkdir] Created dir: /export/home/illsleyd/continuum/continuum-1.0.3/apps/continuum/working-directory/1/modules/adb/target/test-reports
>
> test:test-resources:
> Copying 1 file to /export/home/illsleyd/continuum/continuum-1.0.3/apps/continuum/working-directory/1/modules/adb/target/test-classes
> Copying 1 file to /export/home/illsleyd/continuum/continuum-1.0.3/apps/continuum/working-directory/1/modules/adb/target/test-classes
>
> test:compile:
>     [javac] Compiling 9 source files to /export/home/illsleyd/continuum/continuum-1.0.3/apps/continuum/working-directory/1/modules/adb/target/test-classes
>
>     [junit] Running org.apache.axis2.databinding.ADBSOAPModelBuilderTest
>     [junit] Tests run: 5, Failures: 0, Errors: 0, Time elapsed: 0.871 sec
>     [junit] Running org.apache.axis2.databinding.utils.NamedStaxOMBuilderTest
>     [junit] Tests run: 2, Failures: 0, Errors: 0, Time elapsed: 0.515 sec
>     [junit] Running org.apache.axis2.databinding.utils.SimpleArrayReaderStateMachineTest
>     [junit] Tests run: 4, Failures: 0, Errors: 0, Time elapsed: 0.473 sec
>     [junit] Running org.apache.axis2.databinding.utils.SimpleElementReaderStateMachineTest
>     [junit] Tests run: 3, Failures: 0, Errors: 0, Time elapsed: 0.483 sec
>     [junit] Running org.apache.axis2.databinding.utils.reader.ADBXMLStreamReaderTest
>     [junit] Tests run: 15, Failures: 0, Errors: 0, Time elapsed: 0.734 sec
>
> jar:jar:
>     [jar] Building jar: /export/home/illsleyd/continuum/continuum-1.0.3/apps/continuum/working-directory/1/modules/adb/target/axis2-adb-SNAPSHOT.jar
>
> jar:install:
>     [echo] Installing...
> Uploading to org.apache.axis2/jars/axis2-adb-SNAPSHOT.jar:
> .................... (137K)
> Uploading to org.apache.axis2/poms/axis2-adb-SNAPSHOT.pom:
> .................... (14K)
>
> +----------------------------------------
> | Executing multiproject:install-callback Apache Axis 2.0 - Code Generation
> | Memory: 19M/29M
> +----------------------------------------
> DEPRECATED: the default goal should be specified in the <build> section of project.xml instead of maven.xml
> DEPRECATED: the default goal should be specified in the <build> section of project.xml instead of maven.xml
>
> build:end:
>
> Trying to get missing/snapshot dependencies required by Apache Axis 2.0 - Code Generation:
> Attempting to download axis2-adb-SNAPSHOT.jar.
> Skipping download as local copy is up to date!
> build:start:
>
> multiproject:install-callback:
>     [echo] Running jar:install for Apache Axis 2.0 - Code Generation
> java:prepare-filesystem:
>     [mkdir] Created dir: /export/home/illsleyd/continuum/continuum-1.0.3/apps/continuum/working-directory/1/modules/codegen/target/classes
> Running post goal: java:prepare-filesystem
>
> java:compile:
>     [echo] Compiling to /export/home/illsleyd/continuum/continuum-1.0.3/apps/continuum/working-directory/1/modules/codegen/target/classes
>     [javac] Compiling 69 source files to /export/home/illsleyd/continuum/continuum-1.0.3/apps/continuum/working-directory/1/modules/codegen/target/classes
>
> java:jar-resources:
> Copying 33 files to /export/home/illsleyd/continuum/continuum-1.0.3/apps/continuum/working-directory/1/modules/codegen/target/classes
> Copying 2 files to /export/home/illsleyd/continuum/continuum-1.0.3/apps/continuum/working-directory/1/modules/codegen/target/classes/META-INF
> Running post goal: java:jar-resources
>
> test:test:
> java:prepare-filesystem:
> Running post goal: java:prepare-filesystem
>
> java:compile:
>     [echo] Compiling to /export/home/illsleyd/continuum/continuum-1.0.3/apps/continuum/working-directory/1/modules/codegen/target/classes
>
> java:jar-resources:
> Running post goal: java:jar-resources
>
> test:prepare-filesystem:
>     [mkdir] Created dir: /export/home/illsleyd/continuum/continuum-1.0.3/apps/continuum/working-directory/1/modules/codegen/target/test-classes
>     [mkdir] Created dir: /export/home/illsleyd/continuum/continuum-1.0.3/apps/continuum/working-directory/1/modules/codegen/target/test-reports
>
> test:test-resources:
> Copying 6 files to /export/home/illsleyd/continuum/continuum-1.0.3/apps/continuum/working-directory/1/modules/codegen/target/test-classes
> Copying 31 files to /export/home/illsleyd/continuum/continuum-1.0.3/apps/continuum/working-directory/1/modules/codegen/target/test-classes
>
> test:compile:
>     [javac] Compiling 2 source files to /export/home/illsleyd/continuum/continuum-1.0.3/apps/continuum/working-directory/1/modules/codegen/target/test-classes
>
>     [junit] Running org.apache.axis2.wsdl.WSDLServiceBuilderTest
>     [junit] Tests run: 1, Failures: 0, Errors: 0, Time elapsed: 3.949 sec
>     [junit] Running org.apache.axis2.wsdl.codegen.extension.SchemaUnwrapperExtensionTest
>     [junit] Tests run: 4, Failures: 0, Errors: 0, Time elapsed: 0.772 sec
>
> jar:jar:
>     [jar] Building jar: /export/home/illsleyd/continuum/continuum-1.0.3/apps/continuum/working-directory/1/modules/codegen/target/axis2-codegen-SNAPSHOT.jar
>
> jar:install:
>     [echo] Installing...
> Uploading to org.apache.axis2/jars/axis2-codegen-SNAPSHOT.jar:
> .................... (178K)
> Uploading to org.apache.axis2/poms/axis2-codegen-SNAPSHOT.pom:
> .................... (17K)
>
> +----------------------------------------
> | Executing multiproject:install-callback Apache Axis 2.0 - ADB Codegen
> | Memory: 22M/33M
> +----------------------------------------
> DEPRECATED: the default goal should be specified in the <build> section of project.xml instead of maven.xml
> DEPRECATED: the default goal should be specified in the <build> section of project.xml instead of maven.xml
>
> build:end:
>
> Trying to get missing/snapshot dependencies required by Apache Axis 2.0 - ADB Codegen:
> Attempting to download axis2-codegen-SNAPSHOT.jar.
> Skipping download as local copy is up to date!
> build:start:
>
> multiproject:install-callback:
>     [echo] Running jar:install for Apache Axis 2.0 - ADB Codegen
> java:prepare-filesystem:
>     [mkdir] Created dir: /export/home/illsleyd/continuum/continuum-1.0.3/apps/continuum/working-directory/1/modules/adb-codegen/target/classes
> Running post goal: java:prepare-filesystem
>
> java:compile:
>     [echo] Compiling to /export/home/illsleyd/continuum/continuum-1.0.3/apps/continuum/working-directory/1/modules/adb-codegen/target/classes
>     [javac] Compiling 17 source files to /export/home/illsleyd/continuum/continuum-1.0.3/apps/continuum/working-directory/1/modules/adb-codegen/target/classes
>
> java:jar-resources:
> Copying 8 files to /export/home/illsleyd/continuum/continuum-1.0.3/apps/continuum/working-directory/1/modules/adb-codegen/target/classes
> Copying 2 files to /export/home/illsleyd/continuum/continuum-1.0.3/apps/continuum/working-directory/1/modules/adb-codegen/target/classes/META-INF
>
> test:test:
> java:prepare-filesystem:
> Running post goal: java:prepare-filesystem
>
> java:compile:
>     [echo] Compiling to /export/home/illsleyd/continuum/continuum-1.0.3/apps/continuum/working-directory/1/modules/adb-codegen/target/classes
>
> java:jar-resources:
>
> test:prepare-filesystem:
>     [mkdir] Created dir: /export/home/illsleyd/continuum/continuum-1.0.3/apps/continuum/working-directory/1/modules/adb-codegen/target/test-classes
>     [mkdir] Created dir: /export/home/illsleyd/continuum/continuum-1.0.3/apps/continuum/working-directory/1/modules/adb-codegen/target/test-reports
>
> test:test-resources:
> Copying 35 files to /export/home/illsleyd/continuum/continuum-1.0.3/apps/continuum/working-directory/1/modules/adb-codegen/target/test-classes
> Copying 8 files to /export/home/illsleyd/continuum/continuum-1.0.3/apps/continuum/working-directory/1/modules/adb-codegen/target/test-classes
>
> test:compile:
>     [mkdir] Created dir: /export/home/illsleyd/continuum/continuum-1.0.3/apps/continuum/working-directory/1/modules/adb-codegen/target/schema
>     [mkdir] Created dir: /export/home/illsleyd/continuum/continuum-1.0.3/apps/continuum/working-directory/1/modules/adb-codegen/target/schema/src
>     [mkdir] Created dir: /export/home/illsleyd/continuum/continuum-1.0.3/apps/continuum/working-directory/1/modules/adb-codegen/target/schema/classes
>     [echo] Compiling simple_maxOccurs2.xsd
>     [echo] Compiling anonymous_complexType.xsd
>     [echo] Compiling simple_choice.xsd
>     [echo] Compiling simple_particle_all.xsd
>     [echo] Compiling simple_maxOccurs.xsd
>     [echo] Compiling simple_anytype.xsd
>     [echo] Compiling simple-minoccurs0.xsd
>     [echo] Compiling complex-minoccurs0.xsd
>     [echo] Compiling simple-recursive-datatypes.xsd
>     [echo] Compiling mixed_minoccus0.xsd
>     [echo] Compiling complete.xsd
>     [echo] Compiling simpleExtension.xsd
>     [echo] Compiling union.xsd
>     [echo] Compiling all.xsd
>     [echo] Compiling enumeration.xsd
>     [echo] Compiling restrictions.xsd
>     [echo] Compiling choice.xsd
>     [echo] Compiling list.xsd
>     [javac] Compiling 178 source files to /export/home/illsleyd/continuum/continuum-1.0.3/apps/continuum/working-directory/1/modules/adb-codegen/target/schema/classes
>     [javac] Note: Some input files use unchecked or unsafe operations.
>     [javac] Note: Recompile with -Xlint:unchecked for details.
>     [javac] Compiling 79 source files to /export/home/illsleyd/continuum/continuum-1.0.3/apps/continuum/working-directory/1/modules/adb-codegen/target/test-classes
>
>     [junit] Running org.apache.axis2.schema.all.AllTest
>     [junit] Tests run: 1, Failures: 0, Errors: 0, Time elapsed: 0.618 sec
>     [junit] Running org.apache.axis2.schema.choice.ChiceTest
>     [junit] Tests run: 1, Failures: 0, Errors: 0, Time elapsed: 0.575 sec
>     [junit] Running org.apache.axis2.schema.compile.AnonymousComplexTypeTest
>     [junit] Tests run: 1, Failures: 0, Errors: 0, Time elapsed: 6.9 sec
>     [junit] Running org.apache.axis2.schema.compile.ComplexAllTest
>     [junit] Tests run: 1, Failures: 0, Errors: 0, Time elapsed: 4.476 sec
>     [junit] Running org.apache.axis2.schema.compile.ComplexExtensionTest
>     [junit] Tests run: 1, Failures: 0, Errors: 0, Time elapsed: 3.832 sec
>     [junit] Running org.apache.axis2.schema.compile.ImportTest
>     [junit] Tests run: 1, Failures: 0, Errors: 0, Time elapsed: 3.711 sec
>     [junit] Running org.apache.axis2.schema.compile.RecursiveCompileTest
>     [junit] Tests run: 1, Failures: 0, Errors: 0, Time elapsed: 3.765 sec
>     [junit] Running org.apache.axis2.schema.compile.SimpleAnyAttribTest
>     [junit] Tests run: 1, Failures: 0, Errors: 0, Time elapsed: 3.29 sec
>     [junit] Running org.apache.axis2.schema.compile.SimpleAnyTest
>     [junit] Tests run: 1, Failures: 0, Errors: 0, Time elapsed: 4.623 sec
>     [junit] Running org.apache.axis2.schema.compile.SimpleAnyTypeTest
>     [junit] Tests run: 1, Failures: 0, Errors: 0, Time elapsed: 3.117 sec
>     [junit] Running org.apache.axis2.schema.compile.SimpleAttributeTest
>     [junit] Tests run: 1, Failures: 0, Errors: 0, Time elapsed: 3.9 sec
>     [junit] Running org.apache.axis2.schema.compile.SimpleChoiceTest
>     [junit] Tests run: 1, Failures: 0, Errors: 0, Time elapsed: 3.69 sec
>     [junit] Running org.apache.axis2.schema.compile.SimpleContentExtensionTest
>     [junit] Tests run: 1, Failures: 0, Errors: 0, Time elapsed: 3.951 sec
>     [junit] Running org.apache.axis2.schema.compile.SimpleElementReferenceTest
>     [junit] Tests run: 1, Failures: 0, Errors: 0, Time elapsed: 3.42 sec
>     [junit] Running org.apache.axis2.schema.compile.SimpleElementTest
>     [junit] Tests run: 1, Failures: 0, Errors: 0, Time elapsed: 3.515 sec
>     [junit] Running org.apache.axis2.schema.compile.SimpleParticleAllTest
>     [junit] Tests run: 1, Failures: 0, Errors: 0, Time elapsed: 4.641 sec
>     [junit] Running org.apache.axis2.schema.compile.SimpleRestrictionTest
>     [junit] Tests run: 1, Failures: 0, Errors: 0, Time elapsed: 3.418 sec
>     [junit] Running org.apache.axis2.schema.compile.SimpleSequence2Test
>     [junit] Tests run: 1, Failures: 0, Errors: 0, Time elapsed: 4.236 sec
>     [junit] Running org.apache.axis2.schema.compile.SimpleSequenceTest
>     [junit] Tests run: 1, Failures: 0, Errors: 0, Time elapsed: 3.032 sec
>     [junit] Running org.apache.axis2.schema.compile.XmlMaxOccurs2Test
>     [junit] Tests run: 1, Failures: 0, Errors: 0, Time elapsed: 3.583 sec
>     [junit] Running org.apache.axis2.schema.compile.XmlmaxOccursTest
>     [junit] Tests run: 1, Failures: 0, Errors: 0, Time elapsed: 3.716 sec
>     [junit] Running org.apache.axis2.schema.compile.simple.SimpleTypeAllCompileTest
>     [junit] Tests run: 1, Failures: 0, Errors: 0, Time elapsed: 3.869 sec
>     [junit] Running org.apache.axis2.schema.enumeration.EnumerationTest
>     [junit] Tests run: 1, Failures: 0, Errors: 0, Time elapsed: 0.772 sec
>     [junit] Running org.apache.axis2.schema.extension.ComplexExtenstionTest
>     [junit] Tests run: 1, Failures: 0, Errors: 0, Time elapsed: 0.665 sec
>     [junit] Running org.apache.axis2.schema.extension.SimpleExtensionTest
>     [junit] Tests run: 1, Failures: 0, Errors: 0, Time elapsed: 0.588 sec
>     [junit] Running org.apache.axis2.schema.list.ListTest
>     [junit] Tests run: 4, Failures: 0, Errors: 0, Time elapsed: 0.602 sec
>     [junit] Running org.apache.axis2.schema.populate.derived.DerivedTypeBytePopulateTest
>     [junit] Tests run: 1, Failures: 0, Errors: 0, Time elapsed: 0.718 sec
>     [junit] Running org.apache.axis2.schema.populate.derived.DerivedTypeIntPopulateTest
>     [junit] Tests run: 1, Failures: 0, Errors: 0, Time elapsed: 0.739 sec
>     [junit] Running org.apache.axis2.schema.populate.derived.DerivedTypeIntegerPopulateTest
>     [junit] Tests run: 1, Failures: 0, Errors: 0, Time elapsed: 0.937 sec
>     [junit] Running org.apache.axis2.schema.populate.derived.DerivedTypeLongPopulateTest
>     [junit] Tests run: 1, Failures: 0, Errors: 0, Time elapsed: 0.956 sec
>     [junit] Running org.apache.axis2.schema.populate.derived.DerivedTypeNegativeIntegerPopulateTest
>     [junit] Tests run: 1, Failures: 0, Errors: 0, Time elapsed: 0.729 sec
>     [junit] Running org.apache.axis2.schema.populate.derived.DerivedTypeNonNegativeIntegerPopulateTest
>     [junit] Tests run: 1, Failures: 0, Errors: 0, Time elapsed: 0.743 sec
>     [junit] Running org.apache.axis2.schema.populate.derived.DerivedTypeNonPositiveIntegerPopulateTest
>     [junit] Tests run: 1, Failures: 0, Errors: 0, Time elapsed: 0.698 sec
>     [junit] Running org.apache.axis2.schema.populate.derived.DerivedTypePositveIntegerPopulateTest
>     [junit] Tests run: 1, Failures: 0, Errors: 0, Time elapsed: 0.699 sec
>     [junit] Running org.apache.axis2.schema.populate.derived.DerivedTypeShortPopulateTest
>     [junit] Tests run: 1, Failures: 0, Errors: 0, Time elapsed: 0.769 sec
>     [junit] Running org.apache.axis2.schema.populate.derived.DerivedTypeUnsignedBytePopulateTest
>     [junit] Tests run: 1, Failures: 0, Errors: 0, Time elapsed: 0.76 sec
>     [junit] Running org.apache.axis2.schema.populate.derived.DerivedTypeUnsignedIntPopulateTest
>     [junit] Tests run: 1, Failures: 0, Errors: 0, Time elapsed: 1.024 sec
>     [junit] Running org.apache.axis2.schema.populate.derived.DerivedTypeUnsignedLongPopulateTest
>     [junit] Tests run: 1, Failures: 0, Errors: 0, Time elapsed: 0.895 sec
>     [junit] Running org.apache.axis2.schema.populate.derived.DerivedTypeUnsignedShortPopulateTest
>     [junit] Tests run: 1, Failures: 0, Errors: 0, Time elapsed: 0.719 sec
>     [junit] Running org.apache.axis2.schema.populate.other.ADBInOutTest
>     [junit] Tests run: 2, Failures: 0, Errors: 0, Time elapsed: 0.541 sec
>     [junit] Running org.apache.axis2.schema.populate.other.PopulateAnonComplexTypeTest
>     [junit] Tests run: 1, Failures: 0, Errors: 0, Time elapsed: 0.526 sec
>     [junit] Running org.apache.axis2.schema.populate.other.PopulateAnyTypeTest
>     [junit] Tests run: 1, Failures: 0, Errors: 0, Time elapsed: 0.53 sec
>     [junit] Running org.apache.axis2.schema.populate.other.PopulateArrayInArrayTest
>     [junit] Tests run: 1, Failures: 0, Errors: 0, Time elapsed: 0.528 sec
>     [junit] Running org.apache.axis2.schema.populate.other.PopulateArrayTest
>     [junit] Tests run: 1, Failures: 0, Errors: 0, Time elapsed: 0.551 sec
>     [junit] Running org.apache.axis2.schema.populate.other.PopulateChoiceTest
>     [junit] Tests run: 1, Failures: 0, Errors: 0, Time elapsed: 0.691 sec
>     [junit] Running org.apache.axis2.schema.populate.other.PopulateComplexMinOccurs0Test
>     [junit] Tests run: 4, Failures: 0, Errors: 0, Time elapsed: 0.677 sec
>     [junit] Running org.apache.axis2.schema.populate.other.PopulateMinOccurs0Test
>     [junit] Tests run: 3, Failures: 0, Errors: 0, Time elapsed: 0.657 sec
>     [junit] Running org.apache.axis2.schema.populate.other.PopulateMixedMinoccurs0Test
>     [junit] Tests run: 2, Failures: 0, Errors: 0, Time elapsed: 0.601 sec
>     [junit] Running org.apache.axis2.schema.populate.other.PopulateParticleAllTest
>     [junit] Tests run: 1, Failures: 0, Errors: 0, Time elapsed: 0.633 sec
>     [junit] Running org.apache.axis2.schema.populate.other.PopulateRecursiveTest
>     [junit] Tests run: 1, Failures: 0, Errors: 0, Time elapsed: 0.517 sec
>     [junit] Running org.apache.axis2.schema.populate.simple.SimpleTypeAnyURIPopulateTest
>     [junit] Tests run: 1, Failures: 0, Errors: 0, Time elapsed: 0.519 sec
>     [junit] Running org.apache.axis2.schema.populate.simple.SimpleTypeBase64BinPopulateTest
>     [junit] Tests run: 1, Failures: 0, Errors: 0, Time elapsed: 0.537 sec
>     [junit] Running org.apache.axis2.schema.populate.simple.SimpleTypeBooleanPopulateTest
>     [junit] Tests run: 1, Failures: 0, Errors: 0, Time elapsed: 0.525 sec
>     [junit] Running org.apache.axis2.schema.populate.simple.SimpleTypeDatePopulateTest
>     [junit] Tests run: 1, Failures: 0, Errors: 0, Time elapsed: 0.839 sec
>     [junit] Running org.apache.axis2.schema.populate.simple.SimpleTypeDateTimePopulateTest
>     [junit] Tests run: 1, Failures: 0, Errors: 0, Time elapsed: 0.568 sec
>     [junit] Running org.apache.axis2.schema.populate.simple.SimpleTypeDayPopulateTest
>     [junit] Tests run: 1, Failures: 0, Errors: 0, Time elapsed: 0.527 sec
>     [junit] Running org.apache.axis2.schema.populate.simple.SimpleTypeDoublePopulateTest
>     [junit] Tests run: 1, Failures: 0, Errors: 0, Time elapsed: 0.534 sec
>     [junit] Running org.apache.axis2.schema.populate.simple.SimpleTypeDurationPopulateTest
>     [junit] Tests run: 1, Failures: 0, Errors: 0, Time elapsed: 0.533 sec
>     [junit] Running org.apache.axis2.schema.populate.simple.SimpleTypeFloatPopulateTest
>     [junit] Tests run: 1, Failures: 0, Errors: 0, Time elapsed: 0.532 sec
>     [junit] Running org.apache.axis2.schema.populate.simple.SimpleTypeHexBinaryPopulateTest
>     [junit] Tests run: 1, Failures: 0, Errors: 0, Time elapsed: 0.538 sec
>     [junit] Running org.apache.axis2.schema.populate.simple.SimpleTypeMonthDayPopulateTest
>     [junit] Tests run: 1, Failures: 0, Errors: 0, Time elapsed: 0.513 sec
>     [junit] Running org.apache.axis2.schema.populate.simple.SimpleTypeQNamePopulateTest
>     [junit] Tests run: 1, Failures: 0, Errors: 0, Time elapsed: 0.53 sec
>     [junit] Running org.apache.axis2.schema.populate.simple.SimpleTypeTimePopulateTest
>     [junit] Tests run: 1, Failures: 0, Errors: 0, Time elapsed: 0.735 sec
>     [junit] Running org.apache.axis2.schema.populate.simple.SimpleTypegMonthPopulateTest
>     [junit] Tests run: 1, Failures: 0, Errors: 0, Time elapsed: 0.539 sec
>     [junit] Running org.apache.axis2.schema.populate.simple.SimpleTypegYearMonthPopulateTest
>     [junit] Tests run: 1, Failures: 0, Errors: 0, Time elapsed: 0.559 sec
>     [junit] Running org.apache.axis2.schema.populate.simple.SimpleTypegYearPopulateTest
>     [junit] Tests run: 1, Failures: 0, Errors: 0, Time elapsed: 0.516 sec
>     [junit] Running org.apache.axis2.schema.restriction.ComplexRestrictionTest
>     [junit] Tests run: 1, Failures: 0, Errors: 0, Time elapsed: 0.307 sec
>     [junit] Running org.apache.axis2.schema.restriction.SimpleRestrictionTest
>     [junit] Tests run: 4, Failures: 0, Errors: 0, Time elapsed: 0.611 sec
>     [junit] Running org.apache.axis2.schema.testsuite.AnyElementsTest
>     [junit] Tests run: 3, Failures: 0, Errors: 0, Time elapsed: 0.653 sec
>     [junit] Running org.apache.axis2.schema.testsuite.CustomElementsTest
>     [junit] Tests run: 3, Failures: 0, Errors: 0, Time elapsed: 0.629 sec
>     [junit] Running org.apache.axis2.schema.testsuite.IntElementsTest
>     [junit] Tests run: 3, Failures: 0, Errors: 0, Time elapsed: 0.736 sec
>     [junit] Running org.apache.axis2.schema.testsuite.OuterElementsTest
>     [junit] Tests run: 5, Failures: 0, Errors: 0, Time elapsed: 1.35 sec
>     [junit] Running org.apache.axis2.schema.testsuite.StringElementsTest
>     [junit] Tests run: 3, Failures: 0, Errors: 0, Time elapsed: 0.892 sec
>     [junit] Running org.apache.axis2.schema.testsuite.XsdAnyElementsTest
>     [junit] Tests run: 3, Failures: 0, Errors: 0, Time elapsed: 0.712 sec
>     [junit] Running org.apache.axis2.schema.union.UnionTest
>     [junit] Tests run: 4, Failures: 0, Errors: 0, Time elapsed: 0.617 sec
>
> jar:jar:
>     [jar] Building jar: /export/home/illsleyd/continuum/continuum-1.0.3/apps/continuum/working-directory/1/modules/adb-codegen/target/axis2-adb-codegen-SNAPSHOT.jar
>
> jar:install:
>     [echo] Installing...
> Uploading to org.apache.axis2/jars/axis2-adb-codegen-SNAPSHOT.jar:
> .................... (118K)
> Uploading to org.apache.axis2/poms/axis2-adb-codegen-SNAPSHOT.pom:
> .................... (15K)
>
> +----------------------------------------
> | Executing multiproject:install-callback Apache Axis 2.0 - Addressing
> | Memory: 30M/46M
> +----------------------------------------
> DEPRECATED: the default goal should be specified in the <build> section of project.xml instead of maven.xml
> DEPRECATED: the default goal should be specified in the <build> section of project.xml instead of maven.xml
>
> build:end:
>
> build:start:
>
> multiproject:install-callback:
>     [echo] Running jar:install for Apache Axis 2.0 - Addressing
> java:prepare-filesystem:
>     [mkdir] Created dir: /export/home/illsleyd/continuum/continuum-1.0.3/apps/continuum/working-directory/1/modules/addressing/target/classes
> Running post goal: java:prepare-filesystem
>
> java:compile:
>     [echo] Compiling to /export/home/illsleyd/continuum/continuum-1.0.3/apps/continuum/working-directory/1/modules/addressing/target/classes
>     [javac] Compiling 9 source files to /export/home/illsleyd/continuum/continuum-1.0.3/apps/continuum/working-directory/1/modules/addressing/target/classes
> Running post goal: java:compile
>     [mkdir] Created dir: /export/home/illsleyd/continuum/continuum-1.0.3/apps/continuum/working-directory/1/modules/addressing/target/classes/META-INF
>     [copy] Copying 1 file to /export/home/illsleyd/continuum/continuum-1.0.3/apps/continuum/working-directory/1/modules/addressing/target/classes/META-INF
>     [copy] Copying 1 file to /export/home/illsleyd/continuum/continuum-1.0.3/apps/continuum/working-directory/1/modules/addressing/target/classes/META-INF
>     [copy] Copying 1 file to /export/home/illsleyd/continuum/continuum-1.0.3/apps/continuum/working-directory/1/modules/addressing/target/classes/META-INF
>     [copy] Copying 1 file to /export/home/illsleyd/continuum/continuum-1.0.3/apps/continuum/working-directory/1/modules/addressing/target
>     [mkdir] Created dir: /export/home/illsleyd/continuum/continuum-1.0.3/apps/continuum/working-directory/1/modules/addressing/target/modules
>     [jar] Building jar: /export/home/illsleyd/continuum/continuum-1.0.3/apps/continuum/working-directory/1/modules/addressing/target/addressing-SNAPSHOT.mar
>     [copy] Copying 1 file to /export/home/illsleyd/continuum/continuum-1.0.3/apps/continuum/working-directory/1/modules/addressing/target/modules
>     [copy] Copying 1 file to /export/home/illsleyd/.maven/repository/org.apache.axis2/mars
>
> java:jar-resources:
> Copying 1 file to /export/home/illsleyd/continuum/continuum-1.0.3/apps/continuum/working-directory/1/modules/addressing/target/classes
>
> test:test:
> java:prepare-filesystem:
> Running post goal: java:prepare-filesystem
>
> java:compile:
>     [echo] Compiling to /export/home/illsleyd/continuum/continuum-1.0.3/apps/continuum/working-directory/1/modules/addressing/target/classes
> Running post goal: java:compile
>     [copy] Copying 1 file to /export/home/illsleyd/continuum/continuum-1.0.3/apps/continuum/working-directory/1/modules/addressing/target/classes/META-INF
>     [copy] Copying 1 file to /export/home/illsleyd/continuum/continuum-1.0.3/apps/continuum/working-directory/1/modules/addressing/target/classes/META-INF
>     [jar] Building jar: /export/home/illsleyd/continuum/continuum-1.0.3/apps/continuum/working-directory/1/modules/addressing/target/addressing-SNAPSHOT.mar
>
> java:jar-resources:
>
> test:prepare-filesystem:
>     [mkdir] Created dir: /export/home/illsleyd/continuum/continuum-1.0.3/apps/continuum/working-directory/1/modules/addressing/target/test-classes
>     [mkdir] Created dir: /export/home/illsleyd/continuum/continuum-1.0.3/apps/continuum/working-directory/1/modules/addressing/target/test-reports
>
> test:test-resources:
> Copying 35 files to /export/home/illsleyd/continuum/continuum-1.0.3/apps/continuum/working-directory/1/modules/addressing/target/test-classes
> Copying 2 files to /export/home/illsleyd/continuum/continuum-1.0.3/apps/continuum/working-directory/1/modules/addressing/target/test-classes
>
> test:compile:
>     [javac] Compiling 8 source files to /export/home/illsleyd/continuum/continuum-1.0.3/apps/continuum/working-directory/1/modules/addressing/target/test-classes
>     [javac] Note: /export/home/illsleyd/continuum/continuum-1.0.3/apps/continuum/working-directory/1/modules/addressing/test/org/apache/axis2/handlers/addressing/AddressingOutHandlerTest.java uses or overrides a deprecated API.
>     [javac] Note: Recompile with -Xlint:deprecation for details.
>
>     [junit] Running org.apache.axis2.addressing.AddressingFaultsTest
>     [junit] Tests run: 6, Failures: 0, Errors: 0, Time elapsed: 0.385 sec
>     [junit] Running org.apache.axis2.handlers.addressing.AddressingFinalInHandlerTest
>     [junit] Tests run: 17, Failures: 0, Errors: 0, Time elapsed: 0.693 sec
>     [junit] Running org.apache.axis2.handlers.addressing.AddressingInFaultHandlerTest
>     [junit] Tests run: 4, Failures: 0, Errors: 0, Time elapsed: 0.751 sec
>     [junit] Running org.apache.axis2.handlers.addressing.AddressingOutHandlerTest
>     [junit] Tests run: 6, Failures: 0, Errors: 0, Time elapsed: 1.253 sec
>     [junit] Running org.apache.axis2.handlers.addressing.AddressingSubmissionInHandlerTest
>     [junit] Tests run: 14, Failures: 0, Errors: 0, Time elapsed: 0.647 sec
>     [junit] Running org.apache.axis2.handlers.addressing.AddressingValidationHandlerTest
>     [junit] Tests run: 4, Failures: 0, Errors: 0, Time elapsed: 1.119 sec
>
> jar:jar:
>     [jar] Building jar: /export/home/illsleyd/continuum/continuum-1.0.3/apps/continuum/working-directory/1/modules/addressing/target/axis2-addressing-SNAPSHOT.jar
>
> jar:install:
>     [echo] Installing...
> Uploading to org.apache.axis2/jars/axis2-addressing-SNAPSHOT.jar:
> .................... (36K)
> Uploading to org.apache.axis2/poms/axis2-addressing-SNAPSHOT.pom:
> .................... (15K)
>
> +----------------------------------------
> | Executing multiproject:install-callback Apache Axis 2.0 - Samples
> | Memory: 35M/49M
> +----------------------------------------
> DEPRECATED: the default goal should be specified in the <build> section of project.xml instead of maven.xml
> DEPRECATED: the default goal should be specified in the <build> section of project.xml instead of maven.xml
>
> build:end:
>
> Trying to get missing/snapshot dependencies required by Apache Axis 2.0 - Samples:
> Attempting to download axis2-addressing-SNAPSHOT.jar.
> Skipping download as local copy is up to date!
> build:start:
>
> multiproject:install-callback:
>     [echo] Running jar:install for Apache Axis 2.0 - Samples
> java:prepare-filesystem:
>     [mkdir] Created dir: /export/home/illsleyd/continuum/continuum-1.0.3/apps/continuum/working-directory/1/modules/samples/target/classes
> Running post goal: java:prepare-filesystem
>
> java:compile:
>     [echo] Compiling to /export/home/illsleyd/continuum/continuum-1.0.3/apps/continuum/working-directory/1/modules/samples/target/classes
>     [javac] Compiling 5 source files to /export/home/illsleyd/continuum/continuum-1.0.3/apps/continuum/working-directory/1/modules/samples/target/classes
>
> java:jar-resources:
> Copying 2 files to /export/home/illsleyd/continuum/continuum-1.0.3/apps/continuum/working-directory/1/modules/samples/target/classes/META-INF
>
> test:test:
> java:prepare-filesystem:
> Running post goal: java:prepare-filesystem
>
> java:compile:
> Overriding previous definition of reference to samples.src.path
>     [echo] Compiling to /export/home/illsleyd/continuum/continuum-1.0.3/apps/continuum/working-directory/1/modules/samples/target/classes
>
> java:jar-resources:
>
> test:prepare-filesystem:
>     [mkdir] Created dir: /export/home/illsleyd/continuum/continuum-1.0.3/apps/continuum/working-directory/1/modules/samples/target/test-classes
>     [mkdir] Created dir: /export/home/illsleyd/continuum/continuum-1.0.3/apps/continuum/working-directory/1/modules/samples/target/test-reports
>
> test:test-resources:
>
> test:compile:
>
> Running post goal: test:test
> create-samples:
>     [mkdir] Created dir: /export/home/illsleyd/continuum/continuum-1.0.3/apps/continuum/working-directory/1/modules/samples/target/samples/userguide
>     [mkdir] Created dir: /export/home/illsleyd/continuum/continuum-1.0.3/apps/continuum/working-directory/1/modules/samples/target/samples/wsdl
>     [copy] Copying 2 files to /export/home/illsleyd/continuum/continuum-1.0.3/apps/continuum/working-directory/1/modules/samples/target/samples/wsdl
> userguide:
>     [mkdir] Created dir: /export/home/illsleyd/continuum/continuum-1.0.3/apps/continuum/working-directory/1/modules/samples/target/samples/userguide/src
>     [copy] Copying 22 files to /export/home/illsleyd/continuum/continuum-1.0.3/apps/continuum/working-directory/1/modules/samples/target/samples/userguide/src
>     [jar] Building MANIFEST-only jar: /export/home/illsleyd/continuum/continuum-1.0.3/apps/continuum/working-directory/1/modules/samples/target/samples/userguide/sample.jar
>
> googleSpellcheck:
>     [mkdir] Created dir: /export/home/illsleyd/continuum/continuum-1.0.3/apps/continuum/working-directory/1/modules/samples/target/googlespellcheck
>     [jar] Building MANIFEST-only jar: /export/home/illsleyd/continuum/continuum-1.0.3/apps/continuum/working-directory/1/modules/samples/target/googlespellcheck/googleSpellcheck.jar
>
> yahooRESTSearch:
>     [mkdir] Created dir: /export/home/illsleyd/continuum/continuum-1.0.3/apps/continuum/working-directory/1/modules/samples/target/yahoorestsearch
>     [jar] Building jar: /export/home/illsleyd/continuum/continuum-1.0.3/apps/continuum/working-directory/1/modules/samples/target/yahoorestsearch/yahooRESTSearch.jar
>
> version:
>     [mkdir] Created dir: /export/home/illsleyd/continuum/continuum-1.0.3/apps/continuum/working-directory/1/modules/samples/target/version
>     [jar] Building jar: /export/home/illsleyd/continuum/continuum-1.0.3/apps/continuum/working-directory/1/modules/samples/target/version/version.jar
>     [copy] Copying 1 file to /export/home/illsleyd/continuum/continuum-1.0.3/apps/continuum/working-directory/1/modules/samples/target/toWar/services
>
> groovy:
>     [mkdir] Created dir: /export/home/illsleyd/continuum/continuum-1.0.3/apps/continuum/working-directory/1/modules/samples/target/groovy
>     [copy] Copying 1 file to /export/home/illsleyd/continuum/continuum-1.0.3/apps/continuum/working-directory/1/modules/samples/target/classes/sample/groovy
>     [mkdir] Created dir: /export/home/illsleyd/continuum/continuum-1.0.3/apps/continuum/working-directory/1/modules/samples/target/classes/sample/groovy/lib
>     [mkdir] Created dir: /export/home/illsleyd/continuum/continuum-1.0.3/apps/continuum/working-directory/1/modules/samples/target/classes/sample/groovy/META-INF
>     [mkdir] Created dir: /export/home/illsleyd/continuum/continuum-1.0.3/apps/continuum/working-directory/1/modules/samples/target/classes/sample/groovy/sample
>     [mkdir] Created dir: /export/home/illsleyd/continuum/continuum-1.0.3/apps/continuum/working-directory/1/modules/samples/target/classes/sample/groovy/sample/groovy
>     [copy] Copying 1 file to /export/home/illsleyd/continuum/continuum-1.0.3/apps/continuum/working-directory/1/modules/samples/target/classes/sample/groovy/sample/groovy
>     [copy] Copying 1 file to /export/home/illsleyd/continuum/continuum-1.0.3/apps/continuum/working-directory/1/modules/samples/target/classes/sample/groovy/META-INF
>     [delete] Deleting: /export/home/illsleyd/continuum/continuum-1.0.3/apps/continuum/working-directory/1/modules/samples/target/classes/sample/groovy/GroovyReceiver.class
>     [copy] Copying 1 file to /export/home/illsleyd/continuum/continuum-1.0.3/apps/continuum/working-directory/1/modules/samples/target/classes/sample/groovy/lib
>     [jar] Building jar: /export/home/illsleyd/continuum/continuum-1.0.3/apps/continuum/working-directory/1/modules/samples/target/groovy/groovyService.aar
>
>
>
> jar:jar:
>     [jar] Building jar: /export/home/illsleyd/continuum/continuum-1.0.3/apps/continuum/working-directory/1/modules/samples/target/axis2-samples-SNAPSHOT.jar
>
> jar:install:
>     [echo] Installing...
> Uploading to org.apache.axis2/jars/axis2-samples-SNAPSHOT.jar:
> .................... (1623K)
> Uploading to org.apache.axis2/poms/axis2-samples-SNAPSHOT.pom:
> .................... (16K)
>
> +----------------------------------------
> | Executing multiproject:install-callback Apache Axis 2.0 - spring
> | Memory: 28M/53M
> +----------------------------------------
> DEPRECATED: the default goal should be specified in the <build> section of project.xml instead of maven.xml
> DEPRECATED: the default goal should be specified in the <build> section of project.xml instead of maven.xml
>
> build:end:
>
> build:start:
>
> multiproject:install-callback:
>     [echo] Running jar:install for Apache Axis 2.0 - spring
> java:prepare-filesystem:
>     [mkdir] Created dir: /export/home/illsleyd/continuum/continuum-1.0.3/apps/continuum/working-directory/1/modules/spring/target/classes
> Running post goal: java:prepare-filesystem
>
> java:compile:
>     [echo] Compiling to /export/home/illsleyd/continuum/continuum-1.0.3/apps/continuum/working-directory/1/modules/spring/target/classes
>     [javac] Compiling 3 source files to /export/home/illsleyd/continuum/continuum-1.0.3/apps/continuum/working-directory/1/modules/spring/target/classes
>
> java:jar-resources:
> Copying 2 files to /export/home/illsleyd/continuum/continuum-1.0.3/apps/continuum/working-directory/1/modules/spring/target/classes/META-INF
>
> test:test:
>     [echo] No tests to run.
>
> jar:jar:
>     [jar] Building jar: /export/home/illsleyd/continuum/continuum-1.0.3/apps/continuum/working-directory/1/modules/spring/target/axis2-spring-SNAPSHOT.jar
>
> jar:install:
>     [echo] Installing...
> Uploading to org.apache.axis2/jars/axis2-spring-SNAPSHOT.jar:
> .................... (9K)
> Uploading to org.apache.axis2/poms/axis2-spring-SNAPSHOT.pom:
> .................... (14K)
>
> +----------------------------------------
> | Executing multiproject:install-callback Apache Axis 2.0 - XMLBeans Data Binding
> | Memory: 26M/56M
> +----------------------------------------
> DEPRECATED: the default goal should be specified in the <build> section of project.xml instead of maven.xml
> DEPRECATED: the default goal should be specified in the <build> section of project.xml instead of maven.xml
>
> build:end:
>
> build:start:
>
> multiproject:install-callback:
>     [echo] Running jar:install for Apache Axis 2.0 - XMLBeans Data Binding
> java:prepare-filesystem:
>     [mkdir] Created dir: /export/home/illsleyd/continuum/continuum-1.0.3/apps/continuum/working-directory/1/modules/xmlbeans/target/classes
> Running post goal: java:prepare-filesystem
>
> java:compile:
>     [echo] Compiling to /export/home/illsleyd/continuum/continuum-1.0.3/apps/continuum/working-directory/1/modules/xmlbeans/target/classes
>     [javac] Compiling 2 source files to /export/home/illsleyd/continuum/continuum-1.0.3/apps/continuum/working-directory/1/modules/xmlbeans/target/classes
>
> java:jar-resources:
> Copying 1 file to /export/home/illsleyd/continuum/continuum-1.0.3/apps/continuum/working-directory/1/modules/xmlbeans/target/classes
> Copying 2 files to /export/home/illsleyd/continuum/continuum-1.0.3/apps/continuum/working-directory/1/modules/xmlbeans/target/classes/META-INF
>
> test:test:
> java:prepare-filesystem:
> Running post goal: java:prepare-filesystem
>
> java:compile:
>     [echo] Compiling to /export/home/illsleyd/continuum/continuum-1.0.3/apps/continuum/working-directory/1/modules/xmlbeans/target/classes
>
> java:jar-resources:
>
> test:prepare-filesystem:
>     [mkdir] Created dir: /export/home/illsleyd/continuum/continuum-1.0.3/apps/continuum/working-directory/1/modules/xmlbeans/target/test-classes
>     [mkdir] Created dir: /export/home/illsleyd/continuum/continuum-1.0.3/apps/continuum/working-directory/1/modules/xmlbeans/target/test-reports
>
> test:test-resources:
> Copying 23 files to /export/home/illsleyd/continuum/continuum-1.0.3/apps/continuum/working-directory/1/modules/xmlbeans/target/test-classes
> Copying 1 file to /export/home/illsleyd/continuum/continuum-1.0.3/apps/continuum/working-directory/1/modules/xmlbeans/target/test-classes
>
> test:compile:
>     [javac] Compiling 16 source files to /export/home/illsleyd/continuum/continuum-1.0.3/apps/continuum/working-directory/1/modules/xmlbeans/target/test-classes
>
>     [junit] Running org.apache.axis2.xmlbeans.WSDL2Java10Test
>     [junit] Tests run: 1, Failures: 0, Errors: 0, Time elapsed: 14.792 sec
>     [junit] Running org.apache.axis2.xmlbeans.WSDL2Java11Test
>     [junit] Tests run: 1, Failures: 0, Errors: 0, Time elapsed: 13.695 sec
>     [junit] Running org.apache.axis2.xmlbeans.WSDL2Java12Test
>     [junit] Tests run: 1, Failures: 0, Errors: 0, Time elapsed: 3.431 sec
>     [junit] Running org.apache.axis2.xmlbeans.WSDL2Java13Test
>     [junit] Tests run: 1, Failures: 0, Errors: 0, Time elapsed: 0.659 sec
>     [junit] Running org.apache.axis2.xmlbeans.WSDL2Java1Test
>     [junit] Tests run: 1, Failures: 0, Errors: 0, Time elapsed: 17.316 sec
>     [junit] Running org.apache.axis2.xmlbeans.WSDL2Java2Test
>     [junit] Tests run: 1, Failures: 0, Errors: 0, Time elapsed: 0.676 sec
>     [junit] Running org.apache.axis2.xmlbeans.WSDL2Java3Test
>     [junit] Tests run: 1, Failures: 0, Errors: 0, Time elapsed: 17.017 sec
>     [junit] Running org.apache.axis2.xmlbeans.WSDL2Java4Test
>     [junit] Tests run: 1, Failures: 0, Errors: 0, Time elapsed: 17.876 sec
>     [junit] Running org.apache.axis2.xmlbeans.WSDL2Java5Test
>     [junit] Tests run: 1, Failures: 0, Errors: 0, Time elapsed: 18.522 sec
>     [junit] Running org.apache.axis2.xmlbeans.WSDL2Java6Test
>     [junit] Tests run: 1, Failures: 0, Errors: 0, Time elapsed: 17.988 sec
>     [junit] Running org.apache.axis2.xmlbeans.WSDL2Java7Test
>     [junit] Tests run: 1, Failures: 0, Errors: 0, Time elapsed: 16.648 sec
>     [junit] Running org.apache.axis2.xmlbeans.WSDL2Java8Test
>     [junit] Tests run: 1, Failures: 0, Errors: 0, Time elapsed: 18.935 sec
>     [junit] Running org.apache.axis2.xmlbeans.WSDL2Java9Test
>     [junit] Tests run: 1, Failures: 0, Errors: 0, Time elapsed: 17.267 sec
>
> jar:jar:
>     [jar] Building jar: /export/home/illsleyd/continuum/continuum-1.0.3/apps/continuum/working-directory/1/modules/xmlbeans/target/axis2-xmlbeans-SNAPSHOT.jar
>
> jar:install:
>     [echo] Installing...
> Uploading to org.apache.axis2/jars/axis2-xmlbeans-SNAPSHOT.jar:
> .................... (22K)
> Uploading to org.apache.axis2/poms/axis2-xmlbeans-SNAPSHOT.pom:
> .................... (15K)
>
> +----------------------------------------
> | Executing multiproject:install-callback Apache Axis 2.0 - Tools
> | Memory: 29M/58M
> +----------------------------------------
> DEPRECATED: the default goal should be specified in the <build> section of project.xml instead of maven.xml
> DEPRECATED: the default goal should be specified in the <build> section of project.xml instead of maven.xml
>
> build:end:
>
> build:start:
>
> multiproject:install-callback:
>     [echo] Running jar:install for Apache Axis 2.0 - Tools
> java:prepare-filesystem:
>     [mkdir] Created dir: /export/home/illsleyd/continuum/continuum-1.0.3/apps/continuum/working-directory/1/modules/tool/target/classes
> Running post goal: java:prepare-filesystem
>
> java:compile:
>     [echo] Compiling to /export/home/illsleyd/continuum/continuum-1.0.3/apps/continuum/working-directory/1/modules/tool/target/classes
>     [javac] Compiling 1 source file to /export/home/illsleyd/continuum/continuum-1.0.3/apps/continuum/working-directory/1/modules/tool/target/classes
>
> java:jar-resources:
> Copying 2 files to /export/home/illsleyd/continuum/continuum-1.0.3/apps/continuum/working-directory/1/modules/tool/target/classes
> Copying 2 files to /export/home/illsleyd/continuum/continuum-1.0.3/apps/continuum/working-directory/1/modules/tool/target/classes/META-INF
>
> test:test:
>     [echo] No tests to run.
>
> jar:jar:
>     [jar] Building jar: /export/home/illsleyd/continuum/continuum-1.0.3/apps/continuum/working-directory/1/modules/tool/target/axis2-tools-SNAPSHOT.jar
>
> jar:install:
>     [echo] Installing...
> Uploading to org.apache.axis2/jars/axis2-tools-SNAPSHOT.jar:
> .................... (9K)
> Uploading to org.apache.axis2/poms/axis2-tools-SNAPSHOT.pom:
> .................... (13K)
>
> +----------------------------------------
> | Executing multiproject:install-callback Apache Axis 2.0 - Integration
> | Memory: 49M/58M
> +----------------------------------------
> DEPRECATED: the default goal should be specified in the <build> section of project.xml instead of maven.xml
> DEPRECATED: the default goal should be specified in the <build> section of project.xml instead of maven.xml
>
> build:end:
>
> Trying to get missing/snapshot dependencies required by Apache Axis 2.0 - Integration:
> Attempting to download axis2-adb-codegen-SNAPSHOT.jar.
> Skipping download as local copy is up to date!
> Attempting to download axis2-samples-SNAPSHOT.jar.
> Skipping download as local copy is up to date!
> Attempting to download axis2-spring-SNAPSHOT.jar.
> Skipping download as local copy is up to date!
> Attempting to download axis2-xmlbeans-SNAPSHOT.jar.
> Skipping download as local copy is up to date!
> Attempting to download axis2-tools-SNAPSHOT.jar.
> Skipping download as local copy is up to date!
> build:start:
>
> multiproject:install-callback:
>     [echo] Running jar:install for Apache Axis 2.0 - Integration
> java:prepare-filesystem:
>     [mkdir] Created dir: /export/home/illsleyd/continuum/continuum-1.0.3/apps/continuum/working-directory/1/modules/integration/target/classes
> Running post goal: java:prepare-filesystem
>
> java:compile:
>     [echo] Compiling to /export/home/illsleyd/continuum/continuum-1.0.3/apps/continuum/working-directory/1/modules/integration/target/classes
>     [javac] Compiling 136 source files to /export/home/illsleyd/continuum/continuum-1.0.3/apps/continuum/working-directory/1/modules/integration/target/classes
>     [javac] Note: /export/home/illsleyd/continuum/continuum-1.0.3/apps/continuum/working-directory/1/modules/integration/src/test/soap12testing/client/SOAPComparator.java uses or overrides a deprecated API.
>     [javac] Note: Recompile with -Xlint:deprecation for details.
>
> java:jar-resources:
> Copying 1 file to /export/home/illsleyd/continuum/continuum-1.0.3/apps/continuum/working-directory/1/modules/integration/target/classes
>
> test:test:
> java:prepare-filesystem:
> Running post goal: java:prepare-filesystem
>
> java:compile:
>     [echo] Compiling to /export/home/illsleyd/continuum/continuum-1.0.3/apps/continuum/working-directory/1/modules/integration/target/classes
>     [javac] Compiling 10 source files to /export/home/illsleyd/continuum/continuum-1.0.3/apps/continuum/working-directory/1/modules/integration/target/classes
>
> java:jar-resources:
>
> test:prepare-filesystem:
>     [mkdir] Created dir: /export/home/illsleyd/continuum/continuum-1.0.3/apps/continuum/working-directory/1/modules/integration/target/test-classes
>     [mkdir] Created dir: /export/home/illsleyd/continuum/continuum-1.0.3/apps/continuum/working-directory/1/modules/integration/target/test-reports
>
> test:test-resources:
> Copying 147 files to /export/home/illsleyd/continuum/continuum-1.0.3/apps/continuum/working-directory/1/modules/integration/target/test-classes
>
> test:compile:
>     [copy] Copying 1 file to /export/home/illsleyd/continuum/continuum-1.0.3/apps/continuum/working-directory/1/modules/integration/target/test-classes/modules
>     [java] log4j:WARN No appenders could be found for logger (org.apache.axis2.description.AxisService).
>     [java] log4j:WARN Please initialize the log4j system properly.
>     [copy] Copying 1 file to /export/home/illsleyd/continuum/continuum-1.0.3/apps/continuum/working-directory/1/modules/integration/target/perf/src/samples/wsdl/perf
>     [mkdir] Created dir: /export/home/illsleyd/continuum/continuum-1.0.3/apps/continuum/working-directory/1/modules/integration/target/perf/build
>     [mkdir] Created dir: /export/home/illsleyd/continuum/continuum-1.0.3/apps/continuum/working-directory/1/modules/integration/target/perf/build/classes
>     [mkdir] Created dir: /export/home/illsleyd/continuum/continuum-1.0.3/apps/continuum/working-directory/1/modules/integration/target/perf/build/lib
>     [jar] Building jar: /export/home/illsleyd/continuum/continuum-1.0.3/apps/continuum/working-directory/1/modules/integration/target/perf/build/lib/XBeans-packaged.jar
>     [echo] XmlBeans Availability = true
>     [echo] Stax Availability= true
>     [echo] Axis2 Availability= true
>     [javac] Compiling 211 source files to /export/home/illsleyd/continuum/continuum-1.0.3/apps/continuum/working-directory/1/modules/integration/target/perf/build/classes
>     [javac] Note: Some input files use or override a deprecated API.
>     [javac] Note: Recompile with -Xlint:deprecation for details.
>     [javac] Note: Some input files use unchecked or unsafe operations.
>     [javac] Note: Recompile with -Xlint:unchecked for details.
>     [copy] Copying 2 files to /export/home/illsleyd/continuum/continuum-1.0.3/apps/continuum/working-directory/1/modules/integration/target/perf/build/classes/META-INF
>     [copy] Copying 1 file to /export/home/illsleyd/continuum/continuum-1.0.3/apps/continuum/working-directory/1/modules/integration/target/perf/build/classes/lib
>     [jar] Building jar: /export/home/illsleyd/continuum/continuum-1.0.3/apps/continuum/working-directory/1/modules/integration/target/perf/build/lib/PerfPortType.aar
>     [mkdir] Created dir: /export/home/illsleyd/continuum/continuum-1.0.3/apps/continuum/working-directory/1/modules/integration/target/perf/build/repo
>     [mkdir] Created dir: /export/home/illsleyd/continuum/continuum-1.0.3/apps/continuum/working-directory/1/modules/integration/target/perf/build/repo/services
>     [copy] Copying 1 file to /export/home/illsleyd/continuum/continuum-1.0.3/apps/continuum/working-directory/1/modules/integration/target/perf/build/repo/services
>     [echo] XmlBeans Availability = true
>     [echo] Stax Availability= true
>     [echo] Axis2 Availability= true
>     [javac] Compiling 1 source file to /export/home/illsleyd/continuum/continuum-1.0.3/apps/continuum/working-directory/1/modules/integration/target/perf/build/classes
>     [javac] /export/home/illsleyd/continuum/continuum-1.0.3/apps/continuum/working-directory/1/modules/integration/target/perf/test/samples/wsdl/perf/PerfPortTypeTest.java:46: warning: non-varargs call of varargs method with inexact argument type for last parameter;
>     [javac] cast to java.lang.Class for a varargs call
>     [javac] cast to java.lang.Class[] for a non-varargs call and to suppress this warning
>     [javac]                             creatorMethod = declaredClass.getMethod("newInstance",null);
>     [javac]                                                                                   ^
>     [javac] /export/home/illsleyd/continuum/continuum-1.0.3/apps/continuum/working-directory/1/modules/integration/target/perf/test/samples/wsdl/perf/PerfPortTypeTest.java:53: warning: non-varargs call of varargs method with inexact argument type for last parameter;
>     [javac] cast to java.lang.Object for a varargs call
>     [javac] cast to java.lang.Object[] for a non-varargs call and to suppress this warning
>     [javac]                     return  (org.apache.xmlbeans.XmlObject)creatorMethod.invoke(null,null);
>     [javac]                                                                                      ^
>     [javac] 2 warnings
>     [jar] Building jar: /export/home/illsleyd/continuum/continuum-1.0.3/apps/continuum/working-directory/1/modules/integration/target/perf/build/lib/PerfPortType-test-client.jar
>     [move] Moving 1 file to /export/home/illsleyd/continuum/continuum-1.0.3/apps/continuum/working-directory/1/modules/integration/target/perf/build/lib
>     [move] Moving 1 file to /export/home/illsleyd/continuum/continuum-1.0.3/apps/continuum/working-directory/1/modules/integration/target/perf/build/lib
>     [java] log4j:WARN No appenders could be found for logger (org.apache.axis2.description.AxisService).
>     [java] log4j:WARN Please initialize the log4j system properly.
>     [copy] Copying 1 file to /export/home/illsleyd/continuum/continuum-1.0.3/apps/continuum/working-directory/1/modules/integration/target/perf2/src/samples/wsdl/perf2
>     [mkdir] Created dir: /export/home/illsleyd/continuum/continuum-1.0.3/apps/continuum/working-directory/1/modules/integration/target/perf2/build
>     [mkdir] Created dir: /export/home/illsleyd/continuum/continuum-1.0.3/apps/continuum/working-directory/1/modules/integration/target/perf2/build/classes
>     [mkdir] Created dir: /export/home/illsleyd/continuum/continuum-1.0.3/apps/continuum/working-directory/1/modules/integration/target/perf2/build/lib
>     [echo] Stax Availability= true
>     [echo] Axis2 Availability= true
>     [javac] Compiling 6 source files to /export/home/illsleyd/continuum/continuum-1.0.3/apps/continuum/working-directory/1/modules/integration/target/perf2/build/classes
>     [javac] Note: Some input files use unchecked or unsafe operations.
>     [javac] Note: Recompile with -Xlint:unchecked for details.
>     [copy] Copying 2 files to /export/home/illsleyd/continuum/continuum-1.0.3/apps/continuum/working-directory/1/modules/integration/target/perf2/build/classes/META-INF
>     [jar] Building jar: /export/home/illsleyd/continuum/continuum-1.0.3/apps/continuum/working-directory/1/modules/integration/target/perf2/build/lib/PerfPortType.aar
>     [mkdir] Created dir: /export/home/illsleyd/continuum/continuum-1.0.3/apps/continuum/working-directory/1/modules/integration/target/perf2/build/repo
>     [mkdir] Created dir: /export/home/illsleyd/continuum/continuum-1.0.3/apps/continuum/working-directory/1/modules/integration/target/perf2/build/repo/services
>     [copy] Copying 1 file to /export/home/illsleyd/continuum/continuum-1.0.3/apps/continuum/working-directory/1/modules/integration/target/perf2/build/repo/services
>     [echo] Stax Availability= true
>     [echo] Axis2 Availability= true
>     [javac] Compiling 1 source file to /export/home/illsleyd/continuum/continuum-1.0.3/apps/continuum/working-directory/1/modules/integration/target/perf2/build/classes
>     [jar] Building jar: /export/home/illsleyd/continuum/continuum-1.0.3/apps/continuum/working-directory/1/modules/integration/target/perf2/build/lib/PerfPortType-test-client.jar
>     [move] Moving 1 file to /export/home/illsleyd/continuum/continuum-1.0.3/apps/continuum/working-directory/1/modules/integration/target/perf2/build/lib
>     [java] Time to build schema type system: 1.747 seconds
>     [java] Time to generate code: 1.238 seconds
>     [java] Time to compile code: 8.629 seconds
>     [echo] Running codegen RPC WSDLs - take 1
>     [java] log4j:WARN No appenders could be found for logger (org.apache.axis2.description.AxisService).
>     [java] log4j:WARN Please initialize the log4j system properly.
>     [mkdir] Created dir: /export/home/illsleyd/continuum/continuum-1.0.3/apps/continuum/working-directory/1/modules/integration/target/rpc-test1/build
>     [mkdir] Created dir: /export/home/illsleyd/continuum/continuum-1.0.3/apps/continuum/working-directory/1/modules/integration/target/rpc-test1/build/classes
>     [mkdir] Created dir: /export/home/illsleyd/continuum/continuum-1.0.3/apps/continuum/working-directory/1/modules/integration/target/rpc-test1/build/lib
>     [mkdir] Created dir: /export/home/illsleyd/continuum/continuum-1.0.3/apps/continuum/working-directory/1/modules/integration/target/rpc-test1/test
>     [echo] Stax Availability= true
>     [echo] Axis2 Availability= true
>     [javac] Compiling 2 source files to /export/home/illsleyd/continuum/continuum-1.0.3/apps/continuum/working-directory/1/modules/integration/target/rpc-test1/build/classes
>     [javac] Note: /export/home/illsleyd/continuum/continuum-1.0.3/apps/continuum/working-directory/1/modules/integration/target/rpc-test1/src/com/example/www/ServiceNameStub.java uses unchecked or unsafe operations.
>     [javac] Note: Recompile with -Xlint:unchecked for details.
>     [jar] Building jar: /export/home/illsleyd/continuum/continuum-1.0.3/apps/continuum/working-directory/1/modules/integration/target/rpc-test1/build/lib/ServiceName-test-client.jar
>     [echo] Running codegen RPC WSDLs - take 2
>     [java] log4j:WARN No appenders could be found for logger (org.apache.axis2.description.AxisService).
>     [java] log4j:WARN Please initialize the log4j system properly.
>     [mkdir] Created dir: /export/home/illsleyd/continuum/continuum-1.0.3/apps/continuum/working-directory/1/modules/integration/target/rpc-test2/build
>     [mkdir] Created dir: /export/home/illsleyd/continuum/continuum-1.0.3/apps/continuum/working-directory/1/modules/integration/target/rpc-test2/build/classes
>     [mkdir] Created dir: /export/home/illsleyd/continuum/continuum-1.0.3/apps/continuum/working-directory/1/modules/integration/target/rpc-test2/build/lib
>     [mkdir] Created dir: /export/home/illsleyd/continuum/continuum-1.0.3/apps/continuum/working-directory/1/modules/integration/target/rpc-test2/test
>     [echo] Stax Availability= true
>     [echo] Axis2 Availability= true
>     [javac] Compiling 2 source files to /export/home/illsleyd/continuum/continuum-1.0.3/apps/continuum/working-directory/1/modules/integration/target/rpc-test2/build/classes
>     [javac] Note: /export/home/illsleyd/continuum/continuum-1.0.3/apps/continuum/working-directory/1/modules/integration/target/rpc-test2/src/com/example/www/ServiceNameStub.java uses unchecked or unsafe operations.
>     [javac] Note: Recompile with -Xlint:unchecked for details.
>     [jar] Building jar: /export/home/illsleyd/continuum/continuum-1.0.3/apps/continuum/working-directory/1/modules/integration/target/rpc-test2/build/lib/ServiceName-test-client.jar
>     [echo] Running codegen RPC WSDLs - take 3
>     [java] log4j:WARN No appenders could be found for logger (org.apache.axis2.description.AxisService).
>     [java] log4j:WARN Please initialize the log4j system properly.
>     [mkdir] Created dir: /export/home/illsleyd/continuum/continuum-1.0.3/apps/continuum/working-directory/1/modules/integration/target/rpc-test3/build
>     [mkdir] Created dir: /export/home/illsleyd/continuum/continuum-1.0.3/apps/continuum/working-directory/1/modules/integration/target/rpc-test3/build/classes
>     [mkdir] Created dir: /export/home/illsleyd/continuum/continuum-1.0.3/apps/continuum/working-directory/1/modules/integration/target/rpc-test3/build/lib
>     [mkdir] Created dir: /export/home/illsleyd/continuum/continuum-1.0.3/apps/continuum/working-directory/1/modules/integration/target/rpc-test3/test
>     [jar] Building jar: /export/home/illsleyd/continuum/continuum-1.0.3/apps/continuum/working-directory/1/modules/integration/target/rpc-test3/build/lib/XBeans-packaged.jar
>     [echo] XmlBeans Availability = true
>     [echo] Stax Availability= true
>     [echo] Axis2 Availability= true
>     [javac] Compiling 210 source files to /export/home/illsleyd/continuum/continuum-1.0.3/apps/continuum/working-directory/1/modules/integration/target/rpc-test3/build/classes
>     [javac] Note: Some input files use or override a deprecated API.
>     [javac] Note: Recompile with -Xlint:deprecation for details.
>     [javac] Note: /export/home/illsleyd/continuum/continuum-1.0.3/apps/continuum/working-directory/1/modules/integration/target/rpc-test3/src/com/example/www/ServiceNameStub.java uses unchecked or unsafe operations.
>     [javac] Note: Recompile with -Xlint:unchecked for details.
>     [jar] Building jar: /export/home/illsleyd/continuum/continuum-1.0.3/apps/continuum/working-directory/1/modules/integration/target/rpc-test3/build/lib/ServiceName-test-client.jar
>     [echo] Running codegen RPC WSDLs - take 4
>     [java] log4j:WARN No appenders could be found for logger (org.apache.axis2.description.AxisService).
>     [java] log4j:WARN Please initialize the log4j system properly.
>     [mkdir] Created dir: /export/home/illsleyd/continuum/continuum-1.0.3/apps/continuum/working-directory/1/modules/integration/target/rpc-test4/build
>     [mkdir] Created dir: /export/home/illsleyd/continuum/continuum-1.0.3/apps/continuum/working-directory/1/modules/integration/target/rpc-test4/build/classes
>     [mkdir] Created dir: /export/home/illsleyd/continuum/continuum-1.0.3/apps/continuum/working-directory/1/modules/integration/target/rpc-test4/build/lib
>     [mkdir] Created dir: /export/home/illsleyd/continuum/continuum-1.0.3/apps/continuum/working-directory/1/modules/integration/target/rpc-test4/test
>     [jar] Building jar: /export/home/illsleyd/continuum/continuum-1.0.3/apps/continuum/working-directory/1/modules/integration/target/rpc-test4/build/lib/XBeans-packaged.jar
>     [echo] XmlBeans Availability = true
>     [echo] Stax Availability= true
>     [echo] Axis2 Availability= true
>     [javac] Compiling 210 source files to /export/home/illsleyd/continuum/continuum-1.0.3/apps/continuum/working-directory/1/modules/integration/target/rpc-test4/build/classes
>     [javac] Note: Some input files use or override a deprecated API.
>     [javac] Note: Recompile with -Xlint:deprecation for details.
>     [javac] Note: /export/home/illsleyd/continuum/continuum-1.0.3/apps/continuum/working-directory/1/modules/integration/target/rpc-test4/src/com/example/www/ServiceNameMessageReceiverInOut.java uses unchecked or unsafe operations.
>     [javac] Note: Recompile with -Xlint:unchecked for details.
>     [copy] Copying 2 files to /export/home/illsleyd/continuum/continuum-1.0.3/apps/continuum/working-directory/1/modules/integration/target/rpc-test4/build/classes/META-INF
>     [copy] Copying 1 file to /export/home/illsleyd/continuum/continuum-1.0.3/apps/continuum/working-directory/1/modules/integration/target/rpc-test4/build/classes/lib
>     [jar] Building jar: /export/home/illsleyd/continuum/continuum-1.0.3/apps/continuum/working-directory/1/modules/integration/target/rpc-test4/build/lib/ServiceName.aar
>     [echo] Running codegen RPC WSDLs with helper mode -  take 1
>     [java] log4j:WARN No appenders could be found for logger (org.apache.axis2.description.AxisService).
>     [java] log4j:WARN Please initialize the log4j system properly.
>     [mkdir] Created dir: /export/home/illsleyd/continuum/continuum-1.0.3/apps/continuum/working-directory/1/modules/integration/target/helper-test1/build
>     [mkdir] Created dir: /export/home/illsleyd/continuum/continuum-1.0.3/apps/continuum/working-directory/1/modules/integration/target/helper-test1/build/classes
>     [mkdir] Created dir: /export/home/illsleyd/continuum/continuum-1.0.3/apps/continuum/working-directory/1/modules/integration/target/helper-test1/build/lib
>     [mkdir] Created dir: /export/home/illsleyd/continuum/continuum-1.0.3/apps/continuum/working-directory/1/modules/integration/target/helper-test1/test
>     [echo] Stax Availability= true
>     [echo] Axis2 Availability= true
>     [javac] Compiling 8 source files to /export/home/illsleyd/continuum/continuum-1.0.3/apps/continuum/working-directory/1/modules/integration/target/helper-test1/build/classes
>     [javac] Note: Some input files use unchecked or unsafe operations.
>     [javac] Note: Recompile with -Xlint:unchecked for details.
>     [jar] Building jar: /export/home/illsleyd/continuum/continuum-1.0.3/apps/continuum/working-directory/1/modules/integration/target/helper-test1/build/lib/ServiceName-test-client.jar
>     [echo] Running codegen RPC WSDLs with helper mode -  take 2
>     [java] log4j:WARN No appenders could be found for logger (org.apache.axis2.description.AxisService).
>     [java] log4j:WARN Please initialize the log4j system properly.
>     [mkdir] Created dir: /export/home/illsleyd/continuum/continuum-1.0.3/apps/continuum/working-directory/1/modules/integration/target/helper-test2/build
>     [mkdir] Created dir: /export/home/illsleyd/continuum/continuum-1.0.3/apps/continuum/working-directory/1/modules/integration/target/helper-test2/build/classes
>     [mkdir] Created dir: /export/home/illsleyd/continuum/continuum-1.0.3/apps/continuum/working-directory/1/modules/integration/target/helper-test2/build/lib
>     [mkdir] Created dir: /export/home/illsleyd/continuum/continuum-1.0.3/apps/continuum/working-directory/1/modules/integration/target/helper-test2/test
>     [echo] Stax Availability= true
>     [echo] Axis2 Availability= true
>     [javac] Compiling 8 source files to /export/home/illsleyd/continuum/continuum-1.0.3/apps/continuum/working-directory/1/modules/integration/target/helper-test2/build/classes
>     [javac] Note: Some input files use unchecked or unsafe operations.
>     [javac] Note: Recompile with -Xlint:unchecked for details.
>     [jar] Building jar: /export/home/illsleyd/continuum/continuum-1.0.3/apps/continuum/working-directory/1/modules/integration/target/helper-test2/build/lib/ServiceName-test-client.jar
>     [echo] Running codegen for Enterprise WSDL - take 1
>     [java] log4j:WARN No appenders could be found for logger...
>
> [Message clipped]


-- 
Thilina Gunarathne
WSO2, Inc.; http://www.wso2.com/
Home page: http://webservices.apache.org/~thilina/
Blog: http://thilinag.blogspot.com/

---------------------------------------------------------------------
To unsubscribe, e-mail: axis-dev-unsubscribe@ws.apache.org
For additional commands, e-mail: axis-dev-help@ws.apache.org


Mime
View raw message