axis-java-dev mailing list archives

Site index · List index
Message view « Date » · « Thread »
Top « Date » · « Thread »
From "davidillsley (Continuum)" <davidills...@apache.org>
Subject [continuum] BUILD FAILURE: Axis2
Date Sun, 04 Feb 2007 23:10:08 GMT
Online report : http://localhost:8080/continuum/servlet/continuum/target/ProjectBuild.vm/view/ProjectBuild/id/1/buildId/644
Build statistics:
  State: Failed
  Previous State: Failed
  Started at: Sun, 4 Feb 2007 23:06:31 +0000
  Finished at: Sun, 4 Feb 2007 23:09:46 +0000
  Total time: 3m 15s
  Build Trigger: Schedule
  Exit code: 70
  Building machine hostname: ws.zones.apache.org
  Operating system : SunOS(unknown)
  Java version : 1.5.0_09(Sun Microsystems Inc.)

Changes
         dims          no need to call no-op methods that prints warnings unless debug is
enabled
             /webservices/axis2/trunk/java/modules/kernel/src/org/apache/axis2/context/MessageContext.java
           dims          check using a static boolean
             /webservices/axis2/trunk/java/modules/kernel/src/org/apache/axis2/engine/AxisEngine.java
        
****************************************************************************
Output:
****************************************************************************
 __  __
|  \/  |__ _Apache__ ___
| |\/| / _` \ V / -_) ' \  ~ intelligent projects ~
|_|  |_\__,_|\_/\___|_||_|  v. 1.1-beta-3

DEPRECATED: the default goal should be specified in the <build> section of project.xml
instead of maven.xml
DEPRECATED: the default goal should be specified in the <build> section of project.xml
instead of maven.xml
Trying to get missing/snapshot dependencies required by Apache Axis2:
Attempting to download maven-test-plugin-1.8.1-SNAPSHOT.jar.
Skipping download as local copy is up to date!
Attempting to download maven-multiproject-plugin-1.5-SNAPSHOT.jar.
Skipping download as local copy is up to date!
Attempting to download maven-jar-plugin-1.8-SNAPSHOT.jar.
Skipping download as local copy is up to date!
Attempting to download maven-plugin-plugin-1.8-SNAPSHOT.jar.
Skipping download as local copy is up to date!
    [echo] 1.5
    [echo] 
            JDK 1.5 detected, including the following modules:
            modules/metadata/project.xml,modules/saaj-api/project.xml,modules/saaj/project.xml,modules/jaxbri/project.xml,modules/jaxws/project.xml,modules/jaxws-api/project.xml,modules/json/project.xml
        
build:start:

clean:
modules:clean:
modules:reactor:init:
plugin:download-artifact:

    [echo] Adding to modules.reactor.includes: modules/adb-codegen/project.xml
    [echo] Adding to modules.reactor.includes: modules/adb/project.xml
    [echo] Adding to modules.reactor.includes: modules/addressing/project.xml
    [echo] Adding to modules.reactor.includes: modules/codegen/project.xml
    [echo] Adding to modules.reactor.includes: modules/integration/project.xml
    [echo] Adding to modules.reactor.includes: modules/java2wsdl/project.xml
    [echo] Adding to modules.reactor.includes: modules/jaxbri/project.xml
    [echo] Adding to modules.reactor.includes: modules/jaxws-api/project.xml
    [echo] Adding to modules.reactor.includes: modules/jaxws/project.xml
    [echo] Adding to modules.reactor.includes: modules/jibx/project.xml
    [echo] Adding to modules.reactor.includes: modules/json/project.xml
    [echo] Adding to modules.reactor.includes: modules/kernel/project.xml
    [echo] Adding to modules.reactor.includes: modules/metadata/project.xml
    [echo] Adding to modules.reactor.includes: modules/mtompolicy/project.xml
    [echo] Adding to modules.reactor.includes: modules/rahas/project.xml
    [echo] Adding to modules.reactor.includes: modules/saaj-api/project.xml
    [echo] Adding to modules.reactor.includes: modules/saaj/project.xml
    [echo] Adding to modules.reactor.includes: modules/samples/project.xml
    [echo] Adding to modules.reactor.includes: modules/savan/project.xml
    [echo] Adding to modules.reactor.includes: modules/secpolicy/project.xml
    [echo] Adding to modules.reactor.includes: modules/security/project.xml
    [echo] Adding to modules.reactor.includes: modules/soapmonitor/project.xml
    [echo] Adding to modules.reactor.includes: modules/spring/project.xml
    [echo] Adding to modules.reactor.includes: modules/tool/project.xml
    [echo] Adding to modules.reactor.includes: modules/webapp/project.xml
    [echo] Adding to modules.reactor.includes: modules/xmlbeans/project.xml

    [echo] +----------------------------------------
    [echo] | Cleaning: modules/adb-codegen
    [echo] +----------------------------------------
    [delete] Deleting directory /export/home/illsleyd/continuum/continuum-1.0.3/apps/continuum/working-directory/1/modules/adb-codegen/target
    [echo] 
    [echo] +----------------------------------------
    [echo] | Cleaning: modules/adb
    [echo] +----------------------------------------
    [delete] Deleting directory /export/home/illsleyd/continuum/continuum-1.0.3/apps/continuum/working-directory/1/modules/adb/target
    [echo] 
    [echo] +----------------------------------------
    [echo] | Cleaning: modules/addressing
    [echo] +----------------------------------------
    [delete] Deleting directory /export/home/illsleyd/continuum/continuum-1.0.3/apps/continuum/working-directory/1/modules/addressing/target
    [echo] 
    [echo] +----------------------------------------
    [echo] | Cleaning: modules/codegen
    [echo] +----------------------------------------
    [delete] Deleting directory /export/home/illsleyd/continuum/continuum-1.0.3/apps/continuum/working-directory/1/modules/codegen/target
    [echo] 
    [echo] +----------------------------------------
    [echo] | Cleaning: modules/integration
    [echo] +----------------------------------------
    [delete] Deleting directory /export/home/illsleyd/continuum/continuum-1.0.3/apps/continuum/working-directory/1/modules/integration/target
    [echo] 
    [echo] +----------------------------------------
    [echo] | Cleaning: modules/java2wsdl
    [echo] +----------------------------------------
    [delete] Deleting directory /export/home/illsleyd/continuum/continuum-1.0.3/apps/continuum/working-directory/1/modules/java2wsdl/target
    [echo] 
    [echo] +----------------------------------------
    [echo] | Cleaning: modules/jaxbri
    [echo] +----------------------------------------
    [delete] Deleting directory /export/home/illsleyd/continuum/continuum-1.0.3/apps/continuum/working-directory/1/modules/jaxbri/target
    [echo] 
    [echo] +----------------------------------------
    [echo] | Cleaning: modules/jaxws-api
    [echo] +----------------------------------------
    [delete] Deleting directory /export/home/illsleyd/continuum/continuum-1.0.3/apps/continuum/working-directory/1/modules/jaxws-api/target
    [echo] 
    [echo] +----------------------------------------
    [echo] | Cleaning: modules/jaxws
    [echo] +----------------------------------------
    [delete] Deleting directory /export/home/illsleyd/continuum/continuum-1.0.3/apps/continuum/working-directory/1/modules/jaxws/target
    [echo] 
    [echo] +----------------------------------------
    [echo] | Cleaning: modules/jibx
    [echo] +----------------------------------------
    [delete] Deleting directory /export/home/illsleyd/continuum/continuum-1.0.3/apps/continuum/working-directory/1/modules/jibx/target
    [echo] 
    [echo] +----------------------------------------
    [echo] | Cleaning: modules/json
    [echo] +----------------------------------------
    [echo] 
    [echo] +----------------------------------------
    [echo] | Cleaning: modules/kernel
    [echo] +----------------------------------------
    [delete] Deleting directory /export/home/illsleyd/continuum/continuum-1.0.3/apps/continuum/working-directory/1/modules/kernel/target
    [echo] 
    [echo] +----------------------------------------
    [echo] | Cleaning: modules/metadata
    [echo] +----------------------------------------
    [delete] Deleting directory /export/home/illsleyd/continuum/continuum-1.0.3/apps/continuum/working-directory/1/modules/metadata/target
    [echo] 
    [echo] +----------------------------------------
    [echo] | Cleaning: modules/mtompolicy
    [echo] +----------------------------------------
    [echo] 
    [echo] +----------------------------------------
    [echo] | Cleaning: modules/rahas
    [echo] +----------------------------------------
    [delete] Deleting directory /export/home/illsleyd/continuum/continuum-1.0.3/apps/continuum/working-directory/1/modules/rahas/target
    [echo] 
    [echo] +----------------------------------------
    [echo] | Cleaning: modules/saaj-api
    [echo] +----------------------------------------
    [delete] Deleting directory /export/home/illsleyd/continuum/continuum-1.0.3/apps/continuum/working-directory/1/modules/saaj-api/target
    [echo] 
    [echo] +----------------------------------------
    [echo] | Cleaning: modules/saaj
    [echo] +----------------------------------------
    [delete] Deleting directory /export/home/illsleyd/continuum/continuum-1.0.3/apps/continuum/working-directory/1/modules/saaj/target
    [echo] 
    [echo] +----------------------------------------
    [echo] | Cleaning: modules/samples
    [echo] +----------------------------------------
    [delete] Deleting directory /export/home/illsleyd/continuum/continuum-1.0.3/apps/continuum/working-directory/1/modules/samples/target
    [echo] 
    [echo] +----------------------------------------
    [echo] | Cleaning: modules/savan
    [echo] +----------------------------------------
    [echo] 
    [echo] +----------------------------------------
    [echo] | Cleaning: modules/secpolicy
    [echo] +----------------------------------------
    [delete] Deleting directory /export/home/illsleyd/continuum/continuum-1.0.3/apps/continuum/working-directory/1/modules/secpolicy/target
    [echo] 
    [echo] +----------------------------------------
    [echo] | Cleaning: modules/security
    [echo] +----------------------------------------
    [delete] Deleting directory /export/home/illsleyd/continuum/continuum-1.0.3/apps/continuum/working-directory/1/modules/security/target
    [echo] 
    [echo] +----------------------------------------
    [echo] | Cleaning: modules/soapmonitor
    [echo] +----------------------------------------
    [echo] 
    [echo] +----------------------------------------
    [echo] | Cleaning: modules/spring
    [echo] +----------------------------------------
    [delete] Deleting directory /export/home/illsleyd/continuum/continuum-1.0.3/apps/continuum/working-directory/1/modules/spring/target
    [echo] 
    [echo] +----------------------------------------
    [echo] | Cleaning: modules/tool
    [echo] +----------------------------------------
    [delete] Deleting directory /export/home/illsleyd/continuum/continuum-1.0.3/apps/continuum/working-directory/1/modules/tool/target
    [echo] 
    [echo] +----------------------------------------
    [echo] | Cleaning: modules/webapp
    [echo] +----------------------------------------
    [echo] 
    [echo] +----------------------------------------
    [echo] | Cleaning: modules/xmlbeans
    [echo] +----------------------------------------
    [delete] Deleting directory /export/home/illsleyd/continuum/continuum-1.0.3/apps/continuum/working-directory/1/modules/xmlbeans/target
    [echo] 
    [echo] +----------------------------------------
    [echo] | Cleaning: target and etc/target
    [echo] +----------------------------------------


jar:
multiproject:install:
multiproject:projects-init:
    [echo] Gathering project list
Starting the reactor...
Our processing order:
Apache Axis 2.0 - Java2WSDL
Apache Axis 2.0 - Kernel
Apache Axis 2.0 - Data Binding
Apache Axis 2.0 - Code Generation
Apache Axis 2.0 - ADB Codegen
Apache Axis 2.0 - Addressing
Apache Axis 2.0 - JiBX Data Binding
Apache Axis 2.0 - Security Policy
Apache Axis 2.0 - XMLBeans Data Binding
Apache Axis 2.0 - Rahas
Apache Axis 2.0 - Security
Apache Axis 2.0 - Samples
Apache Axis 2.0 - spring
Apache Axis 2.0 - Tools
Apache Axis 2.0 - Integration
Apache Axis 2.0 - JAXB-RI Data Binding
Apache Axis 2.0 - SAAJ API
Apache Axis 2.0 - JAXWS API
Apache Axis 2.0 - SAAJ
Apache Axis 2.0 - Metadata
Apache Axis 2.0 - JAX-WS
Apache Axis 2.0 - JSON
Apache Axis 2.0 - MTOM Policy
Apache Axis 2.0 - Savan
Apache Axis 2.0 - soapmonitor
+----------------------------------------
| Gathering project list Apache Axis 2.0 - Java2WSDL
| Memory: 29M/41M
+----------------------------------------
+----------------------------------------
| Gathering project list Apache Axis 2.0 - Kernel
| Memory: 29M/41M
+----------------------------------------
+----------------------------------------
| Gathering project list Apache Axis 2.0 - Data Binding
| Memory: 29M/41M
+----------------------------------------
+----------------------------------------
| Gathering project list Apache Axis 2.0 - Code Generation
| Memory: 29M/41M
+----------------------------------------
+----------------------------------------
| Gathering project list Apache Axis 2.0 - ADB Codegen
| Memory: 29M/41M
+----------------------------------------
+----------------------------------------
| Gathering project list Apache Axis 2.0 - Addressing
| Memory: 29M/41M
+----------------------------------------
+----------------------------------------
| Gathering project list Apache Axis 2.0 - JiBX Data Binding
| Memory: 29M/41M
+----------------------------------------
+----------------------------------------
| Gathering project list Apache Axis 2.0 - Security Policy
| Memory: 29M/41M
+----------------------------------------
+----------------------------------------
| Gathering project list Apache Axis 2.0 - XMLBeans Data Binding
| Memory: 29M/41M
+----------------------------------------
+----------------------------------------
| Gathering project list Apache Axis 2.0 - Rahas
| Memory: 29M/41M
+----------------------------------------
+----------------------------------------
| Gathering project list Apache Axis 2.0 - Security
| Memory: 29M/41M
+----------------------------------------
+----------------------------------------
| Gathering project list Apache Axis 2.0 - Samples
| Memory: 29M/41M
+----------------------------------------
+----------------------------------------
| Gathering project list Apache Axis 2.0 - spring
| Memory: 29M/41M
+----------------------------------------
+----------------------------------------
| Gathering project list Apache Axis 2.0 - Tools
| Memory: 29M/41M
+----------------------------------------
+----------------------------------------
| Gathering project list Apache Axis 2.0 - Integration
| Memory: 29M/41M
+----------------------------------------
+----------------------------------------
| Gathering project list Apache Axis 2.0 - JAXB-RI Data Binding
| Memory: 29M/41M
+----------------------------------------
+----------------------------------------
| Gathering project list Apache Axis 2.0 - SAAJ API
| Memory: 29M/41M
+----------------------------------------
+----------------------------------------
| Gathering project list Apache Axis 2.0 - JAXWS API
| Memory: 29M/41M
+----------------------------------------
+----------------------------------------
| Gathering project list Apache Axis 2.0 - SAAJ
| Memory: 29M/41M
+----------------------------------------
+----------------------------------------
| Gathering project list Apache Axis 2.0 - Metadata
| Memory: 29M/41M
+----------------------------------------
+----------------------------------------
| Gathering project list Apache Axis 2.0 - JAX-WS
| Memory: 29M/41M
+----------------------------------------
+----------------------------------------
| Gathering project list Apache Axis 2.0 - JSON
| Memory: 29M/41M
+----------------------------------------
+----------------------------------------
| Gathering project list Apache Axis 2.0 - MTOM Policy
| Memory: 29M/41M
+----------------------------------------
+----------------------------------------
| Gathering project list Apache Axis 2.0 - Savan
| Memory: 29M/41M
+----------------------------------------
+----------------------------------------
| Gathering project list Apache Axis 2.0 - soapmonitor
| Memory: 29M/41M
+----------------------------------------

multiproject:goal:
Starting the reactor...
Our processing order:
Apache Axis 2.0 - Java2WSDL
Apache Axis 2.0 - Kernel
Apache Axis 2.0 - Data Binding
Apache Axis 2.0 - Code Generation
Apache Axis 2.0 - ADB Codegen
Apache Axis 2.0 - Addressing
Apache Axis 2.0 - JiBX Data Binding
Apache Axis 2.0 - Security Policy
Apache Axis 2.0 - XMLBeans Data Binding
Apache Axis 2.0 - Rahas
Apache Axis 2.0 - Security
Apache Axis 2.0 - Samples
Apache Axis 2.0 - spring
Apache Axis 2.0 - Tools
Apache Axis 2.0 - Integration
Apache Axis 2.0 - JAXB-RI Data Binding
Apache Axis 2.0 - SAAJ API
Apache Axis 2.0 - JAXWS API
Apache Axis 2.0 - SAAJ
Apache Axis 2.0 - Metadata
Apache Axis 2.0 - JAX-WS
Apache Axis 2.0 - JSON
Apache Axis 2.0 - MTOM Policy
Apache Axis 2.0 - Savan
Apache Axis 2.0 - soapmonitor
+----------------------------------------
| Executing multiproject:install-callback Apache Axis 2.0 - Java2WSDL
| Memory: 29M/41M
+----------------------------------------
DEPRECATED: the default goal should be specified in the <build> section of project.xml
instead of maven.xml
DEPRECATED: the default goal should be specified in the <build> section of project.xml
instead of maven.xml
Trying to get missing/snapshot dependencies required by Apache Axis 2.0 - Java2WSDL:
Attempting to download axiom-api-SNAPSHOT.jar.
4/124K
8/124K
12/124K
13/124K
17/124K
21/124K
25/124K
28/124K
32/124K
36/124K
40/124K
44/124K
48/124K
52/124K
53/124K
57/124K
59/124K
63/124K
66/124K
70/124K
73/124K
77/124K
80/124K
84/124K
88/124K
92/124K
95/124K
99/124K
102/124K
106/124K
109/124K
113/124K
116/124K
120/124K
124/124K
124K downloaded
Error retrieving artifact from [http://people.apache.org/repo/m1-snapshot-repository/]: org.apache.maven.verifier.ChecksumVerificationException:
Error retrieving checksum file for /org.apache.ws.commons.axiom/jars/axiom-api-SNAPSHOT.jar
Skipping download as local copy is up to date!
Attempting to download axiom-impl-SNAPSHOT.jar.
4/108K
8/108K
12/108K
13/108K
17/108K
21/108K
25/108K
28/108K
32/108K
32/108K
36/108K
39/108K
43/108K
46/108K
50/108K
53/108K
57/108K
59/108K
63/108K
66/108K
70/108K
73/108K
77/108K
80/108K
84/108K
88/108K
92/108K
95/108K
99/108K
102/108K
106/108K
108/108K
108K downloaded
Error retrieving artifact from [http://people.apache.org/repo/m1-snapshot-repository/]: org.apache.maven.verifier.ChecksumVerificationException:
Error retrieving checksum file for /org.apache.ws.commons.axiom/jars/axiom-impl-SNAPSHOT.jar
Skipping download as local copy is up to date!
build:start:

multiproject:install-callback:
    [echo] Running jar:install for Apache Axis 2.0 - Java2WSDL
java:prepare-filesystem:
    [mkdir] Created dir: /export/home/illsleyd/continuum/continuum-1.0.3/apps/continuum/working-directory/1/modules/java2wsdl/target/classes
Running post goal: java:prepare-filesystem

java:compile:
    [echo] Compiling to /export/home/illsleyd/continuum/continuum-1.0.3/apps/continuum/working-directory/1/modules/java2wsdl/target/classes
    [javac] Compiling 22 source files to /export/home/illsleyd/continuum/continuum-1.0.3/apps/continuum/working-directory/1/modules/java2wsdl/target/classes

java:jar-resources:
Copying 2 files to /export/home/illsleyd/continuum/continuum-1.0.3/apps/continuum/working-directory/1/modules/java2wsdl/target/classes/META-INF

test:test:
    [echo] No tests to run.

jar:jar:
    [jar] Building jar: /export/home/illsleyd/continuum/continuum-1.0.3/apps/continuum/working-directory/1/modules/java2wsdl/target/axis2-java2wsdl-SNAPSHOT.jar

jar:install:
    [echo] Installing...
Uploading to org.apache.axis2/jars/axis2-java2wsdl-SNAPSHOT.jar: 
.................... (55K)
Uploading to org.apache.axis2/poms/axis2-java2wsdl-SNAPSHOT.pom: 
.................... (14K)

+----------------------------------------
| Executing multiproject:install-callback Apache Axis 2.0 - Kernel
| Memory: 28M/40M
+----------------------------------------
DEPRECATED: the default goal should be specified in the <build> section of project.xml
instead of maven.xml
DEPRECATED: the default goal should be specified in the <build> section of project.xml
instead of maven.xml

build:end:

Trying to get missing/snapshot dependencies required by Apache Axis 2.0 - Kernel:
Attempting to download axis2-java2wsdl-SNAPSHOT.jar.
Skipping download as local copy is up to date!
Attempting to download neethi-SNAPSHOT.jar.
4/28K
8/28K
12/28K
13/28K
17/28K
21/28K
25/28K
28/28K
28K downloaded
Error retrieving artifact from [http://people.apache.org/repo/m1-snapshot-repository/]: org.apache.maven.verifier.ChecksumVerificationException:
Error retrieving checksum file for /org.apache.neethi/jars/neethi-SNAPSHOT.jar
Skipping download as local copy is up to date!
Attempting to download woden-1.0-incubating-SNAPSHOT.jar.
4/302K
8/302K
12/302K
13/302K
17/302K
21/302K
25/302K
28/302K
32/302K
32/302K
36/302K
39/302K
43/302K
46/302K
50/302K
53/302K
57/302K
59/302K
63/302K
66/302K
70/302K
73/302K
77/302K
80/302K
84/302K
88/302K
92/302K
95/302K
99/302K
103/302K
107/302K
109/302K
113/302K
116/302K
120/302K
123/302K
127/302K
130/302K
134/302K
138/302K
142/302K
145/302K
149/302K
152/302K
156/302K
159/302K
163/302K
166/302K
170/302K
173/302K
177/302K
180/302K
184/302K
187/302K
191/302K
195/302K
199/302K
202/302K
206/302K
209/302K
213/302K
216/302K
220/302K
223/302K
227/302K
230/302K
234/302K
237/302K
241/302K
244/302K
248/302K
252/302K
256/302K
259/302K
263/302K
266/302K
270/302K
273/302K
277/302K
280/302K
284/302K
287/302K
291/302K
294/302K
298/302K
302/302K
302/302K
302K downloaded
*** CHECKSUM FAILED - Checksum failed on download: local = 'afa5c2b87c133cfe461c2fa4ffad1894';
remote = '658553e073272393cb170d04ea1ad0d8' - RETRYING
4/302K
8/302K
12/302K
16/302K
20/302K
24/302K
28/302K
32/302K
36/302K
40/302K
44/302K
48/302K
52/302K
56/302K
60/302K
64/302K
68/302K
72/302K
76/302K
80/302K
84/302K
88/302K
92/302K
96/302K
100/302K
104/302K
108/302K
112/302K
116/302K
118/302K
122/302K
126/302K
130/302K
133/302K
137/302K
140/302K
144/302K
147/302K
151/302K
154/302K
158/302K
161/302K
165/302K
168/302K
172/302K
175/302K
179/302K
183/302K
187/302K
190/302K
194/302K
197/302K
201/302K
204/302K
208/302K
211/302K
215/302K
218/302K
222/302K
225/302K
229/302K
232/302K
236/302K
240/302K
244/302K
247/302K
251/302K
254/302K
258/302K
261/302K
265/302K
268/302K
272/302K
275/302K
279/302K
282/302K
286/302K
290/302K
294/302K
297/302K
301/302K
302/302K
302K downloaded
Error retrieving artifact from [http://people.apache.org/repo/m1-snapshot-repository/]: org.apache.maven.verifier.ChecksumVerificationException:
Checksum failed on download: local = 'afa5c2b87c133cfe461c2fa4ffad1894'; remote = '658553e073272393cb170d04ea1ad0d8'
build:start:

multiproject:install-callback:
    [echo] Running jar:install for Apache Axis 2.0 - Kernel
java:prepare-filesystem:
    [mkdir] Created dir: /export/home/illsleyd/continuum/continuum-1.0.3/apps/continuum/working-directory/1/modules/kernel/target/classes
Running post goal: java:prepare-filesystem

java:compile:
    [echo] Compiling to /export/home/illsleyd/continuum/continuum-1.0.3/apps/continuum/working-directory/1/modules/kernel/target/classes
    [javac] Compiling 274 source files to /export/home/illsleyd/continuum/continuum-1.0.3/apps/continuum/working-directory/1/modules/kernel/target/classes
    [javac] Note: Some input files use or override a deprecated API.
    [javac] Note: Recompile with -Xlint:deprecation for details.

java:jar-resources:
Copying 1 file to /export/home/illsleyd/continuum/continuum-1.0.3/apps/continuum/working-directory/1/modules/kernel/target/classes
Copying 2 files to /export/home/illsleyd/continuum/continuum-1.0.3/apps/continuum/working-directory/1/modules/kernel/target/classes
Copying 2 files to /export/home/illsleyd/continuum/continuum-1.0.3/apps/continuum/working-directory/1/modules/kernel/target/classes/META-INF

test:test:
java:prepare-filesystem:
Running post goal: java:prepare-filesystem

java:compile:
    [echo] Compiling to /export/home/illsleyd/continuum/continuum-1.0.3/apps/continuum/working-directory/1/modules/kernel/target/classes
    [javac] Compiling 1 source file to /export/home/illsleyd/continuum/continuum-1.0.3/apps/continuum/working-directory/1/modules/kernel/target/classes

java:jar-resources:

test:prepare-filesystem:
    [mkdir] Created dir: /export/home/illsleyd/continuum/continuum-1.0.3/apps/continuum/working-directory/1/modules/kernel/target/test-classes
    [mkdir] Created dir: /export/home/illsleyd/continuum/continuum-1.0.3/apps/continuum/working-directory/1/modules/kernel/target/test-reports

test:test-resources:
Copying 61 files to /export/home/illsleyd/continuum/continuum-1.0.3/apps/continuum/working-directory/1/modules/kernel/target/test-classes/../test-resources

test:compile:
    [javac] Compiling 91 source files to /export/home/illsleyd/continuum/continuum-1.0.3/apps/continuum/working-directory/1/modules/kernel/target/test-classes
    [javac] Note: Some input files use or override a deprecated API.
    [javac] Note: Recompile with -Xlint:deprecation for details.
Running post goal: test:compile
    [echo] the files are up to date = ${jars.uptodate}
    [mkdir] Created dir: /export/home/illsleyd/continuum/continuum-1.0.3/apps/continuum/working-directory/1/modules/kernel/test-resources/deployment/service2/build/classes
    [mkdir] Created dir: /export/home/illsleyd/continuum/continuum-1.0.3/apps/continuum/working-directory/1/modules/kernel/test-resources/deployment/service2/build/lib
    [copy] Copying 1 file to /export/home/illsleyd/continuum/continuum-1.0.3/apps/continuum/working-directory/1/modules/kernel/test-resources/deployment/service2/build/classes/META-INF
    [mkdir] Created dir: /export/home/illsleyd/continuum/continuum-1.0.3/apps/continuum/working-directory/1/modules/kernel/target/test-resources/deployment/services
    [jar] Building jar: /export/home/illsleyd/continuum/continuum-1.0.3/apps/continuum/working-directory/1/modules/kernel/target/test-resources/deployment/services/service2.jar
    [delete] Deleting directory /export/home/illsleyd/continuum/continuum-1.0.3/apps/continuum/working-directory/1/modules/kernel/test-resources/deployment/service2/build
    [echo] the files are up to date = ${jars.uptodate}
    [mkdir] Created dir: /export/home/illsleyd/continuum/continuum-1.0.3/apps/continuum/working-directory/1/modules/kernel/test-resources/deployment/echo/build/classes
    [mkdir] Created dir: /export/home/illsleyd/continuum/continuum-1.0.3/apps/continuum/working-directory/1/modules/kernel/test-resources/deployment/echo/build/lib
    [copy] Copying 1 file to /export/home/illsleyd/continuum/continuum-1.0.3/apps/continuum/working-directory/1/modules/kernel/test-resources/deployment/echo/build/classes/META-INF
    [mkdir] Created dir: /export/home/illsleyd/continuum/continuum-1.0.3/apps/continuum/working-directory/1/modules/kernel/target/echo
    [jar] Building jar: /export/home/illsleyd/continuum/continuum-1.0.3/apps/continuum/working-directory/1/modules/kernel/target/echo/echo.aar
    [delete] Deleting directory /export/home/illsleyd/continuum/continuum-1.0.3/apps/continuum/working-directory/1/modules/kernel/test-resources/deployment/echo/build
    [echo] the files are up to date = ${jars.uptodate}
    [mkdir] Created dir: /export/home/illsleyd/continuum/continuum-1.0.3/apps/continuum/working-directory/1/modules/kernel/test-resources/deployment/invalidservice/build/classes
    [mkdir] Created dir: /export/home/illsleyd/continuum/continuum-1.0.3/apps/continuum/working-directory/1/modules/kernel/test-resources/deployment/invalidservice/build/lib
    [copy] Copying 1 file to /export/home/illsleyd/continuum/continuum-1.0.3/apps/continuum/working-directory/1/modules/kernel/test-resources/deployment/invalidservice/build/classes/META-INF
    [mkdir] Created dir: /export/home/illsleyd/continuum/continuum-1.0.3/apps/continuum/working-directory/1/modules/kernel/target/test-resources/InvalidDeployment/services
    [jar] Building jar: /export/home/illsleyd/continuum/continuum-1.0.3/apps/continuum/working-directory/1/modules/kernel/target/test-resources/InvalidDeployment/services/invalidService.jar
    [delete] Deleting directory /export/home/illsleyd/continuum/continuum-1.0.3/apps/continuum/working-directory/1/modules/kernel/test-resources/deployment/invalidservice/build
    [echo] the files are up to date = ${jars.uptodate}
    [mkdir] Created dir: /export/home/illsleyd/continuum/continuum-1.0.3/apps/continuum/working-directory/1/modules/kernel/test-resources/deployment/outservice/build/classes
    [mkdir] Created dir: /export/home/illsleyd/continuum/continuum-1.0.3/apps/continuum/working-directory/1/modules/kernel/test-resources/deployment/outservice/build/lib
    [copy] Copying 1 file to /export/home/illsleyd/continuum/continuum-1.0.3/apps/continuum/working-directory/1/modules/kernel/test-resources/deployment/outservice/build/classes/META-INF
    [jar] Building jar: /export/home/illsleyd/continuum/continuum-1.0.3/apps/continuum/working-directory/1/modules/kernel/target/test-resources/deployment/services/OutService.jar
    [delete] Deleting directory /export/home/illsleyd/continuum/continuum-1.0.3/apps/continuum/working-directory/1/modules/kernel/test-resources/deployment/outservice/build
    [echo] the files are up to date = ${jars.uptodate}
    [mkdir] Created dir: /export/home/illsleyd/continuum/continuum-1.0.3/apps/continuum/working-directory/1/modules/kernel/test-resources/deployment/module1/build/classes
    [mkdir] Created dir: /export/home/illsleyd/continuum/continuum-1.0.3/apps/continuum/working-directory/1/modules/kernel/test-resources/deployment/module1/build/lib
    [copy] Copying 1 file to /export/home/illsleyd/continuum/continuum-1.0.3/apps/continuum/working-directory/1/modules/kernel/test-resources/deployment/module1/build/classes/META-INF
    [mkdir] Created dir: /export/home/illsleyd/continuum/continuum-1.0.3/apps/continuum/working-directory/1/modules/kernel/target/test-resources/deployment/modules
    [jar] Building jar: /export/home/illsleyd/continuum/continuum-1.0.3/apps/continuum/working-directory/1/modules/kernel/target/test-resources/deployment/modules/module1.mar
    [delete] Deleting directory /export/home/illsleyd/continuum/continuum-1.0.3/apps/continuum/working-directory/1/modules/kernel/test-resources/deployment/module1/build
    [echo] the files are up to date = ${jars.uptodate}
    [mkdir] Created dir: /export/home/illsleyd/continuum/continuum-1.0.3/apps/continuum/working-directory/1/modules/kernel/test-resources/deployment/serviceModule/build/classes
    [mkdir] Created dir: /export/home/illsleyd/continuum/continuum-1.0.3/apps/continuum/working-directory/1/modules/kernel/test-resources/deployment/serviceModule/build/lib
    [copy] Copying 1 file to /export/home/illsleyd/continuum/continuum-1.0.3/apps/continuum/working-directory/1/modules/kernel/test-resources/deployment/serviceModule/build/classes/META-INF
    [mkdir] Created dir: /export/home/illsleyd/continuum/continuum-1.0.3/apps/continuum/working-directory/1/modules/kernel/target/test-resources/InvalidDeployment/modules
    [jar] Building jar: /export/home/illsleyd/continuum/continuum-1.0.3/apps/continuum/working-directory/1/modules/kernel/target/test-resources/InvalidDeployment/modules/serviceModule.jar
    [delete] Deleting directory /export/home/illsleyd/continuum/continuum-1.0.3/apps/continuum/working-directory/1/modules/kernel/test-resources/deployment/serviceModule/build
    [mkdir] Created dir: /export/home/illsleyd/continuum/continuum-1.0.3/apps/continuum/working-directory/1/modules/kernel/target/test-resources/java2sec/more
    [mkdir] Created dir: /export/home/illsleyd/continuum/continuum-1.0.3/apps/continuum/working-directory/1/modules/kernel/target/test-resources/java2sec/less
    [jar] Building jar: /export/home/illsleyd/continuum/continuum-1.0.3/apps/continuum/working-directory/1/modules/kernel/target/test-resources/java2sec/more/MorePermission.jar
    [delete] Deleting directory /export/home/illsleyd/continuum/continuum-1.0.3/apps/continuum/working-directory/1/modules/kernel/target/test-classes/org/apache/axis2/java/security/driver
    [delete] Deleting directory /export/home/illsleyd/continuum/continuum-1.0.3/apps/continuum/working-directory/1/modules/kernel/target/test-classes/org/apache/axis2/java/security/more
    [delete] Deleting directory /export/home/illsleyd/continuum/continuum-1.0.3/apps/continuum/working-directory/1/modules/kernel/target/test-classes/org/apache/axis2/java/security/action
    [delete] Deleting directory /export/home/illsleyd/continuum/continuum-1.0.3/apps/continuum/working-directory/1/modules/kernel/target/test-classes/org/apache/axis2/java/security/interf
    [jar] Building jar: /export/home/illsleyd/continuum/continuum-1.0.3/apps/continuum/working-directory/1/modules/kernel/target/test-resources/java2sec/less/LessPermission.jar
    [delete] Deleting directory /export/home/illsleyd/continuum/continuum-1.0.3/apps/continuum/working-directory/1/modules/kernel/target/test-classes/org/apache/axis2/java/security/less

    [junit] Running org.apache.axis2.addressing.AddressingHelperTest
    [junit] Tests run: 6, Failures: 0, Errors: 0, Time elapsed: 0.807 sec
    [junit] Running org.apache.axis2.addressing.EndpointReferenceHelperTest
    [junit] Tests run: 2, Failures: 0, Errors: 0, Time elapsed: 0.51 sec
    [junit] Running org.apache.axis2.addressing.EndpointReferenceTypeTest
    [junit] Tests run: 4, Failures: 0, Errors: 0, Time elapsed: 0.555 sec
    [junit] Running org.apache.axis2.addressing.miheaders.RelatesToTest
    [junit] Tests run: 3, Failures: 0, Errors: 0, Time elapsed: 0.379 sec
    [junit] Running org.apache.axis2.addressing.wsdl.WSDL11ActionHelperTest
    [junit] Tests run: 8, Failures: 0, Errors: 0, Time elapsed: 0.862 sec
    [junit] Running org.apache.axis2.context.ContextHierarchyTest
    [junit] Tests run: 2, Failures: 0, Errors: 0, Time elapsed: 1.066 sec
    [junit] Running org.apache.axis2.context.OperationContextTest
    [junit] Tests run: 1, Failures: 0, Errors: 0, Time elapsed: 1.013 sec
    [junit] Running org.apache.axis2.deployment.AddingObserverTest
    [junit] Tests run: 1, Failures: 0, Errors: 0, Time elapsed: 5.258 sec
    [junit] Running org.apache.axis2.deployment.AxisMessageTest
    [junit] Tests run: 1, Failures: 0, Errors: 0, Time elapsed: 1.339 sec
    [junit] Running org.apache.axis2.deployment.BadModuleTest
    [junit] Tests run: 1, Failures: 0, Errors: 0, Time elapsed: 0.645 sec
    [junit] Running org.apache.axis2.deployment.BuildERWithDeploymentTest
    [junit] Tests run: 1, Failures: 0, Errors: 0, Time elapsed: 1.625 sec
    [junit] Running org.apache.axis2.deployment.BuilderSelectorDeploymentTest
    [junit] Tests run: 2, Failures: 0, Errors: 0, Time elapsed: 1.28 sec
    [junit] Running org.apache.axis2.deployment.DeploymentTotalTest
    [junit] Tests run: 1, Failures: 0, Errors: 0, Time elapsed: 1.405 sec
    [junit] Running org.apache.axis2.deployment.MessageFormatterDeploymentTest
    [junit] Tests run: 2, Failures: 0, Errors: 0, Time elapsed: 1.146 sec
    [junit] Running org.apache.axis2.deployment.ModifiedConfigFileTest
    [junit] Tests run: 1, Failures: 0, Errors: 0, Time elapsed: 0.956 sec
    [junit] Running org.apache.axis2.deployment.ModuleDisengagementTest
    [junit] Tests run: 7, Failures: 0, Errors: 0, Time elapsed: 1.592 sec
    [junit] Running org.apache.axis2.deployment.ModuleversionTest
    [junit] Tests run: 2, Failures: 0, Errors: 0, Time elapsed: 3.342 sec
    [junit] Running org.apache.axis2.deployment.OperationExcludeTest
    [junit] Tests run: 1, Failures: 0, Errors: 0, Time elapsed: 1.581 sec
    [junit] Running org.apache.axis2.deployment.SameServiceAddingTest
    [junit] Tests run: 1, Failures: 0, Errors: 0, Time elapsed: 1.102 sec
    [junit] Running org.apache.axis2.deployment.ServiceGroupTest
    [junit] Tests run: 1, Failures: 0, Errors: 0, Time elapsed: 5.783 sec
    [junit] Running org.apache.axis2.deployment.SystemPhasesremovedTest
    [junit] Tests run: 1, Failures: 0, Errors: 0, Time elapsed: 0.838 sec
    [junit] Running org.apache.axis2.deployment.TransportDeploymentTest
    [junit] Tests run: 1, Failures: 0, Errors: 0, Time elapsed: 1.277 sec
    [junit] Running org.apache.axis2.description.RegistryTest
    [junit] Tests run: 5, Failures: 0, Errors: 0, Time elapsed: 1.647 sec
    [junit] Running org.apache.axis2.description.WSDLToAllServicesBuilderTest
    [junit] Tests run: 2, Failures: 0, Errors: 0, Time elapsed: 4.169 sec
    [junit] Running org.apache.axis2.dispatchers.ActionBasedOperationDispatchTest
    [junit] Tests run: 1, Failures: 0, Errors: 0, Time elapsed: 0.763 sec
    [junit] Running org.apache.axis2.dispatchers.RelatesToBasedOperationDispatcherTest
    [junit] Tests run: 1, Failures: 0, Errors: 0, Time elapsed: 0.944 sec
    [junit] Running org.apache.axis2.dispatchers.RelatesToBasedServiceDispatcherTest
    [junit] Tests run: 1, Failures: 0, Errors: 0, Time elapsed: 1.041 sec
    [junit] Running org.apache.axis2.dispatchers.RequestURIBasedOperationDispatcherTest
    [junit] Tests run: 1, Failures: 0, Errors: 0, Time elapsed: 0.813 sec
    [junit] Running org.apache.axis2.dispatchers.RequestURIBasedServiceDispatcherTest
    [junit] Tests run: 1, Failures: 0, Errors: 0, Time elapsed: 0.79 sec
    [junit] Running org.apache.axis2.dispatchers.SOAPMessageBodyBasedOperationDispatcherTest
    [junit] Tests run: 1, Failures: 0, Errors: 0, Time elapsed: 0.958 sec
    [junit] Running org.apache.axis2.dispatchers.SOAPMessageBodyBasedServiceDispatcherTest
    [junit] Tests run: 1, Failures: 0, Errors: 0, Time elapsed: 1.094 sec
    [junit] Running org.apache.axis2.engine.EnginePausingTest
    [junit] Tests run: 1, Failures: 0, Errors: 0, Time elapsed: 0.938 sec
    [junit] Running org.apache.axis2.engine.MessageContextChangeTest
    [junit] Tests run: 1, Failures: 1, Errors: 0, Time elapsed: 1.005 sec

BUILD FAILED
File...... file:/export/home/illsleyd/.maven/cache/maven-multiproject-plugin-1.5-SNAPSHOT/plugin.jelly
Element... maven:reactor
Line...... 227
Column.... 64
Unable to obtain goal [multiproject:install-callback] -- file:/export/home/illsleyd/.maven/cache/maven-test-plugin-1.8.1-SNAPSHOT/plugin.jelly:155:49:
<junit> Test org.apache.axis2.engine.MessageContextChangeTest failed
Total time   : 3 minutes 12 seconds 
Finished at  : Sunday, February 4, 2007 11:09:46 PM GMT+00:00


****************************************************************************



---------------------------------------------------------------------
To unsubscribe, e-mail: axis-dev-unsubscribe@ws.apache.org
For additional commands, e-mail: axis-dev-help@ws.apache.org


Mime
View raw message