axis-java-dev mailing list archives

Site index · List index
Message view « Date » · « Thread »
Top « Date » · « Thread »
From "davidillsley (Continuum)" <davidills...@apache.org>
Subject [continuum] BUILD FAILURE: Axis2
Date Wed, 07 Feb 2007 23:18:19 GMT
Online report : http://localhost:8080/continuum/servlet/continuum/target/ProjectBuild.vm/view/ProjectBuild/id/1/buildId/744
Build statistics:
  State: Failed
  Previous State: Failed
  Started at: Wed, 7 Feb 2007 22:10:39 +0000
  Finished at: Wed, 7 Feb 2007 23:17:53 +0000
  Total time: 1h 7m 14s
  Build Trigger: Schedule
  Exit code: 70
  Building machine hostname: ws.zones.apache.org
  Operating system : SunOS(unknown)
  Java version : 1.5.0_09(Sun Microsystems Inc.)

Changes
         nthaker          Axis2-2115

Contributor - Dustin Amrhein
             /webservices/axis2/trunk/java/modules/metadata/src/org/apache/axis2/jaxws/description/impl/EndpointDescriptionImpl.java
            /webservices/axis2/trunk/java/modules/metadata/src/org/apache/axis2/jaxws/description/impl/URIResolverImpl.java
           dims          flatten the tests, much easier to run each test separately.
             /webservices/axis2/trunk/java/modules/jaxws/pom.xml
            /webservices/axis2/trunk/java/modules/jaxws/project.xml
            /webservices/axis2/trunk/java/modules/jaxws/src/org/apache/axis2/jaxws/client/JAXBDispatch.java
            /webservices/axis2/trunk/java/modules/jaxws/src/org/apache/axis2/jaxws/client/XMLDispatch.java
            /webservices/axis2/trunk/java/modules/jaxws/test/org/apache/axis2/jaxws/anytype/tests/AnyTypeTests.java
            /webservices/axis2/trunk/java/modules/jaxws/test/org/apache/axis2/jaxws/attachments/MTOMSerializationTests.java
            /webservices/axis2/trunk/java/modules/jaxws/test/org/apache/axis2/jaxws/client/ClientConfigTests.java
            /webservices/axis2/trunk/java/modules/jaxws/test/org/apache/axis2/jaxws/client/DispatchSoapActionTests.java
            /webservices/axis2/trunk/java/modules/jaxws/test/org/apache/axis2/jaxws/client/PropertyValueTests.java
            /webservices/axis2/trunk/java/modules/jaxws/test/org/apache/axis2/jaxws/client/ProxySoapActionTests.java
            /webservices/axis2/trunk/java/modules/jaxws/test/org/apache/axis2/jaxws/databinding/BindingToProtocolTests.java
            /webservices/axis2/trunk/java/modules/jaxws/test/org/apache/axis2/jaxws/description/AnnotationDescriptionTests.java
            /webservices/axis2/trunk/java/modules/jaxws/test/org/apache/axis2/jaxws/description/GetDescFromBindingProviderTests.java
            /webservices/axis2/trunk/java/modules/jaxws/test/org/apache/axis2/jaxws/description/PortSelectionTests.java
            /webservices/axis2/trunk/java/modules/jaxws/test/org/apache/axis2/jaxws/description/ServiceTests.java
            /webservices/axis2/trunk/java/modules/jaxws/test/org/apache/axis2/jaxws/description/WSDLDescriptionTests.java
            /webservices/axis2/trunk/java/modules/jaxws/test/org/apache/axis2/jaxws/description/WSDLTests.java
            /webservices/axis2/trunk/java/modules/jaxws/test/org/apache/axis2/jaxws/dispatch/DOMSourceDispatch.java
            /webservices/axis2/trunk/java/modules/jaxws/test/org/apache/axis2/jaxws/dispatch/DOMSourceDispatchTest.java (from /webservices/axis2/trunk/java/modules/jaxws/test/org/apache/axis2/jaxws/dispatch/DOMSourceDispatch.java:504631)
            /webservices/axis2/trunk/java/modules/jaxws/test/org/apache/axis2/jaxws/dispatch/DispatchTestSuite.java
            /webservices/axis2/trunk/java/modules/jaxws/test/org/apache/axis2/jaxws/dispatch/JAXBDispatch.java
            /webservices/axis2/trunk/java/modules/jaxws/test/org/apache/axis2/jaxws/dispatch/JAXBDispatchTest.java (from /webservices/axis2/trunk/java/modules/jaxws/test/org/apache/axis2/jaxws/dispatch/JAXBDispatch.java:504631)
            /webservices/axis2/trunk/java/modules/jaxws/test/org/apache/axis2/jaxws/dispatch/JAXBSourceDispatch.java
            /webservices/axis2/trunk/java/modules/jaxws/test/org/apache/axis2/jaxws/dispatch/JAXBSourceDispatchTest.java (from /webservices/axis2/trunk/java/modules/jaxws/test/org/apache/axis2/jaxws/dispatch/JAXBSourceDispatch.java:504631)
            /webservices/axis2/trunk/java/modules/jaxws/test/org/apache/axis2/jaxws/dispatch/SAXSourceDispatch.java
            /webservices/axis2/trunk/java/modules/jaxws/test/org/apache/axis2/jaxws/dispatch/SAXSourceDispatchTest.java (from /webservices/axis2/trunk/java/modules/jaxws/test/org/apache/axis2/jaxws/dispatch/SAXSourceDispatch.java:504631)
            /webservices/axis2/trunk/java/modules/jaxws/test/org/apache/axis2/jaxws/dispatch/SOAP12Dispatch.java
            /webservices/axis2/trunk/java/modules/jaxws/test/org/apache/axis2/jaxws/dispatch/SOAP12DispatchTests.java (from /webservices/axis2/trunk/java/modules/jaxws/test/org/apache/axis2/jaxws/dispatch/SOAP12Dispatch.java:504631)
            /webservices/axis2/trunk/java/modules/jaxws/test/org/apache/axis2/jaxws/dispatch/SOAPMessageDispatch.java
            /webservices/axis2/trunk/java/modules/jaxws/test/org/apache/axis2/jaxws/dispatch/SOAPMessageDispatchTest.java (from /webservices/axis2/trunk/java/modules/jaxws/test/org/apache/axis2/jaxws/dispatch/SOAPMessageDispatch.java:504631)
            /webservices/axis2/trunk/java/modules/jaxws/test/org/apache/axis2/jaxws/dispatch/StreamSourceDispatch.java
            /webservices/axis2/trunk/java/modules/jaxws/test/org/apache/axis2/jaxws/dispatch/StreamSourceDispatchTest.java (from /webservices/axis2/trunk/java/modules/jaxws/test/org/apache/axis2/jaxws/dispatch/StreamSourceDispatch.java:504631)
            /webservices/axis2/trunk/java/modules/jaxws/test/org/apache/axis2/jaxws/dispatch/StringDispatch.java
            /webservices/axis2/trunk/java/modules/jaxws/test/org/apache/axis2/jaxws/dispatch/StringDispatchTest.java (from /webservices/axis2/trunk/java/modules/jaxws/test/org/apache/axis2/jaxws/dispatch/StringDispatch.java:504631)
            /webservices/axis2/trunk/java/modules/jaxws/test/org/apache/axis2/jaxws/exception/ExceptionFactoryTests.java
            /webservices/axis2/trunk/java/modules/jaxws/test/org/apache/axis2/jaxws/framework/AbstractTestCase.java
            /webservices/axis2/trunk/java/modules/jaxws/test/org/apache/axis2/jaxws/framework/JAXWSTest.java
            /webservices/axis2/trunk/java/modules/jaxws/test/org/apache/axis2/jaxws/handler/HandlerChainProcessorTests.java
            /webservices/axis2/trunk/java/modules/jaxws/test/org/apache/axis2/jaxws/i18n/JaxwsMessageBundleTests.java
            /webservices/axis2/trunk/java/modules/jaxws/test/org/apache/axis2/jaxws/injection/ResourceInjectionTests.java
            /webservices/axis2/trunk/java/modules/jaxws/test/org/apache/axis2/jaxws/lifecycle/EndpointLifecycleTests.java
            /webservices/axis2/trunk/java/modules/jaxws/test/org/apache/axis2/jaxws/message/BlockTests.java
            /webservices/axis2/trunk/java/modules/jaxws/test/org/apache/axis2/jaxws/message/FaultTests.java
            /webservices/axis2/trunk/java/modules/jaxws/test/org/apache/axis2/jaxws/message/MessageTests.java
            /webservices/axis2/trunk/java/modules/jaxws/test/org/apache/axis2/jaxws/message/SAAJConverterTests.java
            /webservices/axis2/trunk/java/modules/jaxws/test/org/apache/axis2/jaxws/message/SOAP12Tests.java
            /webservices/axis2/trunk/java/modules/jaxws/test/org/apache/axis2/jaxws/message/XMLStreamReaderSplitterTests.java
            /webservices/axis2/trunk/java/modules/jaxws/test/org/apache/axis2/jaxws/nonanonymous/complextype/NonAnonymousComplexTypeTests.java
            /webservices/axis2/trunk/java/modules/jaxws/test/org/apache/axis2/jaxws/polymorphic/shape/tests/PolymorphicTests.java
            /webservices/axis2/trunk/java/modules/jaxws/test/org/apache/axis2/jaxws/provider/JAXBProviderTests.java
            /webservices/axis2/trunk/java/modules/jaxws/test/org/apache/axis2/jaxws/provider/ProviderTestCase.java
            /webservices/axis2/trunk/java/modules/jaxws/test/org/apache/axis2/jaxws/provider/SoapMessageProviderTests.java
            /webservices/axis2/trunk/java/modules/jaxws/test/org/apache/axis2/jaxws/provider/SourceMessageProviderTests.java
            /webservices/axis2/trunk/java/modules/jaxws/test/org/apache/axis2/jaxws/provider/SourceProviderTests.java
            /webservices/axis2/trunk/java/modules/jaxws/test/org/apache/axis2/jaxws/provider/StringMessageProviderTests.java
            /webservices/axis2/trunk/java/modules/jaxws/test/org/apache/axis2/jaxws/provider/StringProviderTests.java
            /webservices/axis2/trunk/java/modules/jaxws/test/org/apache/axis2/jaxws/proxy/GorillaDLWProxyTests.java
            /webservices/axis2/trunk/java/modules/jaxws/test/org/apache/axis2/jaxws/proxy/ProxyNonWrappedTests.java
            /webservices/axis2/trunk/java/modules/jaxws/test/org/apache/axis2/jaxws/proxy/ProxyTests.java
            /webservices/axis2/trunk/java/modules/jaxws/test/org/apache/axis2/jaxws/proxy/RPCProxyTests.java
            /webservices/axis2/trunk/java/modules/jaxws/test/org/apache/axis2/jaxws/proxy/SOAP12ProxyTests.java
            /webservices/axis2/trunk/java/modules/jaxws/test/org/apache/axis2/jaxws/sample/AddNumbersTests.java
            /webservices/axis2/trunk/java/modules/jaxws/test/org/apache/axis2/jaxws/sample/AddressBookTests.java
            /webservices/axis2/trunk/java/modules/jaxws/test/org/apache/axis2/jaxws/sample/BareTests.java
            /webservices/axis2/trunk/java/modules/jaxws/test/org/apache/axis2/jaxws/sample/FaultsServiceTests.java
            /webservices/axis2/trunk/java/modules/jaxws/test/org/apache/axis2/jaxws/sample/FaultyWebServiceTests.java
            /webservices/axis2/trunk/java/modules/jaxws/test/org/apache/axis2/jaxws/sample/MtomSampleByteArrayTests.java
            /webservices/axis2/trunk/java/modules/jaxws/test/org/apache/axis2/jaxws/sample/MtomSampleTests.java
            /webservices/axis2/trunk/java/modules/jaxws/test/org/apache/axis2/jaxws/sample/NonWrapTests.java
            /webservices/axis2/trunk/java/modules/jaxws/test/org/apache/axis2/jaxws/sample/ParallelAsyncTests.java
            /webservices/axis2/trunk/java/modules/jaxws/test/org/apache/axis2/jaxws/sample/WSGenTests.java
            /webservices/axis2/trunk/java/modules/jaxws/test/org/apache/axis2/jaxws/sample/WrapTests.java
            /webservices/axis2/trunk/java/modules/jaxws/test/org/apache/axis2/jaxws/sample/wsgen/client/WSGenService.java
            /webservices/axis2/trunk/java/modules/jaxws/test/org/apache/axis2/jaxws/security/BasicAuthSecurityTests.java
        
****************************************************************************
Output:
****************************************************************************
 __  __
|  \/  |__ _Apache__ ___
| |\/| / _` \ V / -_) ' \  ~ intelligent projects ~
|_|  |_\__,_|\_/\___|_||_|  v. 1.1-beta-3

DEPRECATED: the default goal should be specified in the <build> section of project.xml instead of maven.xml
DEPRECATED: the default goal should be specified in the <build> section of project.xml instead of maven.xml
Trying to get missing/snapshot dependencies required by Apache Axis2:
Attempting to download maven-test-plugin-1.8.1-SNAPSHOT.jar.
Skipping download as local copy is up to date!
Attempting to download maven-multiproject-plugin-1.5-SNAPSHOT.jar.
Skipping download as local copy is up to date!
Attempting to download maven-jar-plugin-1.8-SNAPSHOT.jar.
Skipping download as local copy is up to date!
Attempting to download maven-plugin-plugin-1.8-SNAPSHOT.jar.
Skipping download as local copy is up to date!
    [echo] 1.5
    [echo] 
            JDK 1.5 detected, including the following modules:
            modules/metadata/project.xml,modules/saaj-api/project.xml,modules/saaj/project.xml,modules/jaxbri/project.xml,modules/jaxws/project.xml,modules/jaxws-api/project.xml,modules/json/project.xml
        
build:start:

clean:
modules:clean:
modules:reactor:init:
plugin:download-artifact:

    [echo] Adding to modules.reactor.includes: modules/adb-codegen/project.xml
    [echo] Adding to modules.reactor.includes: modules/adb/project.xml
    [echo] Adding to modules.reactor.includes: modules/addressing/project.xml
    [echo] Adding to modules.reactor.includes: modules/codegen/project.xml
    [echo] Adding to modules.reactor.includes: modules/integration/project.xml
    [echo] Adding to modules.reactor.includes: modules/java2wsdl/project.xml
    [echo] Adding to modules.reactor.includes: modules/jaxbri/project.xml
    [echo] Adding to modules.reactor.includes: modules/jaxws-api/project.xml
    [echo] Adding to modules.reactor.includes: modules/jaxws/project.xml
    [echo] Adding to modules.reactor.includes: modules/jibx/project.xml
    [echo] Adding to modules.reactor.includes: modules/json/project.xml
    [echo] Adding to modules.reactor.includes: modules/kernel/project.xml
    [echo] Adding to modules.reactor.includes: modules/metadata/project.xml
    [echo] Adding to modules.reactor.includes: modules/mtompolicy/project.xml
    [echo] Adding to modules.reactor.includes: modules/saaj-api/project.xml
    [echo] Adding to modules.reactor.includes: modules/saaj/project.xml
    [echo] Adding to modules.reactor.includes: modules/samples/project.xml
    [echo] Adding to modules.reactor.includes: modules/savan/project.xml
    [echo] Adding to modules.reactor.includes: modules/soapmonitor/project.xml
    [echo] Adding to modules.reactor.includes: modules/spring/project.xml
    [echo] Adding to modules.reactor.includes: modules/tool/project.xml
    [echo] Adding to modules.reactor.includes: modules/webapp/project.xml
    [echo] Adding to modules.reactor.includes: modules/xmlbeans/project.xml

    [echo] +----------------------------------------
    [echo] | Cleaning: modules/adb-codegen
    [echo] +----------------------------------------
    [delete] Deleting directory /export/home/illsleyd/continuum/continuum-1.0.3/apps/continuum/working-directory/1/modules/adb-codegen/target
    [echo] 
    [echo] +----------------------------------------
    [echo] | Cleaning: modules/adb
    [echo] +----------------------------------------
    [delete] Deleting directory /export/home/illsleyd/continuum/continuum-1.0.3/apps/continuum/working-directory/1/modules/adb/target
    [echo] 
    [echo] +----------------------------------------
    [echo] | Cleaning: modules/addressing
    [echo] +----------------------------------------
    [delete] Deleting directory /export/home/illsleyd/continuum/continuum-1.0.3/apps/continuum/working-directory/1/modules/addressing/target
    [echo] 
    [echo] +----------------------------------------
    [echo] | Cleaning: modules/codegen
    [echo] +----------------------------------------
    [delete] Deleting directory /export/home/illsleyd/continuum/continuum-1.0.3/apps/continuum/working-directory/1/modules/codegen/target
    [echo] 
    [echo] +----------------------------------------
    [echo] | Cleaning: modules/integration
    [echo] +----------------------------------------
    [delete] Deleting directory /export/home/illsleyd/continuum/continuum-1.0.3/apps/continuum/working-directory/1/modules/integration/target
    [echo] 
    [echo] +----------------------------------------
    [echo] | Cleaning: modules/java2wsdl
    [echo] +----------------------------------------
    [delete] Deleting directory /export/home/illsleyd/continuum/continuum-1.0.3/apps/continuum/working-directory/1/modules/java2wsdl/target
    [echo] 
    [echo] +----------------------------------------
    [echo] | Cleaning: modules/jaxbri
    [echo] +----------------------------------------
    [delete] Deleting directory /export/home/illsleyd/continuum/continuum-1.0.3/apps/continuum/working-directory/1/modules/jaxbri/target
    [echo] 
    [echo] +----------------------------------------
    [echo] | Cleaning: modules/jaxws-api
    [echo] +----------------------------------------
    [delete] Deleting directory /export/home/illsleyd/continuum/continuum-1.0.3/apps/continuum/working-directory/1/modules/jaxws-api/target
    [echo] 
    [echo] +----------------------------------------
    [echo] | Cleaning: modules/jaxws
    [echo] +----------------------------------------
    [delete] Deleting directory /export/home/illsleyd/continuum/continuum-1.0.3/apps/continuum/working-directory/1/modules/jaxws/target
    [echo] 
    [echo] +----------------------------------------
    [echo] | Cleaning: modules/jibx
    [echo] +----------------------------------------
    [echo] 
    [echo] +----------------------------------------
    [echo] | Cleaning: modules/json
    [echo] +----------------------------------------
    [echo] 
    [echo] +----------------------------------------
    [echo] | Cleaning: modules/kernel
    [echo] +----------------------------------------
    [delete] Deleting directory /export/home/illsleyd/continuum/continuum-1.0.3/apps/continuum/working-directory/1/modules/kernel/target
    [echo] 
    [echo] +----------------------------------------
    [echo] | Cleaning: modules/metadata
    [echo] +----------------------------------------
    [delete] Deleting directory /export/home/illsleyd/continuum/continuum-1.0.3/apps/continuum/working-directory/1/modules/metadata/target
    [echo] 
    [echo] +----------------------------------------
    [echo] | Cleaning: modules/mtompolicy
    [echo] +----------------------------------------
    [echo] 
    [echo] +----------------------------------------
    [echo] | Cleaning: modules/saaj-api
    [echo] +----------------------------------------
    [delete] Deleting directory /export/home/illsleyd/continuum/continuum-1.0.3/apps/continuum/working-directory/1/modules/saaj-api/target
    [echo] 
    [echo] +----------------------------------------
    [echo] | Cleaning: modules/saaj
    [echo] +----------------------------------------
    [delete] Deleting directory /export/home/illsleyd/continuum/continuum-1.0.3/apps/continuum/working-directory/1/modules/saaj/target
    [echo] 
    [echo] +----------------------------------------
    [echo] | Cleaning: modules/samples
    [echo] +----------------------------------------
    [delete] Deleting directory /export/home/illsleyd/continuum/continuum-1.0.3/apps/continuum/working-directory/1/modules/samples/target
    [echo] 
    [echo] +----------------------------------------
    [echo] | Cleaning: modules/savan
    [echo] +----------------------------------------
    [echo] 
    [echo] +----------------------------------------
    [echo] | Cleaning: modules/soapmonitor
    [echo] +----------------------------------------
    [echo] 
    [echo] +----------------------------------------
    [echo] | Cleaning: modules/spring
    [echo] +----------------------------------------
    [delete] Deleting directory /export/home/illsleyd/continuum/continuum-1.0.3/apps/continuum/working-directory/1/modules/spring/target
    [echo] 
    [echo] +----------------------------------------
    [echo] | Cleaning: modules/tool
    [echo] +----------------------------------------
    [delete] Deleting directory /export/home/illsleyd/continuum/continuum-1.0.3/apps/continuum/working-directory/1/modules/tool/target
    [echo] 
    [echo] +----------------------------------------
    [echo] | Cleaning: modules/webapp
    [echo] +----------------------------------------
    [echo] 
    [echo] +----------------------------------------
    [echo] | Cleaning: modules/xmlbeans
    [echo] +----------------------------------------
    [delete] Deleting directory /export/home/illsleyd/continuum/continuum-1.0.3/apps/continuum/working-directory/1/modules/xmlbeans/target
    [echo] 
    [echo] +----------------------------------------
    [echo] | Cleaning: target and etc/target
    [echo] +----------------------------------------


jar:
multiproject:install:
multiproject:projects-init:
    [echo] Gathering project list
Starting the reactor...
Our processing order:
Apache Axis 2.0 - Java2WSDL
Apache Axis 2.0 - Kernel
Apache Axis 2.0 - Data Binding
Apache Axis 2.0 - Code Generation
Apache Axis 2.0 - ADB Codegen
Apache Axis 2.0 - Addressing
Apache Axis 2.0 - Samples
Apache Axis 2.0 - spring
Apache Axis 2.0 - XMLBeans Data Binding
Apache Axis 2.0 - Tools
Apache Axis 2.0 - Integration
Apache Axis 2.0 - JAXB-RI Data Binding
Apache Axis 2.0 - SAAJ API
Apache Axis 2.0 - JAXWS API
Apache Axis 2.0 - SAAJ
Apache Axis 2.0 - Metadata
Apache Axis 2.0 - JAX-WS
Apache Axis 2.0 - JiBX Data Binding
Apache Axis 2.0 - JSON
Apache Axis 2.0 - MTOM Policy
Apache Axis 2.0 - Savan
Apache Axis 2.0 - soapmonitor
+----------------------------------------
| Gathering project list Apache Axis 2.0 - Java2WSDL
| Memory: 18M/36M
+----------------------------------------
+----------------------------------------
| Gathering project list Apache Axis 2.0 - Kernel
| Memory: 18M/36M
+----------------------------------------
+----------------------------------------
| Gathering project list Apache Axis 2.0 - Data Binding
| Memory: 18M/36M
+----------------------------------------
+----------------------------------------
| Gathering project list Apache Axis 2.0 - Code Generation
| Memory: 18M/36M
+----------------------------------------
+----------------------------------------
| Gathering project list Apache Axis 2.0 - ADB Codegen
| Memory: 18M/36M
+----------------------------------------
+----------------------------------------
| Gathering project list Apache Axis 2.0 - Addressing
| Memory: 18M/36M
+----------------------------------------
+----------------------------------------
| Gathering project list Apache Axis 2.0 - Samples
| Memory: 18M/36M
+----------------------------------------
+----------------------------------------
| Gathering project list Apache Axis 2.0 - spring
| Memory: 18M/36M
+----------------------------------------
+----------------------------------------
| Gathering project list Apache Axis 2.0 - XMLBeans Data Binding
| Memory: 18M/36M
+----------------------------------------
+----------------------------------------
| Gathering project list Apache Axis 2.0 - Tools
| Memory: 18M/36M
+----------------------------------------
+----------------------------------------
| Gathering project list Apache Axis 2.0 - Integration
| Memory: 18M/36M
+----------------------------------------
+----------------------------------------
| Gathering project list Apache Axis 2.0 - JAXB-RI Data Binding
| Memory: 18M/36M
+----------------------------------------
+----------------------------------------
| Gathering project list Apache Axis 2.0 - SAAJ API
| Memory: 18M/36M
+----------------------------------------
+----------------------------------------
| Gathering project list Apache Axis 2.0 - JAXWS API
| Memory: 18M/36M
+----------------------------------------
+----------------------------------------
| Gathering project list Apache Axis 2.0 - SAAJ
| Memory: 18M/36M
+----------------------------------------
+----------------------------------------
| Gathering project list Apache Axis 2.0 - Metadata
| Memory: 18M/36M
+----------------------------------------
+----------------------------------------
| Gathering project list Apache Axis 2.0 - JAX-WS
| Memory: 18M/36M
+----------------------------------------
+----------------------------------------
| Gathering project list Apache Axis 2.0 - JiBX Data Binding
| Memory: 18M/36M
+----------------------------------------
+----------------------------------------
| Gathering project list Apache Axis 2.0 - JSON
| Memory: 18M/36M
+----------------------------------------
+----------------------------------------
| Gathering project list Apache Axis 2.0 - MTOM Policy
| Memory: 18M/36M
+----------------------------------------
+----------------------------------------
| Gathering project list Apache Axis 2.0 - Savan
| Memory: 18M/36M
+----------------------------------------
+----------------------------------------
| Gathering project list Apache Axis 2.0 - soapmonitor
| Memory: 18M/36M
+----------------------------------------

multiproject:goal:
Starting the reactor...
Our processing order:
Apache Axis 2.0 - Java2WSDL
Apache Axis 2.0 - Kernel
Apache Axis 2.0 - Data Binding
Apache Axis 2.0 - Code Generation
Apache Axis 2.0 - ADB Codegen
Apache Axis 2.0 - Addressing
Apache Axis 2.0 - Samples
Apache Axis 2.0 - spring
Apache Axis 2.0 - XMLBeans Data Binding
Apache Axis 2.0 - Tools
Apache Axis 2.0 - Integration
Apache Axis 2.0 - JAXB-RI Data Binding
Apache Axis 2.0 - SAAJ API
Apache Axis 2.0 - JAXWS API
Apache Axis 2.0 - SAAJ
Apache Axis 2.0 - Metadata
Apache Axis 2.0 - JAX-WS
Apache Axis 2.0 - JiBX Data Binding
Apache Axis 2.0 - JSON
Apache Axis 2.0 - MTOM Policy
Apache Axis 2.0 - Savan
Apache Axis 2.0 - soapmonitor
+----------------------------------------
| Executing multiproject:install-callback Apache Axis 2.0 - Java2WSDL
| Memory: 18M/36M
+----------------------------------------
DEPRECATED: the default goal should be specified in the <build> section of project.xml instead of maven.xml
DEPRECATED: the default goal should be specified in the <build> section of project.xml instead of maven.xml
Trying to get missing/snapshot dependencies required by Apache Axis 2.0 - Java2WSDL:
Attempting to download axiom-api-SNAPSHOT.jar.
4/124K
8/124K
12/124K
16/124K
20/124K
24/124K
28/124K
32/124K
36/124K
40/124K
44/124K
48/124K
52/124K
56/124K
60/124K
64/124K
68/124K
72/124K
76/124K
80/124K
84/124K
88/124K
92/124K
96/124K
98/124K
102/124K
106/124K
110/124K
114/124K
118/124K
122/124K
124/124K
124K downloaded
Error retrieving artifact from [http://people.apache.org/repo/m1-snapshot-repository/]: org.apache.maven.verifier.ChecksumVerificationException: Error retrieving checksum file for /org.apache.ws.commons.axiom/jars/axiom-api-SNAPSHOT.jar
Skipping download as local copy is up to date!
Attempting to download axiom-impl-SNAPSHOT.jar.
4/108K
8/108K
12/108K
16/108K
20/108K
24/108K
28/108K
32/108K
36/108K
40/108K
44/108K
48/108K
52/108K
56/108K
60/108K
64/108K
68/108K
72/108K
76/108K
80/108K
84/108K
88/108K
92/108K
96/108K
98/108K
102/108K
103/108K
107/108K
108/108K
108K downloaded
Error retrieving artifact from [http://people.apache.org/repo/m1-snapshot-repository/]: org.apache.maven.verifier.ChecksumVerificationException: Error retrieving checksum file for /org.apache.ws.commons.axiom/jars/axiom-impl-SNAPSHOT.jar
Skipping download as local copy is up to date!
build:start:

multiproject:install-callback:
    [echo] Running jar:install for Apache Axis 2.0 - Java2WSDL
java:prepare-filesystem:
    [mkdir] Created dir: /export/home/illsleyd/continuum/continuum-1.0.3/apps/continuum/working-directory/1/modules/java2wsdl/target/classes
Running post goal: java:prepare-filesystem

java:compile:
    [echo] Compiling to /export/home/illsleyd/continuum/continuum-1.0.3/apps/continuum/working-directory/1/modules/java2wsdl/target/classes
    [javac] Compiling 22 source files to /export/home/illsleyd/continuum/continuum-1.0.3/apps/continuum/working-directory/1/modules/java2wsdl/target/classes

java:jar-resources:
Copying 2 files to /export/home/illsleyd/continuum/continuum-1.0.3/apps/continuum/working-directory/1/modules/java2wsdl/target/classes/META-INF

test:test:
    [echo] No tests to run.

jar:jar:
    [jar] Building jar: /export/home/illsleyd/continuum/continuum-1.0.3/apps/continuum/working-directory/1/modules/java2wsdl/target/axis2-java2wsdl-SNAPSHOT.jar

jar:install:
    [echo] Installing...
Uploading to org.apache.axis2/jars/axis2-java2wsdl-SNAPSHOT.jar: 
.................... (55K)
Uploading to org.apache.axis2/poms/axis2-java2wsdl-SNAPSHOT.pom: 
.................... (14K)

+----------------------------------------
| Executing multiproject:install-callback Apache Axis 2.0 - Kernel
| Memory: 18M/40M
+----------------------------------------
DEPRECATED: the default goal should be specified in the <build> section of project.xml instead of maven.xml
DEPRECATED: the default goal should be specified in the <build> section of project.xml instead of maven.xml

build:end:

Trying to get missing/snapshot dependencies required by Apache Axis 2.0 - Kernel:
Attempting to download axis2-java2wsdl-SNAPSHOT.jar.
Skipping download as local copy is up to date!
Attempting to download neethi-SNAPSHOT.jar.
4/28K
8/28K
12/28K
16/28K
20/28K
24/28K
28/28K
28/28K
28K downloaded
Error retrieving artifact from [http://people.apache.org/repo/m1-snapshot-repository/]: org.apache.maven.verifier.ChecksumVerificationException: Error retrieving checksum file for /org.apache.neethi/jars/neethi-SNAPSHOT.jar
Skipping download as local copy is up to date!
Attempting to download woden-1.0-incubating-SNAPSHOT.jar.
4/302K
8/302K
12/302K
16/302K
20/302K
24/302K
28/302K
32/302K
36/302K
40/302K
44/302K
48/302K
52/302K
56/302K
60/302K
64/302K
68/302K
72/302K
76/302K
80/302K
84/302K
88/302K
92/302K
92/302K
96/302K
100/302K
104/302K
106/302K
110/302K
113/302K
117/302K
120/302K
124/302K
128/302K
132/302K
135/302K
139/302K
142/302K
146/302K
149/302K
153/302K
156/302K
160/302K
163/302K
167/302K
170/302K
174/302K
177/302K
181/302K
185/302K
189/302K
192/302K
196/302K
199/302K
203/302K
207/302K
211/302K
213/302K
217/302K
220/302K
224/302K
227/302K
231/302K
234/302K
238/302K
242/302K
246/302K
249/302K
253/302K
256/302K
260/302K
263/302K
267/302K
270/302K
274/302K
277/302K
281/302K
284/302K
288/302K
292/302K
296/302K
299/302K
302/302K
302K downloaded
*** CHECKSUM FAILED - Checksum failed on download: local = '185f3b1b5257ee699d66053458457b71'; remote = 'a0c4906edf10a5d8d752b077ccd27bc1' - RETRYING
4/302K
8/302K
12/302K
16/302K
20/302K
24/302K
28/302K
32/302K
36/302K
40/302K
44/302K
48/302K
52/302K
56/302K
60/302K
64/302K
68/302K
72/302K
76/302K
80/302K
84/302K
88/302K
92/302K
96/302K
100/302K
104/302K
108/302K
112/302K
116/302K
120/302K
124/302K
128/302K
132/302K
136/302K
140/302K
144/302K
147/302K
151/302K
154/302K
158/302K
161/302K
165/302K
168/302K
172/302K
175/302K
179/302K
183/302K
187/302K
190/302K
194/302K
197/302K
201/302K
204/302K
208/302K
211/302K
215/302K
218/302K
222/302K
225/302K
229/302K
232/302K
236/302K
240/302K
244/302K
247/302K
251/302K
254/302K
258/302K
261/302K
265/302K
268/302K
272/302K
275/302K
279/302K
282/302K
286/302K
290/302K
294/302K
297/302K
301/302K
302/302K
302K downloaded
Error retrieving artifact from [http://people.apache.org/repo/m1-snapshot-repository/]: org.apache.maven.verifier.ChecksumVerificationException: Checksum failed on download: local = '185f3b1b5257ee699d66053458457b71'; remote = 'a0c4906edf10a5d8d752b077ccd27bc1'
build:start:

multiproject:install-callback:
    [echo] Running jar:install for Apache Axis 2.0 - Kernel
java:prepare-filesystem:
    [mkdir] Created dir: /export/home/illsleyd/continuum/continuum-1.0.3/apps/continuum/working-directory/1/modules/kernel/target/classes
Running post goal: java:prepare-filesystem

java:compile:
    [echo] Compiling to /export/home/illsleyd/continuum/continuum-1.0.3/apps/continuum/working-directory/1/modules/kernel/target/classes
    [javac] Compiling 284 source files to /export/home/illsleyd/continuum/continuum-1.0.3/apps/continuum/working-directory/1/modules/kernel/target/classes
    [javac] Note: Some input files use or override a deprecated API.
    [javac] Note: Recompile with -Xlint:deprecation for details.

java:jar-resources:
Copying 1 file to /export/home/illsleyd/continuum/continuum-1.0.3/apps/continuum/working-directory/1/modules/kernel/target/classes
Copying 2 files to /export/home/illsleyd/continuum/continuum-1.0.3/apps/continuum/working-directory/1/modules/kernel/target/classes
Copying 2 files to /export/home/illsleyd/continuum/continuum-1.0.3/apps/continuum/working-directory/1/modules/kernel/target/classes/META-INF

test:test:
java:prepare-filesystem:
Running post goal: java:prepare-filesystem

java:compile:
    [echo] Compiling to /export/home/illsleyd/continuum/continuum-1.0.3/apps/continuum/working-directory/1/modules/kernel/target/classes
    [javac] Compiling 1 source file to /export/home/illsleyd/continuum/continuum-1.0.3/apps/continuum/working-directory/1/modules/kernel/target/classes

java:jar-resources:

test:prepare-filesystem:
    [mkdir] Created dir: /export/home/illsleyd/continuum/continuum-1.0.3/apps/continuum/working-directory/1/modules/kernel/target/test-classes
    [mkdir] Created dir: /export/home/illsleyd/continuum/continuum-1.0.3/apps/continuum/working-directory/1/modules/kernel/target/test-reports

test:test-resources:
Copying 59 files to /export/home/illsleyd/continuum/continuum-1.0.3/apps/continuum/working-directory/1/modules/kernel/target/test-classes/../test-resources

test:compile:
    [javac] Compiling 93 source files to /export/home/illsleyd/continuum/continuum-1.0.3/apps/continuum/working-directory/1/modules/kernel/target/test-classes
    [javac] Note: Some input files use or override a deprecated API.
    [javac] Note: Recompile with -Xlint:deprecation for details.
Running post goal: test:compile
    [echo] the files are up to date = ${jars.uptodate}
    [mkdir] Created dir: /export/home/illsleyd/continuum/continuum-1.0.3/apps/continuum/working-directory/1/modules/kernel/test-resources/deployment/service2/build/classes
    [mkdir] Created dir: /export/home/illsleyd/continuum/continuum-1.0.3/apps/continuum/working-directory/1/modules/kernel/test-resources/deployment/service2/build/lib
    [copy] Copying 1 file to /export/home/illsleyd/continuum/continuum-1.0.3/apps/continuum/working-directory/1/modules/kernel/test-resources/deployment/service2/build/classes/META-INF
    [mkdir] Created dir: /export/home/illsleyd/continuum/continuum-1.0.3/apps/continuum/working-directory/1/modules/kernel/target/test-resources/deployment/services
    [jar] Building jar: /export/home/illsleyd/continuum/continuum-1.0.3/apps/continuum/working-directory/1/modules/kernel/target/test-resources/deployment/services/service2.jar
    [delete] Deleting directory /export/home/illsleyd/continuum/continuum-1.0.3/apps/continuum/working-directory/1/modules/kernel/test-resources/deployment/service2/build
    [echo] the files are up to date = ${jars.uptodate}
    [mkdir] Created dir: /export/home/illsleyd/continuum/continuum-1.0.3/apps/continuum/working-directory/1/modules/kernel/test-resources/deployment/echo/build/classes
    [mkdir] Created dir: /export/home/illsleyd/continuum/continuum-1.0.3/apps/continuum/working-directory/1/modules/kernel/test-resources/deployment/echo/build/lib
    [copy] Copying 1 file to /export/home/illsleyd/continuum/continuum-1.0.3/apps/continuum/working-directory/1/modules/kernel/test-resources/deployment/echo/build/classes/META-INF
    [mkdir] Created dir: /export/home/illsleyd/continuum/continuum-1.0.3/apps/continuum/working-directory/1/modules/kernel/target/echo
    [jar] Building jar: /export/home/illsleyd/continuum/continuum-1.0.3/apps/continuum/working-directory/1/modules/kernel/target/echo/echo.aar
    [delete] Deleting directory /export/home/illsleyd/continuum/continuum-1.0.3/apps/continuum/working-directory/1/modules/kernel/test-resources/deployment/echo/build
    [echo] the files are up to date = ${jars.uptodate}
    [mkdir] Created dir: /export/home/illsleyd/continuum/continuum-1.0.3/apps/continuum/working-directory/1/modules/kernel/test-resources/deployment/invalidservice/build/classes
    [mkdir] Created dir: /export/home/illsleyd/continuum/continuum-1.0.3/apps/continuum/working-directory/1/modules/kernel/test-resources/deployment/invalidservice/build/lib
    [copy] Copying 1 file to /export/home/illsleyd/continuum/continuum-1.0.3/apps/continuum/working-directory/1/modules/kernel/test-resources/deployment/invalidservice/build/classes/META-INF
    [mkdir] Created dir: /export/home/illsleyd/continuum/continuum-1.0.3/apps/continuum/working-directory/1/modules/kernel/target/test-resources/InvalidDeployment/services
    [jar] Building jar: /export/home/illsleyd/continuum/continuum-1.0.3/apps/continuum/working-directory/1/modules/kernel/target/test-resources/InvalidDeployment/services/invalidService.jar
    [delete] Deleting directory /export/home/illsleyd/continuum/continuum-1.0.3/apps/continuum/working-directory/1/modules/kernel/test-resources/deployment/invalidservice/build
    [echo] the files are up to date = ${jars.uptodate}
    [mkdir] Created dir: /export/home/illsleyd/continuum/continuum-1.0.3/apps/continuum/working-directory/1/modules/kernel/test-resources/deployment/module1/build/classes
    [mkdir] Created dir: /export/home/illsleyd/continuum/continuum-1.0.3/apps/continuum/working-directory/1/modules/kernel/test-resources/deployment/module1/build/lib
    [copy] Copying 1 file to /export/home/illsleyd/continuum/continuum-1.0.3/apps/continuum/working-directory/1/modules/kernel/test-resources/deployment/module1/build/classes/META-INF
    [mkdir] Created dir: /export/home/illsleyd/continuum/continuum-1.0.3/apps/continuum/working-directory/1/modules/kernel/target/test-resources/deployment/modules
    [jar] Building jar: /export/home/illsleyd/continuum/continuum-1.0.3/apps/continuum/working-directory/1/modules/kernel/target/test-resources/deployment/modules/module1.mar
    [delete] Deleting directory /export/home/illsleyd/continuum/continuum-1.0.3/apps/continuum/working-directory/1/modules/kernel/test-resources/deployment/module1/build
    [echo] the files are up to date = ${jars.uptodate}
    [mkdir] Created dir: /export/home/illsleyd/continuum/continuum-1.0.3/apps/continuum/working-directory/1/modules/kernel/test-resources/deployment/serviceModule/build/classes
    [mkdir] Created dir: /export/home/illsleyd/continuum/continuum-1.0.3/apps/continuum/working-directory/1/modules/kernel/test-resources/deployment/serviceModule/build/lib
    [copy] Copying 1 file to /export/home/illsleyd/continuum/continuum-1.0.3/apps/continuum/working-directory/1/modules/kernel/test-resources/deployment/serviceModule/build/classes/META-INF
    [mkdir] Created dir: /export/home/illsleyd/continuum/continuum-1.0.3/apps/continuum/working-directory/1/modules/kernel/target/test-resources/InvalidDeployment/modules
    [jar] Building jar: /export/home/illsleyd/continuum/continuum-1.0.3/apps/continuum/working-directory/1/modules/kernel/target/test-resources/InvalidDeployment/modules/serviceModule.jar
    [delete] Deleting directory /export/home/illsleyd/continuum/continuum-1.0.3/apps/continuum/working-directory/1/modules/kernel/test-resources/deployment/serviceModule/build
    [mkdir] Created dir: /export/home/illsleyd/continuum/continuum-1.0.3/apps/continuum/working-directory/1/modules/kernel/target/test-resources/java2sec/more
    [mkdir] Created dir: /export/home/illsleyd/continuum/continuum-1.0.3/apps/continuum/working-directory/1/modules/kernel/target/test-resources/java2sec/less
    [jar] Building jar: /export/home/illsleyd/continuum/continuum-1.0.3/apps/continuum/working-directory/1/modules/kernel/target/test-resources/java2sec/more/MorePermission.jar
    [delete] Deleting directory /export/home/illsleyd/continuum/continuum-1.0.3/apps/continuum/working-directory/1/modules/kernel/target/test-classes/org/apache/axis2/java/security/driver
    [delete] Deleting directory /export/home/illsleyd/continuum/continuum-1.0.3/apps/continuum/working-directory/1/modules/kernel/target/test-classes/org/apache/axis2/java/security/more
    [delete] Deleting directory /export/home/illsleyd/continuum/continuum-1.0.3/apps/continuum/working-directory/1/modules/kernel/target/test-classes/org/apache/axis2/java/security/action
    [delete] Deleting directory /export/home/illsleyd/continuum/continuum-1.0.3/apps/continuum/working-directory/1/modules/kernel/target/test-classes/org/apache/axis2/java/security/interf
    [jar] Building jar: /export/home/illsleyd/continuum/continuum-1.0.3/apps/continuum/working-directory/1/modules/kernel/target/test-resources/java2sec/less/LessPermission.jar
    [delete] Deleting directory /export/home/illsleyd/continuum/continuum-1.0.3/apps/continuum/working-directory/1/modules/kernel/target/test-classes/org/apache/axis2/java/security/less

    [junit] Running org.apache.axis2.addressing.AddressingHelperTest
    [junit] Tests run: 6, Failures: 0, Errors: 0, Time elapsed: 0.618 sec
    [junit] Running org.apache.axis2.addressing.EndpointReferenceHelperTest
    [junit] Tests run: 2, Failures: 0, Errors: 0, Time elapsed: 0.478 sec
    [junit] Running org.apache.axis2.addressing.EndpointReferenceTypeTest
    [junit] Tests run: 4, Failures: 0, Errors: 0, Time elapsed: 0.503 sec
    [junit] Running org.apache.axis2.addressing.miheaders.RelatesToTest
    [junit] Tests run: 3, Failures: 0, Errors: 0, Time elapsed: 0.357 sec
    [junit] Running org.apache.axis2.addressing.wsdl.WSDL11ActionHelperTest
    [junit] Tests run: 8, Failures: 0, Errors: 0, Time elapsed: 0.829 sec
    [junit] Running org.apache.axis2.context.ContextHierarchyTest
    [junit] Tests run: 2, Failures: 0, Errors: 0, Time elapsed: 1.288 sec
    [junit] Running org.apache.axis2.context.OperationContextTest
    [junit] Tests run: 1, Failures: 0, Errors: 0, Time elapsed: 0.766 sec
    [junit] Running org.apache.axis2.deployment.AddingObserverTest
    [junit] Tests run: 1, Failures: 0, Errors: 0, Time elapsed: 1.214 sec
    [junit] Running org.apache.axis2.deployment.AxisMessageTest
    [junit] Tests run: 1, Failures: 0, Errors: 0, Time elapsed: 1.699 sec
    [junit] Running org.apache.axis2.deployment.BadModuleTest
    [junit] Tests run: 1, Failures: 0, Errors: 0, Time elapsed: 0.766 sec
    [junit] Running org.apache.axis2.deployment.BuildERWithDeploymentTest
    [junit] Tests run: 1, Failures: 0, Errors: 0, Time elapsed: 1.356 sec
    [junit] Running org.apache.axis2.deployment.BuilderSelectorDeploymentTest
    [junit] Tests run: 2, Failures: 0, Errors: 0, Time elapsed: 1.377 sec
    [junit] Running org.apache.axis2.deployment.DeploymentTotalTest
    [junit] Tests run: 1, Failures: 0, Errors: 0, Time elapsed: 1.209 sec
    [junit] Running org.apache.axis2.deployment.MessageFormatterDeploymentTest
    [junit] Tests run: 2, Failures: 0, Errors: 0, Time elapsed: 1.655 sec
    [junit] Running org.apache.axis2.deployment.ModifiedConfigFileTest
    [junit] Tests run: 1, Failures: 0, Errors: 0, Time elapsed: 0.741 sec
    [junit] Running org.apache.axis2.deployment.ModuleDisengagementTest
    [junit] Tests run: 7, Failures: 0, Errors: 0, Time elapsed: 1.681 sec
    [junit] Running org.apache.axis2.deployment.ModuleversionTest
    [junit] Tests run: 2, Failures: 0, Errors: 0, Time elapsed: 0.807 sec
    [junit] Running org.apache.axis2.deployment.OperationExcludeTest
    [junit] Tests run: 1, Failures: 0, Errors: 0, Time elapsed: 1.393 sec
    [junit] Running org.apache.axis2.deployment.SameServiceAddingTest
    [junit] Tests run: 1, Failures: 0, Errors: 0, Time elapsed: 0.867 sec
    [junit] Running org.apache.axis2.deployment.ServiceGroupTest
    [junit] Tests run: 1, Failures: 0, Errors: 0, Time elapsed: 2.029 sec
    [junit] Running org.apache.axis2.deployment.SystemPhasesremovedTest
    [junit] Tests run: 1, Failures: 0, Errors: 0, Time elapsed: 0.821 sec
    [junit] Running org.apache.axis2.deployment.TransportDeploymentTest
    [junit] Tests run: 1, Failures: 0, Errors: 0, Time elapsed: 1.228 sec
    [junit] Running org.apache.axis2.description.RegistryTest
    [junit] Tests run: 5, Failures: 0, Errors: 0, Time elapsed: 0.643 sec
    [junit] Running org.apache.axis2.description.WSDLToAllServicesBuilderTest
    [junit] Tests run: 2, Failures: 0, Errors: 0, Time elapsed: 4.134 sec
    [junit] Running org.apache.axis2.dispatchers.ActionBasedOperationDispatchTest
    [junit] Tests run: 1, Failures: 0, Errors: 0, Time elapsed: 0.764 sec
    [junit] Running org.apache.axis2.dispatchers.RelatesToBasedOperationDispatcherTest
    [junit] Tests run: 1, Failures: 0, Errors: 0, Time elapsed: 0.752 sec
    [junit] Running org.apache.axis2.dispatchers.RelatesToBasedServiceDispatcherTest
    [junit] Tests run: 1, Failures: 0, Errors: 0, Time elapsed: 0.787 sec
    [junit] Running org.apache.axis2.dispatchers.RequestURIBasedOperationDispatcherTest
    [junit] Tests run: 1, Failures: 0, Errors: 0, Time elapsed: 0.864 sec
    [junit] Running org.apache.axis2.dispatchers.RequestURIBasedServiceDispatcherTest
    [junit] Tests run: 1, Failures: 0, Errors: 0, Time elapsed: 0.618 sec
    [junit] Running org.apache.axis2.dispatchers.SOAPMessageBodyBasedOperationDispatcherTest
    [junit] Tests run: 1, Failures: 0, Errors: 0, Time elapsed: 0.883 sec
    [junit] Running org.apache.axis2.dispatchers.SOAPMessageBodyBasedServiceDispatcherTest
    [junit] Tests run: 1, Failures: 0, Errors: 0, Time elapsed: 0.531 sec
    [junit] Running org.apache.axis2.engine.EnginePausingTest
    [junit] Tests run: 1, Failures: 0, Errors: 0, Time elapsed: 0.882 sec
    [junit] Running org.apache.axis2.engine.MessageContextChangeTest
    [junit] Tests run: 1, Failures: 0, Errors: 0, Time elapsed: 0.453 sec
    [junit] Running org.apache.axis2.engine.MessageContextSaveATest
    [junit] Tests run: 4, Failures: 0, Errors: 0, Time elapsed: 1.344 sec
    [junit] Running org.apache.axis2.engine.MessageContextSaveBTest
    [junit] Tests run: 1, Failures: 0, Errors: 0, Time elapsed: 1.457 sec
    [junit] Running org.apache.axis2.engine.MessageContextSaveCTest
    [junit] Tests run: 2, Failures: 0, Errors: 0, Time elapsed: 1.137 sec
    [junit] Running org.apache.axis2.engine.MessageContextSelfManagedDataTest
    [junit] Tests run: 10, Failures: 0, Errors: 0, Time elapsed: 1.776 sec
    [junit] Running org.apache.axis2.engine.MessageContextTest
    [junit] Tests run: 1, Failures: 0, Errors: 0, Time elapsed: 0.598 sec
    [junit] Running org.apache.axis2.engine.ModuleConfigTest
    [junit] Tests run: 2, Failures: 0, Errors: 0, Time elapsed: 1.174 sec
    [junit] Running org.apache.axis2.engine.ModuleEngageTest
    [junit] Tests run: 1, Failures: 0, Errors: 0, Time elapsed: 1.61 sec
    [junit] Running org.apache.axis2.engine.ObjectSaveTest
    [junit] Tests run: 5, Failures: 0, Errors: 0, Time elapsed: 0.8 sec
    [junit] Running org.apache.axis2.engine.OperationContextSaveTest
    [junit] Tests run: 1, Failures: 0, Errors: 0, Time elapsed: 0.837 sec
    [junit] Running org.apache.axis2.engine.OptionsSaveTest
    [junit] Tests run: 1, Failures: 0, Errors: 0, Time elapsed: 0.854 sec
    [junit] Running org.apache.axis2.engine.ParameterAddTest
    [junit] Tests run: 4, Failures: 0, Errors: 0, Time elapsed: 0.7 sec
    [junit] Running org.apache.axis2.java.security.driver.Java2SecTest
    [junit] Tests run: 9, Failures: 0, Errors: 0, Time elapsed: 0.876 sec
    [junit] Running org.apache.axis2.misc.MiscTest
    [junit] Tests run: 1, Failures: 0, Errors: 0, Time elapsed: 0.346 sec
    [junit] Running org.apache.axis2.phaserule.AddingHandlerToEachPhaseTest
    [junit] Tests run: 3, Failures: 0, Errors: 0, Time elapsed: 0.418 sec
    [junit] Running org.apache.axis2.phaserule.BeforeAfterTest
    [junit] Tests run: 1, Failures: 0, Errors: 0, Time elapsed: 0.401 sec
    [junit] Running org.apache.axis2.phaserule.BeforeTest
    [junit] Tests run: 1, Failures: 0, Errors: 0, Time elapsed: 0.534 sec
    [junit] Running org.apache.axis2.phaserule.BeforeWithNoFirstHandlerTest
    [junit] Tests run: 1, Failures: 0, Errors: 0, Time elapsed: 0.488 sec
    [junit] Running org.apache.axis2.phaserule.InvalidPhaseFirstRulesTest
    [junit] Tests run: 1, Failures: 0, Errors: 0, Time elapsed: 0.439 sec
    [junit] Running org.apache.axis2.phaserule.InvalidPhaseFirstTest
    [junit] Tests run: 1, Failures: 0, Errors: 0, Time elapsed: 0.44 sec
    [junit] Running org.apache.axis2.phaserule.InvalidPhaseLastRuleTest
    [junit] Tests run: 1, Failures: 0, Errors: 0, Time elapsed: 0.443 sec
    [junit] Running org.apache.axis2.phaserule.InvalidPhaseRuleTest
    [junit] Tests run: 2, Failures: 0, Errors: 0, Time elapsed: 0.426 sec
    [junit] Running org.apache.axis2.phaserule.InvalidPhaselastTest
    [junit] Tests run: 1, Failures: 0, Errors: 0, Time elapsed: 0.467 sec
    [junit] Running org.apache.axis2.phaserule.PhaseFirstTest
    [junit] Tests run: 1, Failures: 0, Errors: 0, Time elapsed: 0.402 sec
    [junit] Running org.apache.axis2.phaserule.PhaseLastTest
    [junit] Tests run: 1, Failures: 0, Errors: 0, Time elapsed: 0.396 sec
    [junit] Running org.apache.axis2.phaserule.PhaseRuleTest
    [junit] Tests run: 1, Failures: 0, Errors: 0, Time elapsed: 0.392 sec
    [junit] Running org.apache.axis2.phaserule.PreDispatchPhaseRuleTest
    [junit] Tests run: 1, Failures: 0, Errors: 0, Time elapsed: 0.404 sec
    [junit] Running org.apache.axis2.phaserule.SingleHandlerPhaseTest
    [junit] Tests run: 1, Failures: 0, Errors: 0, Time elapsed: 0.449 sec
    [junit] Running org.apache.axis2.transport.http.RestSenderTest
    [junit] Tests run: 1, Failures: 0, Errors: 0, Time elapsed: 0.623 sec
    [junit] Running org.apache.axis2.transport.tcp.TCPTransportTest
    [junit] Tests run: 1, Failures: 0, Errors: 0, Time elapsed: 0.347 sec
    [junit] Running org.apache.axis2.util.ThreadContextMigratorTest
    [junit] Tests run: 2, Failures: 0, Errors: 0, Time elapsed: 0.453 sec

jar:jar:
    [copy] Copying 1 file to /export/home/illsleyd/continuum/continuum-1.0.3/apps/continuum/working-directory/1/modules/kernel/target/classes/org/apache/axis2/i18n
    [jar] Building jar: /export/home/illsleyd/continuum/continuum-1.0.3/apps/continuum/working-directory/1/modules/kernel/target/axis2-kernel-SNAPSHOT.jar

jar:install:
    [echo] Installing...
Uploading to org.apache.axis2/jars/axis2-kernel-SNAPSHOT.jar: 
.................... (799K)
Uploading to org.apache.axis2/poms/axis2-kernel-SNAPSHOT.pom: 
.................... (15K)

+----------------------------------------
| Executing multiproject:install-callback Apache Axis 2.0 - Data Binding
| Memory: 28M/34M
+----------------------------------------
DEPRECATED: the default goal should be specified in the <build> section of project.xml instead of maven.xml
DEPRECATED: the default goal should be specified in the <build> section of project.xml instead of maven.xml

build:end:

Trying to get missing/snapshot dependencies required by Apache Axis 2.0 - Data Binding:
Attempting to download axiom-dom-SNAPSHOT.jar.
4/130K
8/130K
12/130K
16/130K
20/130K
24/130K
28/130K
32/130K
36/130K
40/130K
44/130K
48/130K
52/130K
56/130K
60/130K
64/130K
68/130K
72/130K
76/130K
80/130K
84/130K
88/130K
92/130K
92/130K
96/130K
99/130K
103/130K
106/130K
110/130K
114/130K
118/130K
120/130K
124/130K
128/130K
130/130K
130K downloaded
Error retrieving artifact from [http://people.apache.org/repo/m1-snapshot-repository/]: org.apache.maven.verifier.ChecksumVerificationException: Error retrieving checksum file for /org.apache.ws.commons.axiom/jars/axiom-dom-SNAPSHOT.jar
Skipping download as local copy is up to date!
Attempting to download axis2-kernel-SNAPSHOT.jar.
Skipping download as local copy is up to date!
build:start:

multiproject:install-callback:
    [echo] Running jar:install for Apache Axis 2.0 - Data Binding
java:prepare-filesystem:
    [mkdir] Created dir: /export/home/illsleyd/continuum/continuum-1.0.3/apps/continuum/working-directory/1/modules/adb/target/classes
Running post goal: java:prepare-filesystem

java:compile:
    [echo] Compiling to /export/home/illsleyd/continuum/continuum-1.0.3/apps/continuum/working-directory/1/modules/adb/target/classes
    [javac] Compiling 62 source files to /export/home/illsleyd/continuum/continuum-1.0.3/apps/continuum/working-directory/1/modules/adb/target/classes
    [javac] Note: /export/home/illsleyd/continuum/continuum-1.0.3/apps/continuum/working-directory/1/modules/adb/src/org/apache/axis2/databinding/types/Union.java uses or overrides a deprecated API.
    [javac] Note: Recompile with -Xlint:deprecation for details.

java:jar-resources:
Copying 1 file to /export/home/illsleyd/continuum/continuum-1.0.3/apps/continuum/working-directory/1/modules/adb/target/classes
Copying 2 files to /export/home/illsleyd/continuum/continuum-1.0.3/apps/continuum/working-directory/1/modules/adb/target/classes/META-INF

test:test:
java:prepare-filesystem:
Running post goal: java:prepare-filesystem

java:compile:
    [echo] Compiling to /export/home/illsleyd/continuum/continuum-1.0.3/apps/continuum/working-directory/1/modules/adb/target/classes

java:jar-resources:

test:prepare-filesystem:
    [mkdir] Created dir: /export/home/illsleyd/continuum/continuum-1.0.3/apps/continuum/working-directory/1/modules/adb/target/test-classes
    [mkdir] Created dir: /export/home/illsleyd/continuum/continuum-1.0.3/apps/continuum/working-directory/1/modules/adb/target/test-reports

test:test-resources:
Copying 1 file to /export/home/illsleyd/continuum/continuum-1.0.3/apps/continuum/working-directory/1/modules/adb/target/test-classes
Copying 1 file to /export/home/illsleyd/continuum/continuum-1.0.3/apps/continuum/working-directory/1/modules/adb/target/test-classes

test:compile:
    [javac] Compiling 9 source files to /export/home/illsleyd/continuum/continuum-1.0.3/apps/continuum/working-directory/1/modules/adb/target/test-classes

    [junit] Running org.apache.axis2.databinding.ADBSOAPModelBuilderTest
    [junit] Tests run: 5, Failures: 0, Errors: 0, Time elapsed: 0.821 sec
    [junit] Running org.apache.axis2.databinding.utils.NamedStaxOMBuilderTest
    [junit] Tests run: 2, Failures: 0, Errors: 0, Time elapsed: 0.607 sec
    [junit] Running org.apache.axis2.databinding.utils.SimpleArrayReaderStateMachineTest
    [junit] Tests run: 4, Failures: 0, Errors: 0, Time elapsed: 0.502 sec
    [junit] Running org.apache.axis2.databinding.utils.SimpleElementReaderStateMachineTest
    [junit] Tests run: 3, Failures: 0, Errors: 0, Time elapsed: 0.492 sec
    [junit] Running org.apache.axis2.databinding.utils.reader.ADBXMLStreamReaderTest
    [junit] Tests run: 15, Failures: 0, Errors: 0, Time elapsed: 0.982 sec

jar:jar:
    [jar] Building jar: /export/home/illsleyd/continuum/continuum-1.0.3/apps/continuum/working-directory/1/modules/adb/target/axis2-adb-SNAPSHOT.jar

jar:install:
    [echo] Installing...
Uploading to org.apache.axis2/jars/axis2-adb-SNAPSHOT.jar: 
.................... (137K)
Uploading to org.apache.axis2/poms/axis2-adb-SNAPSHOT.pom: 
.................... (14K)

+----------------------------------------
| Executing multiproject:install-callback Apache Axis 2.0 - Code Generation
| Memory: 25M/31M
+----------------------------------------
DEPRECATED: the default goal should be specified in the <build> section of project.xml instead of maven.xml
DEPRECATED: the default goal should be specified in the <build> section of project.xml instead of maven.xml

build:end:

Trying to get missing/snapshot dependencies required by Apache Axis 2.0 - Code Generation:
Attempting to download axis2-adb-SNAPSHOT.jar.
Skipping download as local copy is up to date!
build:start:

multiproject:install-callback:
    [echo] Running jar:install for Apache Axis 2.0 - Code Generation
java:prepare-filesystem:
    [mkdir] Created dir: /export/home/illsleyd/continuum/continuum-1.0.3/apps/continuum/working-directory/1/modules/codegen/target/classes
Running post goal: java:prepare-filesystem

java:compile:
    [echo] Compiling to /export/home/illsleyd/continuum/continuum-1.0.3/apps/continuum/working-directory/1/modules/codegen/target/classes
    [javac] Compiling 69 source files to /export/home/illsleyd/continuum/continuum-1.0.3/apps/continuum/working-directory/1/modules/codegen/target/classes

java:jar-resources:
Copying 33 files to /export/home/illsleyd/continuum/continuum-1.0.3/apps/continuum/working-directory/1/modules/codegen/target/classes
Copying 2 files to /export/home/illsleyd/continuum/continuum-1.0.3/apps/continuum/working-directory/1/modules/codegen/target/classes/META-INF
Running post goal: java:jar-resources

test:test:
java:prepare-filesystem:
Running post goal: java:prepare-filesystem

java:compile:
    [echo] Compiling to /export/home/illsleyd/continuum/continuum-1.0.3/apps/continuum/working-directory/1/modules/codegen/target/classes

java:jar-resources:
Running post goal: java:jar-resources

test:prepare-filesystem:
    [mkdir] Created dir: /export/home/illsleyd/continuum/continuum-1.0.3/apps/continuum/working-directory/1/modules/codegen/target/test-classes
    [mkdir] Created dir: /export/home/illsleyd/continuum/continuum-1.0.3/apps/continuum/working-directory/1/modules/codegen/target/test-reports

test:test-resources:
Copying 6 files to /export/home/illsleyd/continuum/continuum-1.0.3/apps/continuum/working-directory/1/modules/codegen/target/test-classes
Copying 31 files to /export/home/illsleyd/continuum/continuum-1.0.3/apps/continuum/working-directory/1/modules/codegen/target/test-classes

test:compile:
    [javac] Compiling 2 source files to /export/home/illsleyd/continuum/continuum-1.0.3/apps/continuum/working-directory/1/modules/codegen/target/test-classes

    [junit] Running org.apache.axis2.wsdl.WSDLServiceBuilderTest
    [junit] Tests run: 1, Failures: 0, Errors: 0, Time elapsed: 4.345 sec
    [junit] Running org.apache.axis2.wsdl.codegen.extension.SchemaUnwrapperExtensionTest
    [junit] Tests run: 4, Failures: 0, Errors: 0, Time elapsed: 1.115 sec

jar:jar:
    [jar] Building jar: /export/home/illsleyd/continuum/continuum-1.0.3/apps/continuum/working-directory/1/modules/codegen/target/axis2-codegen-SNAPSHOT.jar

jar:install:
    [echo] Installing...
Uploading to org.apache.axis2/jars/axis2-codegen-SNAPSHOT.jar: 
.................... (178K)
Uploading to org.apache.axis2/poms/axis2-codegen-SNAPSHOT.pom: 
.................... (17K)

+----------------------------------------
| Executing multiproject:install-callback Apache Axis 2.0 - ADB Codegen
| Memory: 36M/38M
+----------------------------------------
DEPRECATED: the default goal should be specified in the <build> section of project.xml instead of maven.xml
DEPRECATED: the default goal should be specified in the <build> section of project.xml instead of maven.xml

build:end:

Trying to get missing/snapshot dependencies required by Apache Axis 2.0 - ADB Codegen:
Attempting to download axis2-codegen-SNAPSHOT.jar.
Skipping download as local copy is up to date!
build:start:

multiproject:install-callback:
    [echo] Running jar:install for Apache Axis 2.0 - ADB Codegen
java:prepare-filesystem:
    [mkdir] Created dir: /export/home/illsleyd/continuum/continuum-1.0.3/apps/continuum/working-directory/1/modules/adb-codegen/target/classes
Running post goal: java:prepare-filesystem

java:compile:
    [echo] Compiling to /export/home/illsleyd/continuum/continuum-1.0.3/apps/continuum/working-directory/1/modules/adb-codegen/target/classes
    [javac] Compiling 17 source files to /export/home/illsleyd/continuum/continuum-1.0.3/apps/continuum/working-directory/1/modules/adb-codegen/target/classes

java:jar-resources:
Copying 8 files to /export/home/illsleyd/continuum/continuum-1.0.3/apps/continuum/working-directory/1/modules/adb-codegen/target/classes
Copying 2 files to /export/home/illsleyd/continuum/continuum-1.0.3/apps/continuum/working-directory/1/modules/adb-codegen/target/classes/META-INF

test:test:
java:prepare-filesystem:
Running post goal: java:prepare-filesystem

java:compile:
    [echo] Compiling to /export/home/illsleyd/continuum/continuum-1.0.3/apps/continuum/working-directory/1/modules/adb-codegen/target/classes

java:jar-resources:

test:prepare-filesystem:
    [mkdir] Created dir: /export/home/illsleyd/continuum/continuum-1.0.3/apps/continuum/working-directory/1/modules/adb-codegen/target/test-classes
    [mkdir] Created dir: /export/home/illsleyd/continuum/continuum-1.0.3/apps/continuum/working-directory/1/modules/adb-codegen/target/test-reports

test:test-resources:
Copying 33 files to /export/home/illsleyd/continuum/continuum-1.0.3/apps/continuum/working-directory/1/modules/adb-codegen/target/test-classes
Copying 8 files to /export/home/illsleyd/continuum/continuum-1.0.3/apps/continuum/working-directory/1/modules/adb-codegen/target/test-classes

test:compile:
    [mkdir] Created dir: /export/home/illsleyd/continuum/continuum-1.0.3/apps/continuum/working-directory/1/modules/adb-codegen/target/schema
    [mkdir] Created dir: /export/home/illsleyd/continuum/continuum-1.0.3/apps/continuum/working-directory/1/modules/adb-codegen/target/schema/src
    [mkdir] Created dir: /export/home/illsleyd/continuum/continuum-1.0.3/apps/continuum/working-directory/1/modules/adb-codegen/target/schema/classes
    [echo] Compiling simple_maxOccurs2.xsd
    [echo] Compiling anonymous_complexType.xsd
    [echo] Compiling simple_choice.xsd
    [echo] Compiling simple_particle_all.xsd
    [echo] Compiling simple_maxOccurs.xsd
    [echo] Compiling simple_anytype.xsd
    [echo] Compiling simple-minoccurs0.xsd
    [echo] Compiling complex-minoccurs0.xsd
    [echo] Compiling simple-recursive-datatypes.xsd
    [echo] Compiling mixed_minoccus0.xsd
    [echo] Compiling complete.xsd
    [echo] Compiling simpleExtension.xsd
    [echo] Compiling union.xsd
    [echo] Compiling all.xsd
    [echo] Compiling enumeration.xsd
    [echo] Compiling restrictions.xsd
    [javac] Compiling 148 source files to /export/home/illsleyd/continuum/continuum-1.0.3/apps/continuum/working-directory/1/modules/adb-codegen/target/schema/classes
    [javac] Note: Some input files use unchecked or unsafe operations.
    [javac] Note: Recompile with -Xlint:unchecked for details.
    [javac] Compiling 77 source files to /export/home/illsleyd/continuum/continuum-1.0.3/apps/continuum/working-directory/1/modules/adb-codegen/target/test-classes

    [junit] Running org.apache.axis2.schema.all.AllTest
    [junit] Tests run: 1, Failures: 0, Errors: 0, Time elapsed: 1.338 sec
    [junit] Running org.apache.axis2.schema.compile.AnonymousComplexTypeTest
    [junit] Tests run: 1, Failures: 0, Errors: 0, Time elapsed: 3.542 sec
    [junit] Running org.apache.axis2.schema.compile.ComplexAllTest
    [junit] Tests run: 1, Failures: 0, Errors: 0, Time elapsed: 4.452 sec
    [junit] Running org.apache.axis2.schema.compile.ComplexExtensionTest
    [junit] Tests run: 1, Failures: 0, Errors: 0, Time elapsed: 4.373 sec
    [junit] Running org.apache.axis2.schema.compile.ImportTest
    [junit] Tests run: 1, Failures: 0, Errors: 0, Time elapsed: 4.687 sec
    [junit] Running org.apache.axis2.schema.compile.RecursiveCompileTest
    [junit] Tests run: 1, Failures: 0, Errors: 0, Time elapsed: 4.175 sec
    [junit] Running org.apache.axis2.schema.compile.SimpleAnyAttribTest
    [junit] Tests run: 1, Failures: 0, Errors: 0, Time elapsed: 4.462 sec
    [junit] Running org.apache.axis2.schema.compile.SimpleAnyTest
    [junit] Tests run: 1, Failures: 0, Errors: 0, Time elapsed: 2.992 sec
    [junit] Running org.apache.axis2.schema.compile.SimpleAnyTypeTest
    [junit] Tests run: 1, Failures: 0, Errors: 0, Time elapsed: 4.932 sec
    [junit] Running org.apache.axis2.schema.compile.SimpleAttributeTest
    [junit] Tests run: 1, Failures: 0, Errors: 0, Time elapsed: 3.417 sec
    [junit] Running org.apache.axis2.schema.compile.SimpleChoiceTest
    [junit] Tests run: 1, Failures: 0, Errors: 0, Time elapsed: 4.462 sec
    [junit] Running org.apache.axis2.schema.compile.SimpleContentExtensionTest
    [junit] Tests run: 1, Failures: 0, Errors: 0, Time elapsed: 3.573 sec
    [junit] Running org.apache.axis2.schema.compile.SimpleElementReferenceTest
    [junit] Tests run: 1, Failures: 0, Errors: 0, Time elapsed: 3.418 sec
    [junit] Running org.apache.axis2.schema.compile.SimpleElementTest
    [junit] Tests run: 1, Failures: 0, Errors: 0, Time elapsed: 4.279 sec
    [junit] Running org.apache.axis2.schema.compile.SimpleParticleAllTest
    [junit] Tests run: 1, Failures: 0, Errors: 0, Time elapsed: 3.703 sec
    [junit] Running org.apache.axis2.schema.compile.SimpleRestrictionTest
    [junit] Tests run: 1, Failures: 0, Errors: 0, Time elapsed: 4.04 sec
    [junit] Running org.apache.axis2.schema.compile.SimpleSequence2Test
    [junit] Tests run: 1, Failures: 0, Errors: 0, Time elapsed: 5.589 sec
    [junit] Running org.apache.axis2.schema.compile.SimpleSequenceTest
    [junit] Tests run: 1, Failures: 0, Errors: 0, Time elapsed: 3.331 sec
    [junit] Running org.apache.axis2.schema.compile.XmlMaxOccurs2Test
    [junit] Tests run: 1, Failures: 0, Errors: 0, Time elapsed: 5.021 sec
    [junit] Running org.apache.axis2.schema.compile.XmlmaxOccursTest
    [junit] Tests run: 1, Failures: 0, Errors: 0, Time elapsed: 3.262 sec
    [junit] Running org.apache.axis2.schema.compile.simple.SimpleTypeAllCompileTest
    [junit] Tests run: 1, Failures: 0, Errors: 0, Time elapsed: 7.88 sec
    [junit] Running org.apache.axis2.schema.enumeration.EnumerationTest
    [junit] Tests run: 1, Failures: 0, Errors: 0, Time elapsed: 0.563 sec
    [junit] Running org.apache.axis2.schema.extension.ComplexExtenstionTest
    [junit] Tests run: 1, Failures: 0, Errors: 0, Time elapsed: 0.321 sec
    [junit] Running org.apache.axis2.schema.extension.SimpleExtensionTest
    [junit] Tests run: 1, Failures: 0, Errors: 0, Time elapsed: 0.7 sec
    [junit] Running org.apache.axis2.schema.populate.derived.DerivedTypeBytePopulateTest
    [junit] Tests run: 1, Failures: 0, Errors: 0, Time elapsed: 0.828 sec
    [junit] Running org.apache.axis2.schema.populate.derived.DerivedTypeIntPopulateTest
    [junit] Tests run: 1, Failures: 0, Errors: 0, Time elapsed: 0.751 sec
    [junit] Running org.apache.axis2.schema.populate.derived.DerivedTypeIntegerPopulateTest
    [junit] Tests run: 1, Failures: 0, Errors: 0, Time elapsed: 0.764 sec
    [junit] Running org.apache.axis2.schema.populate.derived.DerivedTypeLongPopulateTest
    [junit] Tests run: 1, Failures: 0, Errors: 0, Time elapsed: 0.826 sec
    [junit] Running org.apache.axis2.schema.populate.derived.DerivedTypeNegativeIntegerPopulateTest
    [junit] Tests run: 1, Failures: 0, Errors: 0, Time elapsed: 0.957 sec
    [junit] Running org.apache.axis2.schema.populate.derived.DerivedTypeNonNegativeIntegerPopulateTest
    [junit] Tests run: 1, Failures: 0, Errors: 0, Time elapsed: 1.847 sec
    [junit] Running org.apache.axis2.schema.populate.derived.DerivedTypeNonPositiveIntegerPopulateTest
    [junit] Tests run: 1, Failures: 0, Errors: 0, Time elapsed: 0.854 sec
    [junit] Running org.apache.axis2.schema.populate.derived.DerivedTypePositveIntegerPopulateTest
    [junit] Tests run: 1, Failures: 0, Errors: 0, Time elapsed: 0.828 sec
    [junit] Running org.apache.axis2.schema.populate.derived.DerivedTypeShortPopulateTest
    [junit] Tests run: 1, Failures: 0, Errors: 0, Time elapsed: 0.797 sec
    [junit] Running org.apache.axis2.schema.populate.derived.DerivedTypeUnsignedBytePopulateTest
    [junit] Tests run: 1, Failures: 0, Errors: 0, Time elapsed: 0.767 sec
    [junit] Running org.apache.axis2.schema.populate.derived.DerivedTypeUnsignedIntPopulateTest
    [junit] Tests run: 1, Failures: 0, Errors: 0, Time elapsed: 0.757 sec
    [junit] Running org.apache.axis2.schema.populate.derived.DerivedTypeUnsignedLongPopulateTest
    [junit] Tests run: 1, Failures: 0, Errors: 0, Time elapsed: 0.912 sec
    [junit] Running org.apache.axis2.schema.populate.derived.DerivedTypeUnsignedShortPopulateTest
    [junit] Tests run: 1, Failures: 0, Errors: 0, Time elapsed: 1.969 sec
    [junit] Running org.apache.axis2.schema.populate.other.ADBInOutTest
    [junit] Tests run: 2, Failures: 0, Errors: 0, Time elapsed: 0.627 sec
    [junit] Running org.apache.axis2.schema.populate.other.PopulateAnonComplexTypeTest
    [junit] Tests run: 1, Failures: 0, Errors: 0, Time elapsed: 0.58 sec
    [junit] Running org.apache.axis2.schema.populate.other.PopulateAnyTypeTest
    [junit] Tests run: 1, Failures: 0, Errors: 0, Time elapsed: 0.602 sec
    [junit] Running org.apache.axis2.schema.populate.other.PopulateArrayInArrayTest
    [junit] Tests run: 1, Failures: 0, Errors: 0, Time elapsed: 0.597 sec
    [junit] Running org.apache.axis2.schema.populate.other.PopulateArrayTest
    [junit] Tests run: 1, Failures: 0, Errors: 0, Time elapsed: 0.548 sec
    [junit] Running org.apache.axis2.schema.populate.other.PopulateChoiceTest
    [junit] Tests run: 1, Failures: 0, Errors: 0, Time elapsed: 0.854 sec
    [junit] Running org.apache.axis2.schema.populate.other.PopulateComplexMinOccurs0Test
    [junit] Tests run: 4, Failures: 0, Errors: 0, Time elapsed: 0.569 sec
    [junit] Running org.apache.axis2.schema.populate.other.PopulateMinOccurs0Test
    [junit] Tests run: 3, Failures: 0, Errors: 0, Time elapsed: 0.541 sec
    [junit] Running org.apache.axis2.schema.populate.other.PopulateMixedMinoccurs0Test
    [junit] Tests run: 2, Failures: 0, Errors: 0, Time elapsed: 0.547 sec
    [junit] Running org.apache.axis2.schema.populate.other.PopulateParticleAllTest
    [junit] Tests run: 1, Failures: 0, Errors: 0, Time elapsed: 0.552 sec
    [junit] Running org.apache.axis2.schema.populate.other.PopulateRecursiveTest
    [junit] Tests run: 1, Failures: 0, Errors: 0, Time elapsed: 0.549 sec
    [junit] Running org.apache.axis2.schema.populate.simple.SimpleTypeAnyURIPopulateTest
    [junit] Tests run: 1, Failures: 0, Errors: 0, Time elapsed: 0.549 sec
    [junit] Running org.apache.axis2.schema.populate.simple.SimpleTypeBase64BinPopulateTest
    [junit] Tests run: 1, Failures: 0, Errors: 0, Time elapsed: 0.526 sec
    [junit] Running org.apache.axis2.schema.populate.simple.SimpleTypeBooleanPopulateTest
    [junit] Tests run: 1, Failures: 0, Errors: 0, Time elapsed: 0.923 sec
    [junit] Running org.apache.axis2.schema.populate.simple.SimpleTypeDatePopulateTest
    [junit] Tests run: 1, Failures: 0, Errors: 0, Time elapsed: 1.322 sec
    [junit] Running org.apache.axis2.schema.populate.simple.SimpleTypeDateTimePopulateTest
    [junit] Tests run: 1, Failures: 0, Errors: 0, Time elapsed: 0.622 sec
    [junit] Running org.apache.axis2.schema.populate.simple.SimpleTypeDayPopulateTest
    [junit] Tests run: 1, Failures: 0, Errors: 0, Time elapsed: 0.595 sec
    [junit] Running org.apache.axis2.schema.populate.simple.SimpleTypeDoublePopulateTest
    [junit] Tests run: 1, Failures: 0, Errors: 0, Time elapsed: 0.558 sec
    [junit] Running org.apache.axis2.schema.populate.simple.SimpleTypeDurationPopulateTest
    [junit] Tests run: 1, Failures: 0, Errors: 0, Time elapsed: 0.573 sec
    [junit] Running org.apache.axis2.schema.populate.simple.SimpleTypeFloatPopulateTest
    [junit] Tests run: 1, Failures: 0, Errors: 0, Time elapsed: 0.548 sec
    [junit] Running org.apache.axis2.schema.populate.simple.SimpleTypeHexBinaryPopulateTest
    [junit] Tests run: 1, Failures: 0, Errors: 0, Time elapsed: 0.78 sec
    [junit] Running org.apache.axis2.schema.populate.simple.SimpleTypeMonthDayPopulateTest
    [junit] Tests run: 1, Failures: 0, Errors: 0, Time elapsed: 0.56 sec
    [junit] Running org.apache.axis2.schema.populate.simple.SimpleTypeQNamePopulateTest
    [junit] Tests run: 1, Failures: 0, Errors: 0, Time elapsed: 0.782 sec
    [junit] Running org.apache.axis2.schema.populate.simple.SimpleTypeTimePopulateTest
    [junit] Tests run: 1, Failures: 0, Errors: 0, Time elapsed: 0.583 sec
    [junit] Running org.apache.axis2.schema.populate.simple.SimpleTypegMonthPopulateTest
    [junit] Tests run: 1, Failures: 0, Errors: 0, Time elapsed: 0.582 sec
    [junit] Running org.apache.axis2.schema.populate.simple.SimpleTypegYearMonthPopulateTest
    [junit] Tests run: 1, Failures: 0, Errors: 0, Time elapsed: 0.548 sec
    [junit] Running org.apache.axis2.schema.populate.simple.SimpleTypegYearPopulateTest
    [junit] Tests run: 1, Failures: 0, Errors: 0, Time elapsed: 0.555 sec
    [junit] Running org.apache.axis2.schema.restriction.ComplexRestrictionTest
    [junit] Tests run: 1, Failures: 0, Errors: 0, Time elapsed: 0.522 sec
    [junit] Running org.apache.axis2.schema.restriction.SimpleRestrictionTest
    [junit] Tests run: 1, Failures: 0, Errors: 0, Time elapsed: 0.907 sec
    [junit] Running org.apache.axis2.schema.testsuite.AnyElementsTest
    [junit] Tests run: 3, Failures: 0, Errors: 0, Time elapsed: 0.718 sec
    [junit] Running org.apache.axis2.schema.testsuite.CustomElementsTest
    [junit] Tests run: 3, Failures: 0, Errors: 0, Time elapsed: 0.733 sec
    [junit] Running org.apache.axis2.schema.testsuite.IntElementsTest
    [junit] Tests run: 3, Failures: 0, Errors: 0, Time elapsed: 0.644 sec
    [junit] Running org.apache.axis2.schema.testsuite.OuterElementsTest
    [junit] Tests run: 5, Failures: 0, Errors: 0, Time elapsed: 0.898 sec
    [junit] Running org.apache.axis2.schema.testsuite.StringElementsTest
    [junit] Tests run: 3, Failures: 0, Errors: 0, Time elapsed: 1.871 sec
    [junit] Running org.apache.axis2.schema.testsuite.XsdAnyElementsTest
    [junit] Tests run: 3, Failures: 0, Errors: 0, Time elapsed: 0.905 sec
    [junit] Running org.apache.axis2.schema.union.UnionTest
    [junit] Tests run: 3, Failures: 0, Errors: 0, Time elapsed: 0.803 sec

jar:jar:
    [jar] Building jar: /export/home/illsleyd/continuum/continuum-1.0.3/apps/continuum/working-directory/1/modules/adb-codegen/target/axis2-adb-codegen-SNAPSHOT.jar

jar:install:
    [echo] Installing...
Uploading to org.apache.axis2/jars/axis2-adb-codegen-SNAPSHOT.jar: 
.................... (114K)
Uploading to org.apache.axis2/poms/axis2-adb-codegen-SNAPSHOT.pom: 
.................... (15K)

+----------------------------------------
| Executing multiproject:install-callback Apache Axis 2.0 - Addressing
| Memory: 37M/46M
+----------------------------------------
DEPRECATED: the default goal should be specified in the <build> section of project.xml instead of maven.xml
DEPRECATED: the default goal should be specified in the <build> section of project.xml instead of maven.xml

build:end:

build:start:

multiproject:install-callback:
    [echo] Running jar:install for Apache Axis 2.0 - Addressing
java:prepare-filesystem:
    [mkdir] Created dir: /export/home/illsleyd/continuum/continuum-1.0.3/apps/continuum/working-directory/1/modules/addressing/target/classes
Running post goal: java:prepare-filesystem

java:compile:
    [echo] Compiling to /export/home/illsleyd/continuum/continuum-1.0.3/apps/continuum/working-directory/1/modules/addressing/target/classes
    [javac] Compiling 9 source files to /export/home/illsleyd/continuum/continuum-1.0.3/apps/continuum/working-directory/1/modules/addressing/target/classes
Running post goal: java:compile
    [mkdir] Created dir: /export/home/illsleyd/continuum/continuum-1.0.3/apps/continuum/working-directory/1/modules/addressing/target/classes/META-INF
    [copy] Copying 1 file to /export/home/illsleyd/continuum/continuum-1.0.3/apps/continuum/working-directory/1/modules/addressing/target/classes/META-INF
    [copy] Copying 1 file to /export/home/illsleyd/continuum/continuum-1.0.3/apps/continuum/working-directory/1/modules/addressing/target/classes/META-INF
    [copy] Copying 1 file to /export/home/illsleyd/continuum/continuum-1.0.3/apps/continuum/working-directory/1/modules/addressing/target/classes/META-INF
    [copy] Copying 1 file to /export/home/illsleyd/continuum/continuum-1.0.3/apps/continuum/working-directory/1/modules/addressing/target
    [mkdir] Created dir: /export/home/illsleyd/continuum/continuum-1.0.3/apps/continuum/working-directory/1/modules/addressing/target/modules
    [jar] Building jar: /export/home/illsleyd/continuum/continuum-1.0.3/apps/continuum/working-directory/1/modules/addressing/target/addressing-SNAPSHOT.mar
    [copy] Copying 1 file to /export/home/illsleyd/continuum/continuum-1.0.3/apps/continuum/working-directory/1/modules/addressing/target/modules
    [copy] Copying 1 file to /export/home/illsleyd/.maven/repository/org.apache.axis2/mars

java:jar-resources:
Copying 1 file to /export/home/illsleyd/continuum/continuum-1.0.3/apps/continuum/working-directory/1/modules/addressing/target/classes

test:test:
java:prepare-filesystem:
Running post goal: java:prepare-filesystem

java:compile:
    [echo] Compiling to /export/home/illsleyd/continuum/continuum-1.0.3/apps/continuum/working-directory/1/modules/addressing/target/classes
Running post goal: java:compile
    [copy] Copying 1 file to /export/home/illsleyd/continuum/continuum-1.0.3/apps/continuum/working-directory/1/modules/addressing/target/classes/META-INF
    [copy] Copying 1 file to /export/home/illsleyd/continuum/continuum-1.0.3/apps/continuum/working-directory/1/modules/addressing/target/classes/META-INF
    [jar] Building jar: /export/home/illsleyd/continuum/continuum-1.0.3/apps/continuum/working-directory/1/modules/addressing/target/addressing-SNAPSHOT.mar
    [copy] Copying 1 file to /export/home/illsleyd/continuum/continuum-1.0.3/apps/continuum/working-directory/1/modules/addressing/target/modules
    [copy] Copying 1 file to /export/home/illsleyd/.maven/repository/org.apache.axis2/mars

java:jar-resources:

test:prepare-filesystem:
    [mkdir] Created dir: /export/home/illsleyd/continuum/continuum-1.0.3/apps/continuum/working-directory/1/modules/addressing/target/test-classes
    [mkdir] Created dir: /export/home/illsleyd/continuum/continuum-1.0.3/apps/continuum/working-directory/1/modules/addressing/target/test-reports

test:test-resources:
Copying 35 files to /export/home/illsleyd/continuum/continuum-1.0.3/apps/continuum/working-directory/1/modules/addressing/target/test-classes
Copying 2 files to /export/home/illsleyd/continuum/continuum-1.0.3/apps/continuum/working-directory/1/modules/addressing/target/test-classes

test:compile:
    [javac] Compiling 8 source files to /export/home/illsleyd/continuum/continuum-1.0.3/apps/continuum/working-directory/1/modules/addressing/target/test-classes
    [javac] Note: /export/home/illsleyd/continuum/continuum-1.0.3/apps/continuum/working-directory/1/modules/addressing/test/org/apache/axis2/handlers/addressing/AddressingOutHandlerTest.java uses or overrides a deprecated API.
    [javac] Note: Recompile with -Xlint:deprecation for details.

    [junit] Running org.apache.axis2.addressing.AddressingFaultsTest
    [junit] Tests run: 6, Failures: 0, Errors: 0, Time elapsed: 0.56 sec
    [junit] Running org.apache.axis2.handlers.addressing.AddressingFinalInHandlerTest
    [junit] Tests run: 17, Failures: 0, Errors: 0, Time elapsed: 3.978 sec
    [junit] Running org.apache.axis2.handlers.addressing.AddressingInFaultHandlerTest
    [junit] Tests run: 4, Failures: 0, Errors: 0, Time elapsed: 1.165 sec
    [junit] Running org.apache.axis2.handlers.addressing.AddressingOutHandlerTest
    [junit] Tests run: 6, Failures: 0, Errors: 0, Time elapsed: 1.777 sec
    [junit] Running org.apache.axis2.handlers.addressing.AddressingSubmissionInHandlerTest
    [junit] Tests run: 14, Failures: 0, Errors: 0, Time elapsed: 1.524 sec
    [junit] Running org.apache.axis2.handlers.addressing.AddressingValidationHandlerTest
    [junit] Tests run: 4, Failures: 0, Errors: 0, Time elapsed: 1.133 sec

jar:jar:
    [jar] Building jar: /export/home/illsleyd/continuum/continuum-1.0.3/apps/continuum/working-directory/1/modules/addressing/target/axis2-addressing-SNAPSHOT.jar

jar:install:
    [echo] Installing...
Uploading to org.apache.axis2/jars/axis2-addressing-SNAPSHOT.jar: 
.................... (32K)
Uploading to org.apache.axis2/poms/axis2-addressing-SNAPSHOT.pom: 
.................... (15K)

+----------------------------------------
| Executing multiproject:install-callback Apache Axis 2.0 - Samples
| Memory: 35M/44M
+----------------------------------------
DEPRECATED: the default goal should be specified in the <build> section of project.xml instead of maven.xml
DEPRECATED: the default goal should be specified in the <build> section of project.xml instead of maven.xml

build:end:

Trying to get missing/snapshot dependencies required by Apache Axis 2.0 - Samples:
Attempting to download axis2-addressing-SNAPSHOT.jar.
Skipping download as local copy is up to date!
build:start:

multiproject:install-callback:
    [echo] Running jar:install for Apache Axis 2.0 - Samples
java:prepare-filesystem:
    [mkdir] Created dir: /export/home/illsleyd/continuum/continuum-1.0.3/apps/continuum/working-directory/1/modules/samples/target/classes
Running post goal: java:prepare-filesystem

java:compile:
    [echo] Compiling to /export/home/illsleyd/continuum/continuum-1.0.3/apps/continuum/working-directory/1/modules/samples/target/classes
    [javac] Compiling 5 source files to /export/home/illsleyd/continuum/continuum-1.0.3/apps/continuum/working-directory/1/modules/samples/target/classes

java:jar-resources:
Copying 2 files to /export/home/illsleyd/continuum/continuum-1.0.3/apps/continuum/working-directory/1/modules/samples/target/classes/META-INF

test:test:
java:prepare-filesystem:
Running post goal: java:prepare-filesystem

java:compile:
Overriding previous definition of reference to samples.src.path
    [echo] Compiling to /export/home/illsleyd/continuum/continuum-1.0.3/apps/continuum/working-directory/1/modules/samples/target/classes

java:jar-resources:

test:prepare-filesystem:
    [mkdir] Created dir: /export/home/illsleyd/continuum/continuum-1.0.3/apps/continuum/working-directory/1/modules/samples/target/test-classes
    [mkdir] Created dir: /export/home/illsleyd/continuum/continuum-1.0.3/apps/continuum/working-directory/1/modules/samples/target/test-reports

test:test-resources:

test:compile:

Running post goal: test:test
create-samples:
    [mkdir] Created dir: /export/home/illsleyd/continuum/continuum-1.0.3/apps/continuum/working-directory/1/modules/samples/target/samples/userguide
    [mkdir] Created dir: /export/home/illsleyd/continuum/continuum-1.0.3/apps/continuum/working-directory/1/modules/samples/target/samples/wsdl
    [copy] Copying 2 files to /export/home/illsleyd/continuum/continuum-1.0.3/apps/continuum/working-directory/1/modules/samples/target/samples/wsdl
userguide:
    [mkdir] Created dir: /export/home/illsleyd/continuum/continuum-1.0.3/apps/continuum/working-directory/1/modules/samples/target/samples/userguide/src
    [copy] Copying 22 files to /export/home/illsleyd/continuum/continuum-1.0.3/apps/continuum/working-directory/1/modules/samples/target/samples/userguide/src
    [jar] Building MANIFEST-only jar: /export/home/illsleyd/continuum/continuum-1.0.3/apps/continuum/working-directory/1/modules/samples/target/samples/userguide/sample.jar

googleSpellcheck:
    [mkdir] Created dir: /export/home/illsleyd/continuum/continuum-1.0.3/apps/continuum/working-directory/1/modules/samples/target/googlespellcheck
    [jar] Building MANIFEST-only jar: /export/home/illsleyd/continuum/continuum-1.0.3/apps/continuum/working-directory/1/modules/samples/target/googlespellcheck/googleSpellcheck.jar

yahooRESTSearch:
    [mkdir] Created dir: /export/home/illsleyd/continuum/continuum-1.0.3/apps/continuum/working-directory/1/modules/samples/target/yahoorestsearch
    [jar] Building jar: /export/home/illsleyd/continuum/continuum-1.0.3/apps/continuum/working-directory/1/modules/samples/target/yahoorestsearch/yahooRESTSearch.jar

version:
    [mkdir] Created dir: /export/home/illsleyd/continuum/continuum-1.0.3/apps/continuum/working-directory/1/modules/samples/target/version
    [jar] Building jar: /export/home/illsleyd/continuum/continuum-1.0.3/apps/continuum/working-directory/1/modules/samples/target/version/version.jar
    [copy] Copying 1 file to /export/home/illsleyd/continuum/continuum-1.0.3/apps/continuum/working-directory/1/modules/samples/target/toWar/services

groovy:
    [mkdir] Created dir: /export/home/illsleyd/continuum/continuum-1.0.3/apps/continuum/working-directory/1/modules/samples/target/groovy
    [copy] Copying 1 file to /export/home/illsleyd/continuum/continuum-1.0.3/apps/continuum/working-directory/1/modules/samples/target/classes/sample/groovy
    [mkdir] Created dir: /export/home/illsleyd/continuum/continuum-1.0.3/apps/continuum/working-directory/1/modules/samples/target/classes/sample/groovy/lib
    [mkdir] Created dir: /export/home/illsleyd/continuum/continuum-1.0.3/apps/continuum/working-directory/1/modules/samples/target/classes/sample/groovy/META-INF
    [mkdir] Created dir: /export/home/illsleyd/continuum/continuum-1.0.3/apps/continuum/working-directory/1/modules/samples/target/classes/sample/groovy/sample
    [mkdir] Created dir: /export/home/illsleyd/continuum/continuum-1.0.3/apps/continuum/working-directory/1/modules/samples/target/classes/sample/groovy/sample/groovy
    [copy] Copying 1 file to /export/home/illsleyd/continuum/continuum-1.0.3/apps/continuum/working-directory/1/modules/samples/target/classes/sample/groovy/sample/groovy
    [copy] Copying 1 file to /export/home/illsleyd/continuum/continuum-1.0.3/apps/continuum/working-directory/1/modules/samples/target/classes/sample/groovy/META-INF
    [delete] Deleting: /export/home/illsleyd/continuum/continuum-1.0.3/apps/continuum/working-directory/1/modules/samples/target/classes/sample/groovy/GroovyReceiver.class
    [copy] Copying 1 file to /export/home/illsleyd/continuum/continuum-1.0.3/apps/continuum/working-directory/1/modules/samples/target/classes/sample/groovy/lib
    [jar] Building jar: /export/home/illsleyd/continuum/continuum-1.0.3/apps/continuum/working-directory/1/modules/samples/target/groovy/groovyService.aar



jar:jar:
    [jar] Building jar: /export/home/illsleyd/continuum/continuum-1.0.3/apps/continuum/working-directory/1/modules/samples/target/axis2-samples-SNAPSHOT.jar

jar:install:
    [echo] Installing...
Uploading to org.apache.axis2/jars/axis2-samples-SNAPSHOT.jar: 
.................... (1623K)
Uploading to org.apache.axis2/poms/axis2-samples-SNAPSHOT.pom: 
.................... (16K)

+----------------------------------------
| Executing multiproject:install-callback Apache Axis 2.0 - spring
| Memory: 38M/48M
+----------------------------------------
DEPRECATED: the default goal should be specified in the <build> section of project.xml instead of maven.xml
DEPRECATED: the default goal should be specified in the <build> section of project.xml instead of maven.xml

build:end:

build:start:

multiproject:install-callback:
    [echo] Running jar:install for Apache Axis 2.0 - spring
java:prepare-filesystem:
    [mkdir] Created dir: /export/home/illsleyd/continuum/continuum-1.0.3/apps/continuum/working-directory/1/modules/spring/target/classes
Running post goal: java:prepare-filesystem

java:compile:
    [echo] Compiling to /export/home/illsleyd/continuum/continuum-1.0.3/apps/continuum/working-directory/1/modules/spring/target/classes
    [javac] Compiling 3 source files to /export/home/illsleyd/continuum/continuum-1.0.3/apps/continuum/working-directory/1/modules/spring/target/classes

java:jar-resources:
Copying 2 files to /export/home/illsleyd/continuum/continuum-1.0.3/apps/continuum/working-directory/1/modules/spring/target/classes/META-INF

test:test:
    [echo] No tests to run.

jar:jar:
    [jar] Building jar: /export/home/illsleyd/continuum/continuum-1.0.3/apps/continuum/working-directory/1/modules/spring/target/axis2-spring-SNAPSHOT.jar

jar:install:
    [echo] Installing...
Uploading to org.apache.axis2/jars/axis2-spring-SNAPSHOT.jar: 
.................... (9K)
Uploading to org.apache.axis2/poms/axis2-spring-SNAPSHOT.pom: 
.................... (14K)

+----------------------------------------
| Executing multiproject:install-callback Apache Axis 2.0 - XMLBeans Data Binding
| Memory: 41M/47M
+----------------------------------------
DEPRECATED: the default goal should be specified in the <build> section of project.xml instead of maven.xml
DEPRECATED: the default goal should be specified in the <build> section of project.xml instead of maven.xml

build:end:

build:start:

multiproject:install-callback:
    [echo] Running jar:install for Apache Axis 2.0 - XMLBeans Data Binding
java:prepare-filesystem:
    [mkdir] Created dir: /export/home/illsleyd/continuum/continuum-1.0.3/apps/continuum/working-directory/1/modules/xmlbeans/target/classes
Running post goal: java:prepare-filesystem

java:compile:
    [echo] Compiling to /export/home/illsleyd/continuum/continuum-1.0.3/apps/continuum/working-directory/1/modules/xmlbeans/target/classes
    [javac] Compiling 1 source file to /export/home/illsleyd/continuum/continuum-1.0.3/apps/continuum/working-directory/1/modules/xmlbeans/target/classes

java:jar-resources:
Copying 1 file to /export/home/illsleyd/continuum/continuum-1.0.3/apps/continuum/working-directory/1/modules/xmlbeans/target/classes
Copying 2 files to /export/home/illsleyd/continuum/continuum-1.0.3/apps/continuum/working-directory/1/modules/xmlbeans/target/classes/META-INF

test:test:
java:prepare-filesystem:
Running post goal: java:prepare-filesystem

java:compile:
    [echo] Compiling to /export/home/illsleyd/continuum/continuum-1.0.3/apps/continuum/working-directory/1/modules/xmlbeans/target/classes

java:jar-resources:

test:prepare-filesystem:
    [mkdir] Created dir: /export/home/illsleyd/continuum/continuum-1.0.3/apps/continuum/working-directory/1/modules/xmlbeans/target/test-classes
    [mkdir] Created dir: /export/home/illsleyd/continuum/continuum-1.0.3/apps/continuum/working-directory/1/modules/xmlbeans/target/test-reports

test:test-resources:
Copying 23 files to /export/home/illsleyd/continuum/continuum-1.0.3/apps/continuum/working-directory/1/modules/xmlbeans/target/test-classes
Copying 1 file to /export/home/illsleyd/continuum/continuum-1.0.3/apps/continuum/working-directory/1/modules/xmlbeans/target/test-classes

test:compile:
    [javac] Compiling 16 source files to /export/home/illsleyd/continuum/continuum-1.0.3/apps/continuum/working-directory/1/modules/xmlbeans/target/test-classes

    [junit] Running org.apache.axis2.xmlbeans.WSDL2Java10Test
    [junit] Tests run: 1, Failures: 0, Errors: 0, Time elapsed: 27.594 sec
    [junit] Running org.apache.axis2.xmlbeans.WSDL2Java11Test
    [junit] Tests run: 1, Failures: 0, Errors: 0, Time elapsed: 36.1 sec
    [junit] Running org.apache.axis2.xmlbeans.WSDL2Java12Test
    [junit] Tests run: 1, Failures: 0, Errors: 0, Time elapsed: 11.468 sec
    [junit] Running org.apache.axis2.xmlbeans.WSDL2Java13Test
    [junit] Tests run: 1, Failures: 0, Errors: 0, Time elapsed: 0.762 sec
    [junit] Running org.apache.axis2.xmlbeans.WSDL2Java1Test
    [junit] Tests run: 1, Failures: 0, Errors: 0, Time elapsed: 50.19 sec
    [junit] Running org.apache.axis2.xmlbeans.WSDL2Java2Test
    [junit] Tests run: 1, Failures: 0, Errors: 0, Time elapsed: 1.391 sec
    [junit] Running org.apache.axis2.xmlbeans.WSDL2Java3Test
    [junit] Tests run: 1, Failures: 0, Errors: 0, Time elapsed: 26.556 sec
    [junit] Running org.apache.axis2.xmlbeans.WSDL2Java4Test
    [junit] Tests run: 1, Failures: 0, Errors: 0, Time elapsed: 47.788 sec
    [junit] Running org.apache.axis2.xmlbeans.WSDL2Java5Test
    [junit] Tests run: 1, Failures: 0, Errors: 0, Time elapsed: 49.821 sec
    [junit] Running org.apache.axis2.xmlbeans.WSDL2Java6Test
    [junit] Tests run: 1, Failures: 0, Errors: 0, Time elapsed: 39.733 sec
    [junit] Running org.apache.axis2.xmlbeans.WSDL2Java7Test
    [junit] Tests run: 1, Failures: 0, Errors: 0, Time elapsed: 29.236 sec
    [junit] Running org.apache.axis2.xmlbeans.WSDL2Java8Test
    [junit] Tests run: 1, Failures: 0, Errors: 0, Time elapsed: 45.735 sec
    [junit] Running org.apache.axis2.xmlbeans.WSDL2Java9Test
    [junit] Tests run: 1, Failures: 0, Errors: 0, Time elapsed: 41.127 sec

jar:jar:
    [jar] Building jar: /export/home/illsleyd/continuum/continuum-1.0.3/apps/continuum/working-directory/1/modules/xmlbeans/target/axis2-xmlbeans-SNAPSHOT.jar

jar:install:
    [echo] Installing...
Uploading to org.apache.axis2/jars/axis2-xmlbeans-SNAPSHOT.jar: 
.................... (18K)
Uploading to org.apache.axis2/poms/axis2-xmlbeans-SNAPSHOT.pom: 
.................... (15K)

+----------------------------------------
| Executing multiproject:install-callback Apache Axis 2.0 - Tools
| Memory: 39M/51M
+----------------------------------------
DEPRECATED: the default goal should be specified in the <build> section of project.xml instead of maven.xml
DEPRECATED: the default goal should be specified in the <build> section of project.xml instead of maven.xml

build:end:

build:start:

multiproject:install-callback:
    [echo] Running jar:install for Apache Axis 2.0 - Tools
java:prepare-filesystem:
    [mkdir] Created dir: /export/home/illsleyd/continuum/continuum-1.0.3/apps/continuum/working-directory/1/modules/tool/target/classes
Running post goal: java:prepare-filesystem

java:compile:
    [echo] Compiling to /export/home/illsleyd/continuum/continuum-1.0.3/apps/continuum/working-directory/1/modules/tool/target/classes
    [javac] Compiling 1 source file to /export/home/illsleyd/continuum/continuum-1.0.3/apps/continuum/working-directory/1/modules/tool/target/classes

java:jar-resources:
Copying 2 files to /export/home/illsleyd/continuum/continuum-1.0.3/apps/continuum/working-directory/1/modules/tool/target/classes
Copying 2 files to /export/home/illsleyd/continuum/continuum-1.0.3/apps/continuum/working-directory/1/modules/tool/target/classes/META-INF

test:test:
    [echo] No tests to run.

jar:jar:
    [jar] Building jar: /export/home/illsleyd/continuum/continuum-1.0.3/apps/continuum/working-directory/1/modules/tool/target/axis2-tools-SNAPSHOT.jar

jar:install:
    [echo] Installing...
Uploading to org.apache.axis2/jars/axis2-tools-SNAPSHOT.jar: 
.................... (9K)
Uploading to org.apache.axis2/poms/axis2-tools-SNAPSHOT.pom: 
.................... (13K)

+----------------------------------------
| Executing multiproject:install-callback Apache Axis 2.0 - Integration
| Memory: 38M/50M
+----------------------------------------
DEPRECATED: the default goal should be specified in the <build> section of project.xml instead of maven.xml
DEPRECATED: the default goal should be specified in the <build> section of project.xml instead of maven.xml

build:end:

Trying to get missing/snapshot dependencies required by Apache Axis 2.0 - Integration:
Attempting to download axis2-adb-codegen-SNAPSHOT.jar.
Skipping download as local copy is up to date!
Attempting to download axis2-samples-SNAPSHOT.jar.
Skipping download as local copy is up to date!
Attempting to download axis2-spring-SNAPSHOT.jar.
Skipping download as local copy is up to date!
Attempting to download axis2-xmlbeans-SNAPSHOT.jar.
Skipping download as local copy is up to date!
Attempting to download axis2-tools-SNAPSHOT.jar.
Skipping download as local copy is up to date!
build:start:

multiproject:install-callback:
    [echo] Running jar:install for Apache Axis 2.0 - Integration
java:prepare-filesystem:
    [mkdir] Created dir: /export/home/illsleyd/continuum/continuum-1.0.3/apps/continuum/working-directory/1/modules/integration/target/classes
Running post goal: java:prepare-filesystem

java:compile:
    [echo] Compiling to /export/home/illsleyd/continuum/continuum-1.0.3/apps/continuum/working-directory/1/modules/integration/target/classes
    [javac] Compiling 136 source files to /export/home/illsleyd/continuum/continuum-1.0.3/apps/continuum/working-directory/1/modules/integration/target/classes
    [javac] Note: /export/home/illsleyd/continuum/continuum-1.0.3/apps/continuum/working-directory/1/modules/integration/src/test/soap12testing/client/SOAPComparator.java uses or overrides a deprecated API.
    [javac] Note: Recompile with -Xlint:deprecation for details.

java:jar-resources:
Copying 1 file to /export/home/illsleyd/continuum/continuum-1.0.3/apps/continuum/working-directory/1/modules/integration/target/classes

test:test:
java:prepare-filesystem:
Running post goal: java:prepare-filesystem

java:compile:
    [echo] Compiling to /export/home/illsleyd/continuum/continuum-1.0.3/apps/continuum/working-directory/1/modules/integration/target/classes
    [javac] Compiling 10 source files to /export/home/illsleyd/continuum/continuum-1.0.3/apps/continuum/working-directory/1/modules/integration/target/classes

java:jar-resources:

test:prepare-filesystem:
    [mkdir] Created dir: /export/home/illsleyd/continuum/continuum-1.0.3/apps/continuum/working-directory/1/modules/integration/target/test-classes
    [mkdir] Created dir: /export/home/illsleyd/continuum/continuum-1.0.3/apps/continuum/working-directory/1/modules/integration/target/test-reports

test:test-resources:
Copying 147 files to /export/home/illsleyd/continuum/continuum-1.0.3/apps/continuum/working-directory/1/modules/integration/target/test-classes

test:compile:
    [copy] Copying 1 file to /export/home/illsleyd/continuum/continuum-1.0.3/apps/continuum/working-directory/1/modules/integration/target/test-classes/modules
    [java] log4j:WARN No appenders could be found for logger (org.apache.axis2.i18n.ProjectResourceBundle).
    [java] log4j:WARN Please initialize the log4j system properly.
    [copy] Copying 1 file to /export/home/illsleyd/continuum/continuum-1.0.3/apps/continuum/working-directory/1/modules/integration/target/perf/src/samples/wsdl/perf
    [mkdir] Created dir: /export/home/illsleyd/continuum/continuum-1.0.3/apps/continuum/working-directory/1/modules/integration/target/perf/build
    [mkdir] Created dir: /export/home/illsleyd/continuum/continuum-1.0.3/apps/continuum/working-directory/1/modules/integration/target/perf/build/classes
    [mkdir] Created dir: /export/home/illsleyd/continuum/continuum-1.0.3/apps/continuum/working-directory/1/modules/integration/target/perf/build/lib
    [jar] Building jar: /export/home/illsleyd/continuum/continuum-1.0.3/apps/continuum/working-directory/1/modules/integration/target/perf/build/lib/XBeans-packaged.jar
    [echo] XmlBeans Availability = true
    [echo] Stax Availability= true
    [echo] Axis2 Availability= true
    [javac] Compiling 211 source files to /export/home/illsleyd/continuum/continuum-1.0.3/apps/continuum/working-directory/1/modules/integration/target/perf/build/classes
    [javac] Note: Some input files use or override a deprecated API.
    [javac] Note: Recompile with -Xlint:deprecation for details.
    [javac] Note: Some input files use unchecked or unsafe operations.
    [javac] Note: Recompile with -Xlint:unchecked for details.
    [copy] Copying 2 files to /export/home/illsleyd/continuum/continuum-1.0.3/apps/continuum/working-directory/1/modules/integration/target/perf/build/classes/META-INF
    [copy] Copying 1 file to /export/home/illsleyd/continuum/continuum-1.0.3/apps/continuum/working-directory/1/modules/integration/target/perf/build/classes/lib
    [jar] Building jar: /export/home/illsleyd/continuum/continuum-1.0.3/apps/continuum/working-directory/1/modules/integration/target/perf/build/lib/PerfPortType.aar
    [mkdir] Created dir: /export/home/illsleyd/continuum/continuum-1.0.3/apps/continuum/working-directory/1/modules/integration/target/perf/build/repo
    [mkdir] Created dir: /export/home/illsleyd/continuum/continuum-1.0.3/apps/continuum/working-directory/1/modules/integration/target/perf/build/repo/services
    [copy] Copying 1 file to /export/home/illsleyd/continuum/continuum-1.0.3/apps/continuum/working-directory/1/modules/integration/target/perf/build/repo/services
    [echo] XmlBeans Availability = true
    [echo] Stax Availability= true
    [echo] Axis2 Availability= true
    [javac] Compiling 1 source file to /export/home/illsleyd/continuum/continuum-1.0.3/apps/continuum/working-directory/1/modules/integration/target/perf/build/classes
    [javac] /export/home/illsleyd/continuum/continuum-1.0.3/apps/continuum/working-directory/1/modules/integration/target/perf/test/samples/wsdl/perf/PerfPortTypeTest.java:46: warning: non-varargs call of varargs method with inexact argument type for last parameter;
    [javac] cast to java.lang.Class for a varargs call
    [javac] cast to java.lang.Class[] for a non-varargs call and to suppress this warning
    [javac]                             creatorMethod = declaredClass.getMethod("newInstance",null);
    [javac]                                                                                   ^
    [javac] /export/home/illsleyd/continuum/continuum-1.0.3/apps/continuum/working-directory/1/modules/integration/target/perf/test/samples/wsdl/perf/PerfPortTypeTest.java:53: warning: non-varargs call of varargs method with inexact argument type for last parameter;
    [javac] cast to java.lang.Object for a varargs call
    [javac] cast to java.lang.Object[] for a non-varargs call and to suppress this warning
    [javac]                     return  (org.apache.xmlbeans.XmlObject)creatorMethod.invoke(null,null);
    [javac]                                                                                      ^
    [javac] 2 warnings
    [jar] Building jar: /export/home/illsleyd/continuum/continuum-1.0.3/apps/continuum/working-directory/1/modules/integration/target/perf/build/lib/PerfPortType-test-client.jar
    [move] Moving 1 file to /export/home/illsleyd/continuum/continuum-1.0.3/apps/continuum/working-directory/1/modules/integration/target/perf/build/lib
    [move] Moving 1 file to /export/home/illsleyd/continuum/continuum-1.0.3/apps/continuum/working-directory/1/modules/integration/target/perf/build/lib
    [java] log4j:WARN No appenders could be found for logger (org.apache.axis2.i18n.ProjectResourceBundle).
    [java] log4j:WARN Please initialize the log4j system properly.
    [copy] Copying 1 file to /export/home/illsleyd/continuum/continuum-1.0.3/apps/continuum/working-directory/1/modules/integration/target/perf2/src/samples/wsdl/perf2
    [mkdir] Created dir: /export/home/illsleyd/continuum/continuum-1.0.3/apps/continuum/working-directory/1/modules/integration/target/perf2/build
    [mkdir] Created dir: /export/home/illsleyd/continuum/continuum-1.0.3/apps/continuum/working-directory/1/modules/integration/target/perf2/build/classes
    [mkdir] Created dir: /export/home/illsleyd/continuum/continuum-1.0.3/apps/continuum/working-directory/1/modules/integration/target/perf2/build/lib
    [echo] Stax Availability= true
    [echo] Axis2 Availability= true
    [javac] Compiling 6 source files to /export/home/illsleyd/continuum/continuum-1.0.3/apps/continuum/working-directory/1/modules/integration/target/perf2/build/classes
    [javac] Note: Some input files use unchecked or unsafe operations.
    [javac] Note: Recompile with -Xlint:unchecked for details.
    [copy] Copying 2 files to /export/home/illsleyd/continuum/continuum-1.0.3/apps/continuum/working-directory/1/modules/integration/target/perf2/build/classes/META-INF
    [jar] Building jar: /export/home/illsleyd/continuum/continuum-1.0.3/apps/continuum/working-directory/1/modules/integration/target/perf2/build/lib/PerfPortType.aar
    [mkdir] Created dir: /export/home/illsleyd/continuum/continuum-1.0.3/apps/continuum/working-directory/1/modules/integration/target/perf2/build/repo
    [mkdir] Created dir: /export/home/illsleyd/continuum/continuum-1.0.3/apps/continuum/working-directory/1/modules/integration/target/perf2/build/repo/services
    [copy] Copying 1 file to /export/home/illsleyd/continuum/continuum-1.0.3/apps/continuum/working-directory/1/modules/integration/target/perf2/build/repo/services
    [echo] Stax Availability= true
    [echo] Axis2 Availability= true
    [javac] Compiling 1 source file to /export/home/illsleyd/continuum/continuum-1.0.3/apps/continuum/working-directory/1/modules/integration/target/perf2/build/classes
    [jar] Building jar: /export/home/illsleyd/continuum/continuum-1.0.3/apps/continuum/working-directory/1/modules/integration/target/perf2/build/lib/PerfPortType-test-client.jar
    [move] Moving 1 file to /export/home/illsleyd/continuum/continuum-1.0.3/apps/continuum/working-directory/1/modules/integration/target/perf2/build/lib
    [java] Time to build schema type system: 1.867 seconds
    [java] Time to generate code: 3.084 seconds
    [java] Time to compile code: 16.277 seconds
    [echo] Running codegen RPC WSDLs - take 1
    [java] log4j:WARN No appenders could be found for logger (org.apache.axis2.i18n.ProjectResourceBundle).
    [java] log4j:WARN Please initialize the log4j system properly.
    [mkdir] Created dir: /export/home/illsleyd/continuum/continuum-1.0.3/apps/continuum/working-directory/1/modules/integration/target/rpc-test1/build
    [mkdir] Created dir: /export/home/illsleyd/continuum/continuum-1.0.3/apps/continuum/working-directory/1/modules/integration/target/rpc-test1/build/classes
    [mkdir] Created dir: /export/home/illsleyd/continuum/continuum-1.0.3/apps/continuum/working-directory/1/modules/integration/target/rpc-test1/build/lib
    [mkdir] Created dir: /export/home/illsleyd/continuum/continuum-1.0.3/apps/continuum/working-directory/1/modules/integration/target/rpc-test1/test
    [echo] Stax Availability= true
    [echo] Axis2 Availability= true
    [javac] Compiling 2 source files to /export/home/illsleyd/continuum/continuum-1.0.3/apps/continuum/working-directory/1/modules/integration/target/rpc-test1/build/classes
    [javac] Note: /export/home/illsleyd/continuum/continuum-1.0.3/apps/continuum/working-directory/1/modules/integration/target/rpc-test1/src/com/example/www/ServiceNameStub.java uses unchecked or unsafe operations.
    [javac] Note: Recompile with -Xlint:unchecked for details.
    [jar] Building jar: /export/home/illsleyd/continuum/continuum-1.0.3/apps/continuum/working-directory/1/modules/integration/target/rpc-test1/build/lib/ServiceName-test-client.jar
    [echo] Running codegen RPC WSDLs - take 2
    [java] log4j:WARN No appenders could be found for logger (org.apache.axis2.i18n.ProjectResourceBundle).
    [java] log4j:WARN Please initialize the log4j system properly.
    [mkdir] Created dir: /export/home/illsleyd/continuum/continuum-1.0.3/apps/continuum/working-directory/1/modules/integration/target/rpc-test2/build
    [mkdir] Created dir: /export/home/illsleyd/continuum/continuum-1.0.3/apps/continuum/working-directory/1/modules/integration/target/rpc-test2/build/classes
    [mkdir] Created dir: /export/home/illsleyd/continuum/continuum-1.0.3/apps/continuum/working-directory/1/modules/integration/target/rpc-test2/build/lib
    [mkdir] Created dir: /export/home/illsleyd/continuum/continuum-1.0.3/apps/continuum/working-directory/1/modules/integration/target/rpc-test2/test
    [echo] Stax Availability= true
    [echo] Axis2 Availability= true
    [javac] Compiling 2 source files to /export/home/illsleyd/continuum/continuum-1.0.3/apps/continuum/working-directory/1/modules/integration/target/rpc-test2/build/classes
    [javac] Note: /export/home/illsleyd/continuum/continuum-1.0.3/apps/continuum/working-directory/1/modules/integration/target/rpc-test2/src/com/example/www/ServiceNameStub.java uses unchecked or unsafe operations.
    [javac] Note: Recompile with -Xlint:unchecked for details.
    [jar] Building jar: /export/home/illsleyd/continuum/continuum-1.0.3/apps/continuum/working-directory/1/modules/integration/target/rpc-test2/build/lib/ServiceName-test-client.jar
    [echo] Running codegen RPC WSDLs - take 3
    [java] log4j:WARN No appenders could be found for logger (org.apache.axis2.i18n.ProjectResourceBundle).
    [java] log4j:WARN Please initialize the log4j system properly.
    [mkdir] Created dir: /export/home/illsleyd/continuum/continuum-1.0.3/apps/continuum/working-directory/1/modules/integration/target/rpc-test3/build
    [mkdir] Created dir: /export/home/illsleyd/continuum/continuum-1.0.3/apps/continuum/working-directory/1/modules/integration/target/rpc-test3/build/classes
    [mkdir] Created dir: /export/home/illsleyd/continuum/continuum-1.0.3/apps/continuum/working-directory/1/modules/integration/target/rpc-test3/build/lib
    [mkdir] Created dir: /export/home/illsleyd/continuum/continuum-1.0.3/apps/continuum/working-directory/1/modules/integration/target/rpc-test3/test
    [jar] Building jar: /export/home/illsleyd/continuum/continuum-1.0.3/apps/continuum/working-directory/1/modules/integration/target/rpc-test3/build/lib/XBeans-packaged.jar
    [echo] XmlBeans Availability = true
    [echo] Stax Availability= true
    [echo] Axis2 Availability= true
    [javac] Compiling 210 source files to /export/home/illsleyd/continuum/continuum-1.0.3/apps/continuum/working-directory/1/modules/integration/target/rpc-test3/build/classes
    [javac] Note: Some input files use or override a deprecated API.
    [javac] Note: Recompile with -Xlint:deprecation for details.
    [javac] Note: /export/home/illsleyd/continuum/continuum-1.0.3/apps/continuum/working-directory/1/modules/integration/target/rpc-test3/src/com/example/www/ServiceNameStub.java uses unchecked or unsafe operations.
    [javac] Note: Recompile with -Xlint:unchecked for details.
    [jar] Building jar: /export/home/illsleyd/continuum/continuum-1.0.3/apps/continuum/working-directory/1/modules/integration/target/rpc-test3/build/lib/ServiceName-test-client.jar
    [echo] Running codegen RPC WSDLs - take 4
    [java] log4j:WARN No appenders could be found for logger (org.apache.axis2.i18n.ProjectResourceBundle).
    [java] log4j:WARN Please initialize the log4j system properly.
    [mkdir] Created dir: /export/home/illsleyd/continuum/continuum-1.0.3/apps/continuum/working-directory/1/modules/integration/target/rpc-test4/build
    [mkdir] Created dir: /export/home/illsleyd/continuum/continuum-1.0.3/apps/continuum/working-directory/1/modules/integration/target/rpc-test4/build/classes
    [mkdir] Created dir: /export/home/illsleyd/continuum/continuum-1.0.3/apps/continuum/working-directory/1/modules/integration/target/rpc-test4/build/lib
    [mkdir] Created dir: /export/home/illsleyd/continuum/continuum-1.0.3/apps/continuum/working-directory/1/modules/integration/target/rpc-test4/test
    [jar] Building jar: /export/home/illsleyd/continuum/continuum-1.0.3/apps/continuum/working-directory/1/modules/integration/target/rpc-test4/build/lib/XBeans-packaged.jar
    [echo] XmlBeans Availability = true
    [echo] Stax Availability= true
    [echo] Axis2 Availability= true
    [javac] Compiling 210 source files to /export/home/illsleyd/continuum/continuum-1.0.3/apps/continuum/working-directory/1/modules/integration/target/rpc-test4/build/classes
    [javac] Note: Some input files use or override a deprecated API.
    [javac] Note: Recompile with -Xlint:deprecation for details.
    [javac] Note: /export/home/illsleyd/continuum/continuum-1.0.3/apps/continuum/working-directory/1/modules/integration/target/rpc-test4/src/com/example/www/ServiceNameMessageReceiverInOut.java uses unchecked or unsafe operations.
    [javac] Note: Recompile with -Xlint:unchecked for details.
    [copy] Copying 2 files to /export/home/illsleyd/continuum/continuum-1.0.3/apps/continuum/working-directory/1/modules/integration/target/rpc-test4/build/classes/META-INF
    [copy] Copying 1 file to /export/home/illsleyd/continuum/continuum-1.0.3/apps/continuum/working-directory/1/modules/integration/target/rpc-test4/build/classes/lib
    [jar] Building jar: /export/home/illsleyd/continuum/continuum-1.0.3/apps/continuum/working-directory/1/modules/integration/target/rpc-test4/build/lib/ServiceName.aar
    [echo] Running codegen RPC WSDLs with helper mode -  take 1
    [java] log4j:WARN No appenders could be found for logger (org.apache.axis2.i18n.ProjectResourceBundle).
    [java] log4j:WARN Please initialize the log4j system properly.
    [mkdir] Created dir: /export/home/illsleyd/continuum/continuum-1.0.3/apps/continuum/working-directory/1/modules/integration/target/helper-test1/build
    [mkdir] Created dir: /export/home/illsleyd/continuum/continuum-1.0.3/apps/continuum/working-directory/1/modules/integration/target/helper-test1/build/classes
    [mkdir] Created dir: /export/home/illsleyd/continuum/continuum-1.0.3/apps/continuum/working-directory/1/modules/integration/target/helper-test1/build/lib
    [mkdir] Created dir: /export/home/illsleyd/continuum/continuum-1.0.3/apps/continuum/working-directory/1/modules/integration/target/helper-test1/test
    [echo] Stax Availability= true
    [echo] Axis2 Availability= true
    [javac] Compiling 8 source files to /export/home/illsleyd/continuum/continuum-1.0.3/apps/continuum/working-directory/1/modules/integration/target/helper-test1/build/classes
    [javac] Note: Some input files use unchecked or unsafe operations.
    [javac] Note: Recompile with -Xlint:unchecked for details.
    [jar] Building jar: /export/home/illsleyd/continuum/continuum-1.0.3/apps/continuum/working-directory/1/modules/integration/target/helper-test1/build/lib/ServiceName-test-client.jar
    [echo] Running codegen RPC WSDLs with helper mode -  take 2
    [java] log4j:WARN No appenders could be found for logger (org.apache.axis2.i18n.ProjectResourceBundle).
    [java] log4j:WARN Please initialize the log4j system properly.
    [mkdir] Created dir: /export/home/illsleyd/continuum/continuum-1.0.3/apps/continuum/working-directory/1/modules/integration/target/helper-test2/build
    [mkdir] Created dir: /export/home/illsleyd/continuum/continuum-1.0.3/apps/continuum/working-directory/1/modules/integration/target/helper-test2/build/classes
    [mkdir] Created dir: /export/home/illsleyd/continuum/continuum-1.0.3/apps/continuum/working-directory/1/modules/integration/target/helper-test2/build/lib
    [mkdir] Created dir: /export/home/illsleyd/continuum/continuum-1.0.3/apps/continuum/working-directory/1/modules/integration/target/helper-test2/test
    [echo] Stax Availability= true
    [echo] Axis2 Availability= true
    [javac] Compiling 8 source files to /export/home/illsleyd/continuum/continuum-1.0.3/apps/continuum/working-directory/1/modules/integration/target/helper-test2/build/classes
    [javac] Note: Some input files use unchecked or unsafe operations.
    [javac] Note: Recompile with -Xlint:unchecked for details.
    [jar] Building jar: /export/home/illsleyd/continuum/continuum-1.0.3/apps/continuum/working-directory/1/modules/integration/target/helper-test2/build/lib/ServiceName-test-client.jar
    [echo] Running codegen for Enterprise WSDL - take 1
    [java] log4j:WARN No appenders could be found for logger (org.apache.axis2.description.AxisService).
    [java] log4j:WARN Please initialize the log4j system properly.
    [mkdir] Created dir: /export/home/illsleyd/continuum/continuum-1.0.3/apps/continuum/working-directory/1/modules/integration/target/enterprise-test1/build
    [mkdir] Created dir: /export/home/illsleyd/continuum/continuum-1.0.3/apps/continuum/working-directory/1/modules/integration/target/enterprise-test1/build/classes
    [mkdir] Created dir: /export/home/illsleyd/continuum/continuum-1.0.3/apps/continuum/working-directory/1/modules/integration/target/enterprise-test1/build/lib
    [mkdir] Created dir: /export/home/illsleyd/continuum/continuum-1.0.3/apps/continuum/working-directory/1/modules/integration/target/enterprise-test1/test
    [jar] Building jar: /export/home/illsleyd/continuum/continuum-1.0.3/apps/continuum/working-directory/1/modules/integration/target/enterprise-test1/build/lib/XBeans-packaged.jar
    [echo] XmlBeans Availability = true
    [echo] Stax Availability= true
    [echo] Axis2 Availability= true
    [javac] Compiling 740 source files to /export/home/illsleyd/continuum/continuum-1.0.3/apps/continuum/working-directory/1/modules/integration/target/enterprise-test1/build/classes
    [javac] Note: Some input files use or override a deprecated API.
    [javac] Note: Recompile with -Xlint:deprecation for details.
    [javac] Note: Some input files use unchecked or unsafe operations.
    [javac] Note: Recompile with -Xlint:unchecked for details.
    [jar] Building jar: /export/home/illsleyd/continuum/continuum-1.0.3/apps/continuum/working-directory/1/modules/integration/target/enterprise-test1/build/lib/SforceService-test-client.jar
    [echo] Running codegen for Enterprise WSDL - take 2
    [java] log4j:WARN No appenders could be found for logger (org.apache.axis2.description.AxisService).
    [java] log4j:WARN Please initialize the log4j system properly.
    [mkdir] Created dir: /export/home/illsleyd/continuum/continuum-1.0.3/apps/continuum/working-directory/1/modules/integration/target/enterprise-test2/build
    [mkdir] Created dir: /export/home/illsleyd/continuum/continuum-1.0.3/apps/continuum/working-directory/1/modules/integration/target/enterprise-test2/build/classes
    [mkdir] Created dir: /export/home/illsleyd/continuum/continuum-1.0.3/apps/continuum/working-directory/1/modules/integration/target/enterprise-test2/build/lib
    [mkdir] Created dir: /export/home/illsleyd/continuum/continuum-1.0.3/apps/continuum/working-directory/1/modules/integration/target/enterprise-test2/test
    [echo] Stax Availability= true
    [echo] Axis2 Availability= true
    [javac] Compiling 10 source files to /export/home/illsleyd/continuum/continuum-1.0.3/apps/continuum/working-directory/1/modules/integration/target/enterprise-test2/build/classes
    [javac] Note: /export/home/illsleyd/continuum/continuum-1.0.3/apps/continuum/working-directory/1/modules/integration/target/enterprise-test2/src/com/sforce/soap/enterprise/SforceServiceStub.java uses unchecked or unsafe operations.
    [javac] Note: Recompile with -Xlint:unchecked for details.
    [jar] Building jar: /export/home/illsleyd/continuum/continuum-1.0.3/apps/continuum/working-directory/1/modules/integration/target/enterprise-test2/build/lib/SforceService-test-client.jar
    [echo] Running codegen for Enterprise WSDL - take 3
    [java] log4j:WARN No appenders could be found for logger (org.apache.axis2.description.AxisService).
    [java] log4j:WARN Please initialize the log4j system properly.
    [mkdir] Created dir: /export/home/illsleyd/continuum/continuum-1.0.3/apps/continuum/working-directory/1/modules/integration/target/enterprise-test3/build
    [mkdir] Created dir: /export/home/illsleyd/continuum/continuum-1.0.3/apps/continuum/working-directory/1/modules/integration/target/enterprise-test3/build/classes
    [mkdir] Created dir: /export/home/illsleyd/continuum/continuum-1.0.3/apps/continuum/working-directory/1/modules/integration/target/enterprise-test3/build/lib
    [mkdir] Created dir: /export/home/illsleyd/continuum/continuum-1.0.3/apps/continuum/working-directory/1/modules/integration/target/enterprise-test3/test
    [jar] Building jar: /export/home/illsleyd/continuum/continuum-1.0.3/apps/continuum/working-directory/1/modules/integration/target/enterprise-test3/build/lib/XBeans-packaged.jar
    [echo] XmlBeans Availability = true
    [echo] Stax Availability= true
    [echo] Axis2 Availability= true
    [javac] Compiling 742 source files to /export/home/illsleyd/continuum/continuum-1.0.3/apps/continuum/working-directory/1/modules/integration/target/enterprise-test3/build/classes
    [javac] Note: Some input files use or override a deprecated API.
    [javac] Note: Recompile with -Xlint:deprecation for details.
    [javac] Note: Some input files use unchecked or unsafe operations.
    [javac] Note: Recompile with -Xlint:unchecked for details.
    [copy] Copying 2 files to /export/home/illsleyd/continuum/continuum-1.0.3/apps/continuum/working-directory/1/modules/integration/target/enterprise-test3/build/classes/META-INF
    [copy] Copying 1 file to /export/home/illsleyd/continuum/continuum-1.0.3/apps/continuum/working-directory/1/modules/integration/target/enterprise-test3/build/classes/lib
    [jar] Building jar: /export/home/illsleyd/continuum/continuum-1.0.3/apps/continuum/working-directory/1/modules/integration/target/enterprise-test3/build/lib/SforceService.aar
    [echo] Running codegen for Enterprise WSDL - take 4
    [java] log4j:WARN No appenders could be found for logger (org.apache.axis2.description.AxisService).
    [java] log4j:WARN Please initialize the log4j system properly.
    [mkdir] Created dir: /export/home/illsleyd/continuum/continuum-1.0.3/apps/continuum/working-directory/1/modules/integration/target/enterprise-test4/build
    [mkdir] Created dir: /export/home/illsleyd/continuum/continuum-1.0.3/apps/continuum/working-directory/1/modules/integration/target/enterprise-test4/build/classes
    [mkdir] Created dir: /export/home/illsleyd/continuum/continuum-1.0.3/apps/continuum/working-directory/1/modules/integration/target/enterprise-test4/build/lib
    [mkdir] Created dir: /export/home/illsleyd/continuum/continuum-1.0.3/apps/continuum/working-directory/1/modules/integration/target/enterprise-test4/test
    [jar] Building jar: /export/home/illsleyd/continuum/continuum-1.0.3/apps/continuum/working-directory/1/modules/integration/target/enterprise-test4/build/lib/XBeans-packaged.jar
    [echo] XmlBeans Availability = true
    [echo] Stax Availability= true
    [echo] Axis2 Availability= true
    [javac] Compiling 742 source files to /export/home/illsleyd/continuum/continuum-1.0.3/apps/continuum/working-directory/1/modules/integration/target/enterprise-test4/build/classes
    [javac] Note: Some input files use or override a deprecated API.
    [javac] Note: Recompile with -Xlint:deprecation for details.
    [javac] Note: Some input files use unchecked or unsafe operations.
    [javac] Note: Recompile with -Xlint:unchecked for details.
    [copy] Copying 2 files to /export/home/illsleyd/continuum/continuum-1.0.3/apps/continuum/working-directory/1/modules/integration/target/enterprise-test4/build/classes/META-INF
    [copy] Copying 1 file to /export/home/illsleyd/continuum/continuum-1.0.3/apps/continuum/working-directory/1/modules/integration/target/enterprise-test4/build/classes/lib
    [jar] Building jar: /export/home/illsleyd/continuum/continuum-1.0.3/apps/continuum/working-directory/1/modules/integration/target/enterprise-test4/build/lib/SforceService.aar
    [echo] Running codegen for eBaySvc WSDL
    [java] log4j:WARN No appenders could be found for logger (org.apache.axis2.description.AxisService).
    [java] log4j:WARN Please initialize the log4j system properly.
    [mkdir] Created dir: /export/home/illsleyd/continuum/continuum-1.0.3/apps/continuum/working-directory/1/modules/integration/target/eBaySvc/build
    [mkdir] Created dir: /export/home/illsleyd/continuum/continuum-1.0.3/apps/continuum/working-directory/1/modules/integration/target/eBaySvc/build/classes
    [mkdir] Created dir: /export/home/illsleyd/continuum/continuum-1.0.3/apps/continuum/working-directory/1/modules/integration/target/eBaySvc/build/lib
    [echo] Stax Availability= true
    [echo] Axis2 Availability= true
    [javac] Compiling 1016 source files to /export/home/illsleyd/continuum/continuum-1.0.3/apps/continuum/working-directory/1/modules/integration/target/eBaySvc/build/classes
    [javac] Note: Some input files use unchecked or unsafe operations.
    [javac] Note: Recompile with -Xlint:unchecked for details.
    [copy] Copying 2 files to /export/home/illsleyd/continuum/continuum-1.0.3/apps/continuum/working-directory/1/modules/integration/target/eBaySvc/build/classes/META-INF
    [jar] Building jar: /export/home/illsleyd/continuum/continuum-1.0.3/apps/continuum/working-directory/1/modules/integration/target/eBaySvc/build/lib/EBayAPIInterfaceService.aar
    [echo] Running codegen for eBaySvc WSDL Back word compatibiliy
    [java] log4j:WARN No appenders could be found for logger (org.apache.axis2.description.AxisService).
    [java] log4j:WARN Please initialize the log4j system properly.
    [mkdir] Created dir: /export/home/illsleyd/continuum/continuum-1.0.3/apps/continuum/working-directory/1/modules/integration/target/eBaySvcB/build
    [mkdir] Created dir: /export/home/illsleyd/continuum/continuum-1.0.3/apps/continuum/working-directory/1/modules/integration/target/eBaySvcB/build/classes
    [mkdir] Created dir: /export/home/illsleyd/continuum/continuum-1.0.3/apps/continuum/working-directory/1/modules/integration/target/eBaySvcB/build/lib
    [echo] Stax Availability= true
    [echo] Axis2 Availability= true
    [javac] Compiling 1015 source files to /export/home/illsleyd/continuum/continuum-1.0.3/apps/continuum/working-directory/1/modules/integration/target/eBaySvcB/build/classes
    [javac] Note: Some input files use unchecked or unsafe operations.
    [javac] Note: Recompile with -Xlint:unchecked for details.
    [copy] Copying 2 files to /export/home/illsleyd/continuum/continuum-1.0.3/apps/continuum/working-directory/1/modules/integration/target/eBaySvcB/build/classes/META-INF
    [jar] Building jar: /export/home/illsleyd/continuum/continuum-1.0.3/apps/continuum/working-directory/1/modules/integration/target/eBaySvcB/build/lib/EBayAPIInterfaceService.aar
    [echo] Running codegen for eBaySvc WSDL with un wrapping 
    [java] log4j:WARN No appenders could be found for logger (org.apache.axis2.description.AxisService).
    [java] log4j:WARN Please initialize the log4j system properly.
    [mkdir] Created dir: /export/home/illsleyd/continuum/continuum-1.0.3/apps/continuum/working-directory/1/modules/integration/target/eBaySvcUW/build
    [mkdir] Created dir: /export/home/illsleyd/continuum/continuum-1.0.3/apps/continuum/working-directory/1/modules/integration/target/eBaySvcUW/build/classes
    [mkdir] Created dir: /export/home/illsleyd/continuum/continuum-1.0.3/apps/continuum/working-directory/1/modules/integration/target/eBaySvcUW/build/lib
    [echo] Stax Availability= true
    [echo] Axis2 Availability= true
    [javac] Compiling 1016 source files to /export/home/illsleyd/continuum/continuum-1.0.3/apps/continuum/working-directory/1/modules/integration/target/eBaySvcUW/build/classes
    [javac] Note: Some input files use unchecked or unsafe operations.
    [javac] Note: Recompile with -Xlint:unchecked for details.
    [copy] Copying 2 files to /export/home/illsleyd/continuum/continuum-1.0.3/apps/continuum/working-directory/1/modules/integration/target/eBaySvcUW/build/classes/META-INF
    [jar] Building jar: /export/home/illsleyd/continuum/continuum-1.0.3/apps/continuum/working-directory/1/modules/integration/target/eBaySvcUW/build/lib/EBayAPIInterfaceService.aar
    [javac] Compiling 105 source files to /export/home/illsleyd/continuum/continuum-1.0.3/apps/continuum/working-directory/1/modules/integration/target/test-classes
    [javac] Note: /export/home/illsleyd/continuum/continuum-1.0.3/apps/continuum/working-directory/1/modules/integration/test/org/apache/axis2/engine/MessageContextInjectionTest.java uses or overrides a deprecated API.
    [javac] Note: Recompile with -Xlint:deprecation for details.
Running post goal: test:compile
    [mkdir] Created dir: /export/home/illsleyd/continuum/continuum-1.0.3/apps/continuum/working-directory/1/modules/integration/target/test-resources/samples/modules
    [mkdir] Created dir: /export/home/illsleyd/continuum/continuum-1.0.3/apps/continuum/working-directory/1/modules/integration/target/test-resources/samples/conf
    [mkdir] Created dir: /export/home/illsleyd/continuum/continuum-1.0.3/apps/continuum/working-directory/1/modules/integration/target/test-resources/repository-client/modules
    [mkdir] Created dir: /export/home/illsleyd/continuum/continuum-1.0.3/apps/continuum/working-directory/1/modules/integration/target/test-resources/repository-client/conf
    [copy] Copying 1 file to /export/home/illsleyd/continuum/continuum-1.0.3/apps/continuum/working-directory/1/modules/integration/target/test-resources/samples/modules
    [copy] Copying 1 file to /export/home/illsleyd/continuum/continuum-1.0.3/apps/continuum/working-directory/1/modules/integration/target/test-resources/samples/conf
    [copy] Copying 1 file to /export/home/illsleyd/continuum/continuum-1.0.3/apps/continuum/working-directory/1/modules/integration/target/test-resources/repository-client/modules
    [copy] Copying 1 file to /export/home/illsleyd/continuum/continuum-1.0.3/apps/continuum/working-directory/1/modules/integration/target/test-resources/repository-client/conf
    [mkdir] Created dir: /export/home/illsleyd/continuum/continuum-1.0.3/apps/continuum/working-directory/1/modules/integration/target/toWar/services
    [mkdir] Created dir: /export/home/illsleyd/continuum/continuum-1.0.3/apps/continuum/working-directory/1/modules/integration/target/test-resources/chunking-enabledRepository
    [mkdir] Created dir: /export/home/illsleyd/continuum/continuum-1.0.3/apps/continuum/working-directory/1/modules/integration/target/test-resources/chunking-enabledRepository/conf
    [copy] Copying 1 file to /export/home/illsleyd/continuum/continuum-1.0.3/apps/continuum/working-directory/1/modules/integration/target/test-resources/chunking-enabledRepository/conf
    [mkdir] Created dir: /export/home/illsleyd/continuum/continuum-1.0.3/apps/continuum/working-directory/1/modules/integration/target/test-resources/chunking-disabledRepository
    [mkdir] Created dir: /export/home/illsleyd/continuum/continuum-1.0.3/apps/continuum/working-directory/1/modules/integration/target/test-resources/chunking-disabledRepository/conf
    [copy] Copying 1 file to /export/home/illsleyd/continuum/continuum-1.0.3/apps/continuum/working-directory/1/modules/integration/target/test-resources/chunking-disabledRepository/conf
    [mkdir] Created dir: /export/home/illsleyd/continuum/continuum-1.0.3/apps/continuum/working-directory/1/modules/integration/target/test-resources/jms-enabled-server-repository
    [mkdir] Created dir: /export/home/illsleyd/continuum/continuum-1.0.3/apps/continuum/working-directory/1/modules/integration/target/test-resources/jms-enabled-server-repository/conf
    [mkdir] Created dir: /export/home/illsleyd/continuum/continuum-1.0.3/apps/continuum/working-directory/1/modules/integration/target/test-resources/jms-enabled-server-repository/modules
    [copy] Copying 1 file to /export/home/illsleyd/continuum/continuum-1.0.3/apps/continuum/working-directory/1/modules/integration/target/test-resources/jms-enabled-server-repository/conf
    [copy] Copying 1 file to /export/home/illsleyd/continuum/continuum-1.0.3/apps/continuum/working-directory/1/modules/integration/target/test-resources/jms-enabled-server-repository/modules
    [mkdir] Created dir: /export/home/illsleyd/continuum/continuum-1.0.3/apps/continuum/working-directory/1/modules/integration/target/test-resources/jms-enabled-client-repository
    [mkdir] Created dir: /export/home/illsleyd/continuum/continuum-1.0.3/apps/continuum/working-directory/1/modules/integration/target/test-resources/jms-enabled-client-repository/conf
    [mkdir] Created dir: /export/home/illsleyd/continuum/continuum-1.0.3/apps/continuum/working-directory/1/modules/integration/target/test-resources/jms-enabled-client-repository/modules
    [copy] Copying 1 file to /export/home/illsleyd/continuum/continuum-1.0.3/apps/continuum/working-directory/1/modules/integration/target/test-resources/jms-enabled-client-repository/conf
    [copy] Copying 1 file to /export/home/illsleyd/continuum/continuum-1.0.3/apps/continuum/working-directory/1/modules/integration/target/test-resources/jms-enabled-client-repository/modules
    [mkdir] Created dir: /export/home/illsleyd/continuum/continuum-1.0.3/apps/continuum/working-directory/1/modules/integration/target/test-resources/mail-transport-client-enabledRepository
    [mkdir] Created dir: /export/home/illsleyd/continuum/continuum-1.0.3/apps/continuum/working-directory/1/modules/integration/target/test-resources/mail-transport-client-enabledRepository/conf
    [mkdir] Created dir: /export/home/illsleyd/continuum/continuum-1.0.3/apps/continuum/working-directory/1/modules/integration/target/test-resources/mail-transport-client-enabledRepository/modules
    [copy] Copying 1 file to /export/home/illsleyd/continuum/continuum-1.0.3/apps/continuum/working-directory/1/modules/integration/target/test-resources/mail-transport-client-enabledRepository/conf
    [copy] Copying 1 file to /export/home/illsleyd/continuum/continuum-1.0.3/apps/continuum/working-directory/1/modules/integration/target/test-resources/mail-transport-client-enabledRepository/modules
    [mkdir] Created dir: /export/home/illsleyd/continuum/continuum-1.0.3/apps/continuum/working-directory/1/modules/integration/target/test-resources/mail-transport-server-enabledRepository
    [mkdir] Created dir: /export/home/illsleyd/continuum/continuum-1.0.3/apps/continuum/working-directory/1/modules/integration/target/test-resources/mail-transport-server-enabledRepository/conf
    [mkdir] Created dir: /export/home/illsleyd/continuum/continuum-1.0.3/apps/continuum/working-directory/1/modules/integration/target/test-resources/mail-transport-server-enabledRepository/modules
    [copy] Copying 1 file to /export/home/illsleyd/continuum/continuum-1.0.3/apps/continuum/working-directory/1/modules/integration/target/test-resources/mail-transport-server-enabledRepository/conf
    [copy] Copying 1 file to /export/home/illsleyd/continuum/continuum-1.0.3/apps/continuum/working-directory/1/modules/integration/target/test-resources/mail-transport-server-enabledRepository/modules
    [mkdir] Created dir: /export/home/illsleyd/continuum/continuum-1.0.3/apps/continuum/working-directory/1/modules/integration/target/test-resources/MessageContextInjectionRepo
    [mkdir] Created dir: /export/home/illsleyd/continuum/continuum-1.0.3/apps/continuum/working-directory/1/modules/integration/target/test-resources/integrationRepo/modules
    [mkdir] Created dir: /export/home/illsleyd/continuum/continuum-1.0.3/apps/continuum/working-directory/1/modules/integration/target/test-resources/integrationRepo/conf
    [copy] Copying 1 file to /export/home/illsleyd/continuum/continuum-1.0.3/apps/continuum/working-directory/1/modules/integration/target/test-resources/integrationRepo/modules
    [copy] Copying 1 file to /export/home/illsleyd/continuum/continuum-1.0.3/apps/continuum/working-directory/1/modules/integration/target/test-resources/integrationRepo/conf
    [mkdir] Created dir: /export/home/illsleyd/continuum/continuum-1.0.3/apps/continuum/working-directory/1/modules/integration/target/test-resources/commons-http-enabledRepository
    [mkdir] Created dir: /export/home/illsleyd/continuum/continuum-1.0.3/apps/continuum/working-directory/1/modules/integration/target/test-resources/commons-http-enabledRepository/conf
    [copy] Copying 1 file to /export/home/illsleyd/continuum/continuum-1.0.3/apps/continuum/working-directory/1/modules/integration/target/test-resources/commons-http-enabledRepository/conf
    [mkdir] Created dir: /export/home/illsleyd/continuum/continuum-1.0.3/apps/continuum/working-directory/1/modules/integration/target/test-resources/MTOM-enabledRepository
    [mkdir] Created dir: /export/home/illsleyd/continuum/continuum-1.0.3/apps/continuum/working-directory/1/modules/integration/target/test-resources/MTOM-enabledRepository/conf
    [mkdir] Created dir: /export/home/illsleyd/continuum/continuum-1.0.3/apps/continuum/working-directory/1/modules/integration/target/test-resources/MTOM-enabledRepository/modules
    [copy] Copying 1 file to /export/home/illsleyd/continuum/continuum-1.0.3/apps/continuum/working-directory/1/modules/integration/target/test-resources/MTOM-enabledRepository/conf
    [copy] Copying 1 file to /export/home/illsleyd/continuum/continuum-1.0.3/apps/continuum/working-directory/1/modules/integration/target/test-resources/MTOM-enabledRepository/modules
    [mkdir] Created dir: /export/home/illsleyd/continuum/continuum-1.0.3/apps/continuum/working-directory/1/modules/integration/target/test-resources/MTOM-fileCache-enabledRepository
    [mkdir] Created dir: /export/home/illsleyd/continuum/continuum-1.0.3/apps/continuum/working-directory/1/modules/integration/target/test-resources/MTOM-fileCache-enabledRepository/conf
    [copy] Copying 1 file to /export/home/illsleyd/continuum/continuum-1.0.3/apps/continuum/working-directory/1/modules/integration/target/test-resources/MTOM-fileCache-enabledRepository/conf
    [copy] Copying 1 file to /export/home/illsleyd/continuum/continuum-1.0.3/apps/continuum/working-directory/1/modules/integration/target/test-resources/MTOM-fileCache-enabledRepository/modules
    [mkdir] Created dir: /export/home/illsleyd/continuum/continuum-1.0.3/apps/continuum/working-directory/1/modules/integration/target/test-resources/SwA-enabledRepository
    [mkdir] Created dir: /export/home/illsleyd/continuum/continuum-1.0.3/apps/continuum/working-directory/1/modules/integration/target/test-resources/SwA-enabledRepository/conf
    [copy] Copying 1 file to /export/home/illsleyd/continuum/continuum-1.0.3/apps/continuum/working-directory/1/modules/integration/target/test-resources/SwA-enabledRepository/conf
    [copy] Copying 1 file to /export/home/illsleyd/continuum/continuum-1.0.3/apps/continuum/working-directory/1/modules/integration/target/test-resources/SwA-enabledRepository/modules
    [mkdir] Created dir: /export/home/illsleyd/continuum/continuum-1.0.3/apps/continuum/working-directory/1/modules/integration/target/test-resources/SwA-fileCache-enabledRepository
    [mkdir] Created dir: /export/home/illsleyd/continuum/continuum-1.0.3/apps/continuum/working-directory/1/modules/integration/target/test-resources/SwA-fileCache-enabledRepository/conf
    [copy] Copying 1 file to /export/home/illsleyd/continuum/continuum-1.0.3/apps/continuum/working-directory/1/modules/integration/target/test-resources/SwA-fileCache-enabledRepository/conf
    [copy] Copying 1 file to /export/home/illsleyd/continuum/continuum-1.0.3/apps/continuum/working-directory/1/modules/integration/target/test-resources/SwA-fileCache-enabledRepository/modules
    [mkdir] Created dir: /export/home/illsleyd/continuum/continuum-1.0.3/apps/continuum/working-directory/1/modules/integration/target/groovyRepo
    [mkdir] Created dir: /export/home/illsleyd/continuum/continuum-1.0.3/apps/continuum/working-directory/1/modules/integration/target/groovyRepo/conf
    [mkdir] Created dir: /export/home/illsleyd/continuum/continuum-1.0.3/apps/continuum/working-directory/1/modules/integration/target/groovyRepo/services
    [mkdir] Created dir: /export/home/illsleyd/continuum/continuum-1.0.3/apps/continuum/working-directory/1/modules/integration/target/groovyRepo/modules
    [copy] Copying 1 file to /export/home/illsleyd/continuum/continuum-1.0.3/apps/continuum/working-directory/1/modules/integration/target/groovyRepo/services
    [copy] Copying 1 file to /export/home/illsleyd/continuum/continuum-1.0.3/apps/continuum/working-directory/1/modules/integration/target/groovyRepo/modules
    [copy] Copying 1 file to /export/home/illsleyd/continuum/continuum-1.0.3/apps/continuum/working-directory/1/modules/integration/target/groovyRepo/conf
    [mkdir] Created dir: /export/home/illsleyd/continuum/continuum-1.0.3/apps/continuum/working-directory/1/modules/integration/target/test-resources/spring
    [copy] Copying 1 file to /export/home/illsleyd/continuum/continuum-1.0.3/apps/continuum/working-directory/1/modules/integration/target/test-classes/spring
    [mkdir] Created dir: /export/home/illsleyd/continuum/continuum-1.0.3/apps/continuum/working-directory/1/modules/integration/target/test-resources/deployment_repo
    [mkdir] Created dir: /export/home/illsleyd/continuum/continuum-1.0.3/apps/continuum/working-directory/1/modules/integration/target/test-resources/deployment_repo/conf
    [mkdir] Created dir: /export/home/illsleyd/continuum/continuum-1.0.3/apps/continuum/working-directory/1/modules/integration/target/test-resources/deployment_repo/services
    [mkdir] Created dir: /export/home/illsleyd/continuum/continuum-1.0.3/apps/continuum/working-directory/1/modules/integration/target/test-resources/deployment_repo/modules
    [copy] Copying 1 file to /export/home/illsleyd/continuum/continuum-1.0.3/apps/continuum/working-directory/1/modules/integration/target/test-resources/deployment_repo/conf
    [copy] Copying 1 file to /export/home/illsleyd/continuum/continuum-1.0.3/apps/continuum/working-directory/1/modules/integration/target/test-resources/deployment_repo/modules
    [mkdir] Created dir: /export/home/illsleyd/continuum/continuum-1.0.3/apps/continuum/working-directory/1/modules/integration/target/Repository
    [mkdir] Created dir: /export/home/illsleyd/continuum/continuum-1.0.3/apps/continuum/working-directory/1/modules/integration/target/Repository/conf
    [mkdir] Created dir: /export/home/illsleyd/continuum/continuum-1.0.3/apps/continuum/working-directory/1/modules/integration/target/Repository/services
    [mkdir] Created dir: /export/home/illsleyd/continuum/continuum-1.0.3/apps/continuum/working-directory/1/modules/integration/target/Repository/modules
    [copy] Copying 1 file to /export/home/illsleyd/continuum/continuum-1.0.3/apps/continuum/working-directory/1/modules/integration/target/Repository/modules
    [copy] Copying 1 file to /export/home/illsleyd/continuum/continuum-1.0.3/apps/continuum/working-directory/1/modules/integration/target/Repository/conf
    [mkdir] Created dir: /export/home/illsleyd/continuum/continuum-1.0.3/apps/continuum/working-directory/1/modules/integration/target/perf2/build/repo/conf
    [mkdir] Created dir: /export/home/illsleyd/continuum/continuum-1.0.3/apps/continuum/working-directory/1/modules/integration/target/perf/build/repo/conf
    [copy] Copying 1 file to /export/home/illsleyd/continuum/continuum-1.0.3/apps/continuum/working-directory/1/modules/integration/target/perf2/build/repo/conf
    [copy] Copying 1 file to /export/home/illsleyd/continuum/continuum-1.0.3/apps/continuum/working-directory/1/modules/integration/target/perf/build/repo/conf
    [mkdir] Created dir: /export/home/illsleyd/continuum/continuum-1.0.3/apps/continuum/working-directory/1/modules/integration/target/perf2/build/repo/modules
    [copy] Copying 1 file to /export/home/illsleyd/continuum/continuum-1.0.3/apps/continuum/working-directory/1/modules/integration/target/perf2/build/repo/modules
    [mkdir] Created dir: /export/home/illsleyd/continuum/continuum-1.0.3/apps/continuum/working-directory/1/modules/integration/target/perf/build/repo/modules
    [copy] Copying 1 file to /export/home/illsleyd/continuum/continuum-1.0.3/apps/continuum/working-directory/1/modules/integration/target/perf/build/repo/modules
    [echo] the files are up to date = ${jars.uptodate}
    [mkdir] Created dir: /export/home/illsleyd/continuum/continuum-1.0.3/apps/continuum/working-directory/1/modules/integration/test-resources/SOAP12Testing/SOAP12TestModuleB/build/classes
    [mkdir] Created dir: /export/home/illsleyd/continuum/continuum-1.0.3/apps/continuum/working-directory/1/modules/integration/test-resources/SOAP12Testing/SOAP12TestModuleB/build/lib
    [javac] Compiling 4 source files to /export/home/illsleyd/continuum/continuum-1.0.3/apps/continuum/working-directory/1/modules/integration/test-resources/SOAP12Testing/SOAP12TestModuleB/build/classes
    [javac] Note: /export/home/illsleyd/continuum/continuum-1.0.3/apps/continuum/working-directory/1/modules/integration/test-resources/SOAP12Testing/SOAP12TestModuleB/org/apache/axis2/soap12testing/handlers/SOAP12InFlowHandlerDefaultB.java uses or overrides a deprecated API.
    [javac] Note: Recompile with -Xlint:deprecation for details.
    [copy] Copying 1 file to /export/home/illsleyd/continuum/continuum-1.0.3/apps/continuum/working-directory/1/modules/integration/test-resources/SOAP12Testing/SOAP12TestModuleB/build/classes/META-INF
    [jar] Building jar: /export/home/illsleyd/continuum/continuum-1.0.3/apps/continuum/working-directory/1/modules/integration/target/Repository/modules/SOAP12TestModuleB.jar
    [delete] Deleting directory /export/home/illsleyd/continuum/continuum-1.0.3/apps/continuum/working-directory/1/modules/integration/test-resources/SOAP12Testing/SOAP12TestModuleB/build
    [echo] the files are up to date = ${jars.uptodate}
    [mkdir] Created dir: /export/home/illsleyd/continuum/continuum-1.0.3/apps/continuum/working-directory/1/modules/integration/test-resources/SOAP12Testing/SOAP12TestModuleC/build/classes
    [mkdir] Created dir: /export/home/illsleyd/continuum/continuum-1.0.3/apps/continuum/working-directory/1/modules/integration/test-resources/SOAP12Testing/SOAP12TestModuleC/build/lib
    [javac] Compiling 4 source files to /export/home/illsleyd/continuum/continuum-1.0.3/apps/continuum/working-directory/1/modules/integration/test-resources/SOAP12Testing/SOAP12TestModuleC/build/classes
    [javac] Note: /export/home/illsleyd/continuum/continuum-1.0.3/apps/continuum/working-directory/1/modules/integration/test-resources/SOAP12Testing/SOAP12TestModuleC/org/apache/axis2/soap12testing/handlers/SOAP12InFlowHandlerDefaultC.java uses or overrides a deprecated API.
    [javac] Note: Recompile with -Xlint:deprecation for details.
    [copy] Copying 1 file to /export/home/illsleyd/continuum/continuum-1.0.3/apps/continuum/working-directory/1/modules/integration/test-resources/SOAP12Testing/SOAP12TestModuleC/build/classes/META-INF
    [jar] Building jar: /export/home/illsleyd/continuum/continuum-1.0.3/apps/continuum/working-directory/1/modules/integration/target/Repository/modules/SOAP12TestModuleC.jar
    [delete] Deleting directory /export/home/illsleyd/continuum/continuum-1.0.3/apps/continuum/working-directory/1/modules/integration/test-resources/SOAP12Testing/SOAP12TestModuleC/build
    [echo] the files are up to date = ${jars.uptodate}
    [mkdir] Created dir: /export/home/illsleyd/continuum/continuum-1.0.3/apps/continuum/working-directory/1/modules/integration/test-resources/SOAP12Testing/SOAP12TestServiceB/build/classes
    [mkdir] Created dir: /export/home/illsleyd/continuum/continuum-1.0.3/apps/continuum/working-directory/1/modules/integration/test-resources/SOAP12Testing/SOAP12TestServiceB/build/lib
    [javac] Compiling 1 source file to /export/home/illsleyd/continuum/continuum-1.0.3/apps/continuum/working-directory/1/modules/integration/test-resources/SOAP12Testing/SOAP12TestServiceB/build/classes
    [copy] Copying 1 file to /export/home/illsleyd/continuum/continuum-1.0.3/apps/continuum/working-directory/1/modules/integration/test-resources/SOAP12Testing/SOAP12TestServiceB/build/classes/META-INF
    [jar] Building jar: /export/home/illsleyd/continuum/continuum-1.0.3/apps/continuum/working-directory/1/modules/integration/target/Repository/services/SOAP12TestServiceB.jar
    [delete] Deleting directory /export/home/illsleyd/continuum/continuum-1.0.3/apps/continuum/working-directory/1/modules/integration/test-resources/SOAP12Testing/SOAP12TestServiceB/build
    [echo] the files are up to date = ${jars.uptodate}
    [mkdir] Created dir: /export/home/illsleyd/continuum/continuum-1.0.3/apps/continuum/working-directory/1/modules/integration/test-resources/SOAP12Testing/SOAP12TestServiceC/build/classes
    [mkdir] Created dir: /export/home/illsleyd/continuum/continuum-1.0.3/apps/continuum/working-directory/1/modules/integration/test-resources/SOAP12Testing/SOAP12TestServiceC/build/lib
    [javac] Compiling 1 source file to /export/home/illsleyd/continuum/continuum-1.0.3/apps/continuum/working-directory/1/modules/integration/test-resources/SOAP12Testing/SOAP12TestServiceC/build/classes
    [copy] Copying 1 file to /export/home/illsleyd/continuum/continuum-1.0.3/apps/continuum/working-directory/1/modules/integration/test-resources/SOAP12Testing/SOAP12TestServiceC/build/classes/META-INF
    [jar] Building jar: /export/home/illsleyd/continuum/continuum-1.0.3/apps/continuum/working-directory/1/modules/integration/target/Repository/services/SOAP12TestServiceC.jar
    [delete] Deleting directory /export/home/illsleyd/continuum/continuum-1.0.3/apps/continuum/working-directory/1/modules/integration/test-resources/SOAP12Testing/SOAP12TestServiceC/build

    [junit] Running org.apache.axis2.addressing.AddressingServiceTest
    [junit] Tests run: 3, Failures: 0, Errors: 0, Time elapsed: 9.88 sec
    [junit] Running org.apache.axis2.addressing.MultiHopRedirectServiceTest
    [junit] Tests run: 1, Failures: 0, Errors: 0, Time elapsed: 10.07 sec
    [junit] Running org.apache.axis2.async.AsyncServiceTest
    [junit] Tests run: 1, Failures: 0, Errors: 0, Time elapsed: 16.831 sec
    [junit] Running org.apache.axis2.async.AsyncServiceWithTransportFailureTest
    [junit] Tests run: 1, Failures: 0, Errors: 0, Time elapsed: 5.279 sec
    [junit] Running org.apache.axis2.codegen.InvalidFaultWsdlTest
    [junit] Tests run: 1, Failures: 0, Errors: 0, Time elapsed: 4.19 sec
    [junit] Running org.apache.axis2.deployment.TargetResolverServiceTest
    [junit] Tests run: 1, Failures: 0, Errors: 0, Time elapsed: 11.105 sec
    [junit] Running org.apache.axis2.engine.CallUnregisteredServiceTest
    [junit] Tests run: 1, Failures: 0, Errors: 0, Time elapsed: 15.508 sec
    [junit] Running org.apache.axis2.engine.CharactersetEncodingTest
    [junit] Tests run: 11, Failures: 0, Errors: 0, Time elapsed: 7.772 sec
    [junit] Running org.apache.axis2.engine.CommonsHTTPEchoRawXMLTest
    [junit] Tests run: 2, Failures: 0, Errors: 0, Time elapsed: 7.582 sec
    [junit] Running org.apache.axis2.engine.EchoRawRuntimeProxyTest
    [junit] Tests run: 1, Failures: 0, Errors: 0, Time elapsed: 8.668 sec
    [junit] Running org.apache.axis2.engine.EchoRawXMLChunkedTest
    [junit] Tests run: 1, Failures: 0, Errors: 0, Time elapsed: 15.083 sec
    [junit] Running org.apache.axis2.engine.EchoRawXMLLoadTest
    [junit] Tests run: 1, Failures: 0, Errors: 0, Time elapsed: 10.055 sec
    [junit] Running org.apache.axis2.engine.EchoRawXMLMultipleASyncTest
    [junit] Tests run: 2, Failures: 0, Errors: 0, Time elapsed: 7.994 sec
    [junit] Running org.apache.axis2.engine.EchoRawXMLMultipleSyncTest
    [junit] Tests run: 2, Failures: 0, Errors: 0, Time elapsed: 5.566 sec
    [junit] Running org.apache.axis2.engine.EchoRawXMLOnTwoChannelsSyncTest
    [junit] Tests run: 2, Failures: 0, Errors: 0, Time elapsed: 7.203 sec
    [junit] Running org.apache.axis2.engine.EchoRawXMLOnTwoChannelsTest
    [junit] Tests run: 1, Failures: 0, Errors: 0, Time elapsed: 8.948 sec
    [junit] Running org.apache.axis2.engine.EchoRawXMLTest
    [junit] Tests run: 4, Failures: 0, Errors: 0, Time elapsed: 7.98 sec
    [junit] Running org.apache.axis2.engine.FaultHandlingTest
    [junit] Tests run: 4, Failures: 0, Errors: 0, Time elapsed: 7.359 sec
    [junit] Running org.apache.axis2.engine.HandlerExecutionTest
    [junit] Tests run: 9, Failures: 0, Errors: 0, Time elapsed: 4.863 sec
    [junit] Running org.apache.axis2.engine.HandlerFailureTest
    [junit] Tests run: 1, Failures: 0, Errors: 0, Time elapsed: 7.727 sec
    [junit] Running org.apache.axis2.engine.MessageContextInjectionTest
    [junit] Tests run: 1, Failures: 0, Errors: 0, Time elapsed: 2.378 sec
    [junit] Running org.apache.axis2.engine.MessageSaveAndRestoreTest
    [junit] Tests run: 1, Failures: 0, Errors: 0, Time elapsed: 14.02 sec
    [junit] Running org.apache.axis2.engine.MessageWithServerTest
    [junit] Tests run: 1, Failures: 0, Errors: 0, Time elapsed: 8.124 sec
    [junit] Running org.apache.axis2.engine.OneWayRawXMLTest
    [junit] Tests run: 1, Failures: 0, Errors: 0, Time elapsed: 9.241 sec
    [junit] Running org.apache.axis2.engine.PausingHandlerExecutionTest
    [junit] Tests run: 1, Failures: 0, Errors: 0, Time elapsed: 20.621 sec
    [junit] Running org.apache.axis2.engine.SOAPversionTest
    [junit] Tests run: 3, Failures: 0, Errors: 0, Time elapsed: 9.334 sec
    [junit] Running org.apache.axis2.engine.ServiceCreateTest
    [junit] Tests run: 1, Failures: 0, Errors: 0, Time elapsed: 8.606 sec
    [junit] Running org.apache.axis2.engine.ServiceDispatchingTest
    [junit] Tests run: 3, Failures: 0, Errors: 0, Time elapsed: 7.624 sec
    [junit] Running org.apache.axis2.engine.ServiceFaultTest
    [junit] Tests run: 2, Failures: 0, Errors: 0, Time elapsed: 8.703 sec
    [junit] Running org.apache.axis2.engine.ServiceGroupContextTest
    [junit] Tests run: 1, Failures: 0, Errors: 0, Time elapsed: 8.657 sec
    [junit] Running org.apache.axis2.engine.ThreadingTest
    [junit] Tests run: 1, Failures: 0, Errors: 0, Time elapsed: 7.12 sec
    [junit] Running org.apache.axis2.engine.UsingTransportTest
    [junit] Tests run: 2, Failures: 0, Errors: 0, Time elapsed: 7.1 sec
    [junit] Running org.apache.axis2.engine.WSDLClientTest
    [junit] Tests run: 1, Failures: 0, Errors: 0, Time elapsed: 7.988 sec
    [junit] Running org.apache.axis2.groovy.GroovyServiceTest
    [junit] Tests run: 2, Failures: 0, Errors: 0, Time elapsed: 7.212 sec
    [junit] Running org.apache.axis2.jms.JMSEchoRawXMLOneWayTest
    [junit] Tests run: 1, Failures: 0, Errors: 0, Time elapsed: 17.914 sec
    [junit] Running org.apache.axis2.jms.JMSEchoRawXMLTest
    [junit] Tests run: 4, Failures: 0, Errors: 0, Time elapsed: 29.445 sec
    [junit] Running org.apache.axis2.mtom.EchoRawMTOMCommonsChunkingTest
    [junit] Tests run: 1, Failures: 0, Errors: 0, Time elapsed: 8.203 sec
    [junit] Running org.apache.axis2.mtom.EchoRawMTOMFaultReportTest
    [junit] Tests run: 1, Failures: 0, Errors: 0, Time elapsed: 7.077 sec
    [junit] Running org.apache.axis2.mtom.EchoRawMTOMFileCacheLoadTest
    [junit] Tests run: 1, Failures: 0, Errors: 0, Time elapsed: 8.362 sec
    [junit] Running org.apache.axis2.mtom.EchoRawMTOMFileCacheTest
    [junit] Tests run: 3, Failures: 0, Errors: 0, Time elapsed: 17.02 sec
    [junit] Running org.apache.axis2.mtom.EchoRawMTOMLoadTest
    [junit] Tests run: 1, Failures: 0, Errors: 0, Time elapsed: 8.333 sec
    [junit] Running org.apache.axis2.mtom.EchoRawMTOMStreamingTest
    [junit] Tests run: 1, Failures: 0, Errors: 0, Time elapsed: 7.135 sec
    [junit] Running org.apache.axis2.mtom.EchoRawMTOMTest
    [junit] Tests run: 3, Failures: 0, Errors: 0, Time elapsed: 9.425 sec
    [junit] Running org.apache.axis2.mtom.EchoRawMTOMToBase64Test
    [junit] Tests run: 2, Failures: 0, Errors: 0, Time elapsed: 8.073 sec
    [junit] Running org.apache.axis2.mtom.MessageSaveAndRestoreWithMTOMTest
    [junit] Tests run: 1, Failures: 0, Errors: 0, Time elapsed: 8.595 sec
    [junit] Running org.apache.axis2.om.OMAttributeTest
    [junit] Tests run: 1, Failures: 0, Errors: 0, Time elapsed: 5.657 sec
    [junit] Running org.apache.axis2.processingModel.SoapProcessingModelTest
    [junit] Tests run: 1, Failures: 0, Errors: 0, Time elapsed: 6.996 sec
    [junit] Running org.apache.axis2.rpc.MultirefTest
    [junit] Tests run: 9, Failures: 0, Errors: 0, Time elapsed: 8.603 sec
    [junit] Running org.apache.axis2.rpc.RPCCallTest
    [junit] Tests run: 22, Failures: 0, Errors: 0, Time elapsed: 53.001 sec
    [junit] Running org.apache.axis2.spring.SpringServiceTest
    [junit] Tests run: 1, Failures: 0, Errors: 0, Time elapsed: 8.126 sec
    [junit] Running org.apache.axis2.swa.EchoRawSwAFileCacheTest
    [junit] Tests run: 1, Failures: 0, Errors: 0, Time elapsed: 12.739 sec
    [junit] Running org.apache.axis2.swa.EchoRawSwATest
    [junit] Tests run: 1, Failures: 0, Errors: 0, Time elapsed: 8.628 sec
    [junit] Running org.apache.axis2.tcp.TCPEchoRawXMLTest
    [junit] Tests run: 1, Failures: 0, Errors: 0, Time elapsed: 3.765 sec
    [junit] Running org.apache.axis2.tcp.TCPTwoChannelEchoRawXMLTest
    [junit] Tests run: 1, Failures: 0, Errors: 0, Time elapsed: 3.587 sec
    [junit] Running samples.wsdl.perf.PerfPortTypeTest
    [junit] Tests run: 1, Failures: 0, Errors: 0, Time elapsed: 12.487 sec

jar:jar:
    [jar] Building jar: /export/home/illsleyd/continuum/continuum-1.0.3/apps/continuum/working-directory/1/modules/integration/target/axis2-integration-SNAPSHOT.jar

jar:install:
    [echo] Installing...
Uploading to org.apache.axis2/jars/axis2-integration-SNAPSHOT.jar: 
.................... (830K)
Uploading to org.apache.axis2/poms/axis2-integration-SNAPSHOT.pom: 
.................... (20K)

+----------------------------------------
| Executing multiproject:install-callback Apache Axis 2.0 - JAXB-RI Data Binding
| Memory: 23M/44M
+----------------------------------------
DEPRECATED: the default goal should be specified in the <build> section of project.xml instead of maven.xml
DEPRECATED: the default goal should be specified in the <build> section of project.xml instead of maven.xml

build:end:

build:start:

multiproject:install-callback:
    [echo] Running jar:install for Apache Axis 2.0 - JAXB-RI Data Binding
java:prepare-filesystem:
    [mkdir] Created dir: /export/home/illsleyd/continuum/continuum-1.0.3/apps/continuum/working-directory/1/modules/jaxbri/target/classes
Running post goal: java:prepare-filesystem

java:compile:
    [echo] Compiling to /export/home/illsleyd/continuum/continuum-1.0.3/apps/continuum/working-directory/1/modules/jaxbri/target/classes
    [javac] Compiling 1 source file to /export/home/illsleyd/continuum/continuum-1.0.3/apps/continuum/working-directory/1/modules/jaxbri/target/classes

java:jar-resources:
Copying 1 file to /export/home/illsleyd/continuum/continuum-1.0.3/apps/continuum/working-directory/1/modules/jaxbri/target/classes

test:test:
    [echo] No tests to run.

jar:jar:
    [jar] Building jar: /export/home/illsleyd/continuum/continuum-1.0.3/apps/continuum/working-directory/1/modules/jaxbri/target/axis2-jaxbri-SNAPSHOT.jar

jar:install:
    [echo] Installing...
Uploading to org.apache.axis2/jars/axis2-jaxbri-SNAPSHOT.jar: 
.................... (5K)
Uploading to org.apache.axis2/poms/axis2-jaxbri-SNAPSHOT.pom: 
.................... (14K)

+----------------------------------------
| Executing multiproject:install-callback Apache Axis 2.0 - SAAJ API
| Memory: 19M/46M
+----------------------------------------
DEPRECATED: the default goal should be specified in the <build> section of project.xml instead of maven.xml

build:end:

build:start:

multiproject:install-callback:
    [echo] Running jar:install for Apache Axis 2.0 - SAAJ API
java:prepare-filesystem:
    [mkdir] Created dir: /export/home/illsleyd/continuum/continuum-1.0.3/apps/continuum/working-directory/1/modules/saaj-api/target/classes
Running post goal: java:prepare-filesystem

java:compile:
    [echo] Compiling to /export/home/illsleyd/continuum/continuum-1.0.3/apps/continuum/working-directory/1/modules/saaj-api/target/classes
    [javac] Compiling 29 source files to /export/home/illsleyd/continuum/continuum-1.0.3/apps/continuum/working-directory/1/modules/saaj-api/target/classes

java:jar-resources:

test:test:
    [echo] No tests to run.

jar:jar:
    [jar] Building jar: /export/home/illsleyd/continuum/continuum-1.0.3/apps/continuum/working-directory/1/modules/saaj-api/target/axis2-saaj-api-SNAPSHOT.jar

jar:install:
    [echo] Installing...
Uploading to org.apache.axis2/jars/axis2-saaj-api-SNAPSHOT.jar: 
.................... (24K)
Uploading to org.apache.axis2/poms/axis2-saaj-api-SNAPSHOT.pom: 
.................... (12K)

+----------------------------------------
| Executing multiproject:install-callback Apache Axis 2.0 - JAXWS API
| Memory: 16M/48M
+----------------------------------------
DEPRECATED: the default goal should be specified in the <build> section of project.xml instead of maven.xml

build:end:

Trying to get missing/snapshot dependencies required by Apache Axis 2.0 - JAXWS API:
Attempting to download axis2-saaj-api-SNAPSHOT.jar.
Skipping download as local copy is up to date!
build:start:

multiproject:install-callback:
    [echo] Running jar:install for Apache Axis 2.0 - JAXWS API
java:prepare-filesystem:
    [mkdir] Created dir: /export/home/illsleyd/continuum/continuum-1.0.3/apps/continuum/working-directory/1/modules/jaxws-api/target/classes
Running post goal: java:prepare-filesystem

java:compile:
    [echo] Compiling to /export/home/illsleyd/continuum/continuum-1.0.3/apps/continuum/working-directory/1/modules/jaxws-api/target/classes
    [javac] Compiling 49 source files to /export/home/illsleyd/continuum/continuum-1.0.3/apps/continuum/working-directory/1/modules/jaxws-api/target/classes
    [javac] Note: /export/home/illsleyd/continuum/continuum-1.0.3/apps/continuum/working-directory/1/modules/jaxws-api/src/javax/xml/ws/spi/FactoryFinder.java uses unchecked or unsafe operations.
    [javac] Note: Recompile with -Xlint:unchecked for details.

java:jar-resources:

test:test:
    [echo] No tests to run.

jar:jar:
    [jar] Building jar: /export/home/illsleyd/continuum/continuum-1.0.3/apps/continuum/working-directory/1/modules/jaxws-api/target/axis2-jaxws-api-SNAPSHOT.jar

jar:install:
    [echo] Installing...
Uploading to org.apache.axis2/jars/axis2-jaxws-api-SNAPSHOT.jar: 
.................... (34K)
Uploading to org.apache.axis2/poms/axis2-jaxws-api-SNAPSHOT.pom: 
.................... (12K)

+----------------------------------------
| Executing multiproject:install-callback Apache Axis 2.0 - SAAJ
| Memory: 38M/48M
+----------------------------------------
DEPRECATED: the default goal should be specified in the <build> section of project.xml instead of maven.xml
DEPRECATED: the default goal should be specified in the <build> section of project.xml instead of maven.xml

build:end:

build:start:

multiproject:install-callback:
    [echo] Running jar:install for Apache Axis 2.0 - SAAJ
java:prepare-filesystem:
    [mkdir] Created dir: /export/home/illsleyd/continuum/continuum-1.0.3/apps/continuum/working-directory/1/modules/saaj/target/classes
Running post goal: java:prepare-filesystem

java:compile:
    [echo] Compiling to /export/home/illsleyd/continuum/continuum-1.0.3/apps/continuum/working-directory/1/modules/saaj/target/classes
    [javac] Compiling 26 source files to /export/home/illsleyd/continuum/continuum-1.0.3/apps/continuum/working-directory/1/modules/saaj/target/classes

java:jar-resources:

test:test:
java:prepare-filesystem:
Running post goal: java:prepare-filesystem

java:compile:
    [echo] Compiling to /export/home/illsleyd/continuum/continuum-1.0.3/apps/continuum/working-directory/1/modules/saaj/target/classes

java:jar-resources:

test:prepare-filesystem:
    [mkdir] Created dir: /export/home/illsleyd/continuum/continuum-1.0.3/apps/continuum/working-directory/1/modules/saaj/target/test-classes
    [mkdir] Created dir: /export/home/illsleyd/continuum/continuum-1.0.3/apps/continuum/working-directory/1/modules/saaj/target/test-reports

test:test-resources:
Copying 9 files to /export/home/illsleyd/continuum/continuum-1.0.3/apps/continuum/working-directory/1/modules/saaj/target/test-classes

test:compile:
    [copy] Copying 1 file to /export/home/illsleyd/continuum/continuum-1.0.3/apps/continuum/working-directory/1/modules/saaj/target/test-classes/modules
    [javac] Compiling 22 source files to /export/home/illsleyd/continuum/continuum-1.0.3/apps/continuum/working-directory/1/modules/saaj/target/test-classes
Running post goal: test:compile
    [mkdir] Created dir: /export/home/illsleyd/continuum/continuum-1.0.3/apps/continuum/working-directory/1/modules/saaj/target/test-resources/saaj-repo
    [copy] Copying 1 file to /export/home/illsleyd/continuum/continuum-1.0.3/apps/continuum/working-directory/1/modules/saaj/target/test-resources/saaj-repo
    [copy] Copying 125 files to /export/home/illsleyd/continuum/continuum-1.0.3/apps/continuum/working-directory/1/modules/saaj/target

    [junit] Running org.apache.axis2.saaj.AttachmentSerializationTest
    [junit] Tests run: 1, Failures: 0, Errors: 0, Time elapsed: 1.293 sec
    [junit] Running org.apache.axis2.saaj.AttachmentTest
    [junit] Tests run: 8, Failures: 0, Errors: 0, Time elapsed: 2.546 sec
    [junit] Running org.apache.axis2.saaj.MessageFactoryTest
    [junit] Tests run: 3, Failures: 0, Errors: 0, Time elapsed: 1.074 sec
    [junit] Running org.apache.axis2.saaj.NodeTest
    [junit] Tests run: 5, Failures: 0, Errors: 0, Time elapsed: 0.818 sec
    [junit] Running org.apache.axis2.saaj.PrefixesTest
    [junit] Tests run: 3, Failures: 0, Errors: 0, Time elapsed: 1.181 sec
    [junit] Running org.apache.axis2.saaj.SAAJDetailTest
    [junit] Tests run: 2, Failures: 0, Errors: 0, Time elapsed: 1.249 sec
    [junit] Running org.apache.axis2.saaj.SAAJResultTest
    [junit] Tests run: 1, Failures: 0, Errors: 0, Time elapsed: 0.807 sec
    [junit] Running org.apache.axis2.saaj.SOAPBodyTest
    [junit] Tests run: 5, Failures: 0, Errors: 0, Time elapsed: 1.222 sec
    [junit] Running org.apache.axis2.saaj.SOAPConnectionTest
    [junit] Tests run: 4, Failures: 0, Errors: 0, Time elapsed: 1.126 sec
    [junit] Running org.apache.axis2.saaj.SOAPElementTest
    [junit] Tests run: 18, Failures: 0, Errors: 0, Time elapsed: 0.842 sec
    [junit] Running org.apache.axis2.saaj.SOAPEnvelopeTest
    [junit] Tests run: 16, Failures: 0, Errors: 0, Time elapsed: 1.065 sec
    [junit] Running org.apache.axis2.saaj.SOAPFactoryTest
    [junit] Tests run: 9, Failures: 0, Errors: 0, Time elapsed: 0.549 sec
    [junit] Running org.apache.axis2.saaj.SOAPFaultDetailTest
    [junit] Tests run: 1, Failures: 0, Errors: 0, Time elapsed: 1.238 sec
    [junit] Running org.apache.axis2.saaj.SOAPFaultTest
    [junit] Tests run: 16, Failures: 0, Errors: 0, Time elapsed: 0.909 sec
    [junit] Running org.apache.axis2.saaj.SOAPHeaderTest
    [junit] Tests run: 8, Failures: 0, Errors: 0, Time elapsed: 0.832 sec
    [junit] Running org.apache.axis2.saaj.SOAPMessageTest
    [junit] Tests run: 5, Failures: 0, Errors: 0, Time elapsed: 1.021 sec
    [junit] Running org.apache.axis2.saaj.SOAPNamespaceTest
    [junit] Tests run: 1, Failures: 0, Errors: 0, Time elapsed: 1.089 sec
    [junit] Running org.apache.axis2.saaj.SOAPPartTest
    [junit] Tests run: 3, Failures: 0, Errors: 0, Time elapsed: 1.355 sec
    [junit] Running org.apache.axis2.saaj.TextTest
    [junit] Tests run: 2, Failures: 0, Errors: 0, Time elapsed: 1.266 sec
    [junit] Running org.apache.axis2.saaj.integration.IntegrationTest
    [junit] Tests run: 3, Failures: 0, Errors: 0, Time elapsed: 7.284 sec

jar:jar:
    [jar] Building jar: /export/home/illsleyd/continuum/continuum-1.0.3/apps/continuum/working-directory/1/modules/saaj/target/axis2-saaj-SNAPSHOT.jar

jar:install:
    [echo] Installing...
Uploading to org.apache.axis2/jars/axis2-saaj-SNAPSHOT.jar: 
.................... (71K)
Uploading to org.apache.axis2/poms/axis2-saaj-SNAPSHOT.pom: 
.................... (16K)

+----------------------------------------
| Executing multiproject:install-callback Apache Axis 2.0 - Metadata
| Memory: 21M/47M
+----------------------------------------
DEPRECATED: the default goal should be specified in the <build> section of project.xml instead of maven.xml
DEPRECATED: the default goal should be specified in the <build> section of project.xml instead of maven.xml

build:end:

Trying to get missing/snapshot dependencies required by Apache Axis 2.0 - Metadata:
Attempting to download axis2-saaj-SNAPSHOT.jar.
Skipping download as local copy is up to date!
Attempting to download axis2-jaxws-api-SNAPSHOT.jar.
Skipping download as local copy is up to date!
build:start:

multiproject:install-callback:
    [echo] Running jar:install for Apache Axis 2.0 - Metadata
java:prepare-filesystem:
    [mkdir] Created dir: /export/home/illsleyd/continuum/continuum-1.0.3/apps/continuum/working-directory/1/modules/metadata/target/classes
Running post goal: java:prepare-filesystem

java:compile:
    [echo] Compiling to /export/home/illsleyd/continuum/continuum-1.0.3/apps/continuum/working-directory/1/modules/metadata/target/classes
    [javac] Compiling 90 source files to /export/home/illsleyd/continuum/continuum-1.0.3/apps/continuum/working-directory/1/modules/metadata/target/classes
    [javac] /export/home/illsleyd/continuum/continuum-1.0.3/apps/continuum/working-directory/1/modules/metadata/src/org/apache/axis2/jaxws/description/impl/FaultDescriptionImpl.java:107: warning: non-varargs call of varargs method with inexact argument type for last parameter;
    [javac] cast to java.lang.Class for a varargs call
    [javac] cast to java.lang.Class[] for a non-varargs call and to suppress this warning
    [javac]                         Method method = exceptionClass.getMethod("getFaultInfo", null);
    [javac]                                                                                  ^
    [javac] Note: Some input files use unchecked or unsafe operations.
    [javac] Note: Recompile with -Xlint:unchecked for details.
    [javac] 1 warning

java:jar-resources:
Copying 1 file to /export/home/illsleyd/continuum/continuum-1.0.3/apps/continuum/working-directory/1/modules/metadata/target/classes
Running post goal: java:jar-resources

test:test:
java:prepare-filesystem:
Running post goal: java:prepare-filesystem

java:compile:
    [echo] Compiling to /export/home/illsleyd/continuum/continuum-1.0.3/apps/continuum/working-directory/1/modules/metadata/target/classes

java:jar-resources:
Running post goal: java:jar-resources

test:prepare-filesystem:
    [mkdir] Created dir: /export/home/illsleyd/continuum/continuum-1.0.3/apps/continuum/working-directory/1/modules/metadata/target/test-classes
    [mkdir] Created dir: /export/home/illsleyd/continuum/continuum-1.0.3/apps/continuum/working-directory/1/modules/metadata/target/test-reports

test:test-resources:
Copying 5 files to /export/home/illsleyd/continuum/continuum-1.0.3/apps/continuum/working-directory/1/modules/metadata/target/test-classes
Copying 1 file to /export/home/illsleyd/continuum/continuum-1.0.3/apps/continuum/working-directory/1/modules/metadata/target/test-classes

test:compile:
    [mkdir] Created dir: /export/home/illsleyd/continuum/continuum-1.0.3/apps/continuum/working-directory/1/modules/metadata/target/schema
    [mkdir] Created dir: /export/home/illsleyd/continuum/continuum-1.0.3/apps/continuum/working-directory/1/modules/metadata/target/schema/src
    [mkdir] Created dir: /export/home/illsleyd/continuum/continuum-1.0.3/apps/continuum/working-directory/1/modules/metadata/target/schema/classes
    [echo] Generating JAX-B classes from XSDs
    [echo] Generating java from ProxyDocLitWrapped.wsdl
    [echo] Compiling generated schema
    [javac] Compiling 14 source files to /export/home/illsleyd/continuum/continuum-1.0.3/apps/continuum/working-directory/1/modules/metadata/target/schema/classes
    [javac] Compiling 27 source files to /export/home/illsleyd/continuum/continuum-1.0.3/apps/continuum/working-directory/1/modules/metadata/target/test-classes

    [junit] Running org.apache.axis2.jaxws.description.AnnotationProviderImplDescriptionTests
    [junit] Tests run: 7, Failures: 0, Errors: 0, Time elapsed: 3.811 sec
    [junit] Running org.apache.axis2.jaxws.description.AnnotationServiceImplDescriptionTests
    [junit] Tests run: 12, Failures: 0, Errors: 0, Time elapsed: 4.929 sec
    [junit] Running org.apache.axis2.jaxws.description.AnnotationServiceImplWithDBCTests
    [junit] Tests run: 1, Failures: 0, Errors: 0, Time elapsed: 1.49 sec
    [junit] Running org.apache.axis2.jaxws.description.PartialWSDLTests
    [junit] Tests run: 2, Failures: 0, Errors: 0, Time elapsed: 1.906 sec
    [junit] Running org.apache.axis2.jaxws.description.ServiceAnnotationTests
    [junit] Tests run: 6, Failures: 0, Errors: 0, Time elapsed: 2.072 sec
    [junit] Running org.apache.axis2.jaxws.description.ValidateWSDLTests
    [junit] Tests run: 2, Failures: 0, Errors: 0, Time elapsed: 2.394 sec
    [junit] Running org.apache.axis2.jaxws.description.WrapperPackageTests
    [junit] Tests run: 2, Failures: 0, Errors: 0, Time elapsed: 3.125 sec
    [junit] Running org.apache.axis2.jaxws.description.builder.DescriptionBuilderTests
    [junit] Tests run: 4, Failures: 0, Errors: 0, Time elapsed: 0.639 sec
    [junit] Running org.apache.axis2.jaxws.description.builder.ParameterParsingTests
    [junit] Tests run: 21, Failures: 0, Errors: 0, Time elapsed: 3.246 sec
    [junit] Running org.apache.axis2.jaxws.description.builder.ReturnTypeParsingTests
    [junit] Tests run: 12, Failures: 0, Errors: 0, Time elapsed: 1.718 sec
    [junit] Running org.apache.axis2.jaxws.description.builder.converter.ReflectiveConverterTests
    [junit] Tests run: 7, Failures: 0, Errors: 0, Time elapsed: 1.076 sec
    [junit] Running org.apache.axis2.jaxws.description.impl.ParameterDescriptionImplTests
    [junit] Tests run: 5, Failures: 0, Errors: 0, Time elapsed: 0.381 sec
    [junit] Running org.apache.axis2.jaxws.description.impl.ServiceDescriptionImplTests
    [junit] Tests run: 5, Failures: 0, Errors: 0, Time elapsed: 0.662 sec
    [junit] Running org.apache.axis2.jaxws.description.impl.ServiceDescriptionImplValidationTests
    [junit] Tests run: 3, Failures: 0, Errors: 0, Time elapsed: 1.291 sec

jar:jar:
    [jar] Building jar: /export/home/illsleyd/continuum/continuum-1.0.3/apps/continuum/working-directory/1/modules/metadata/target/axis2-metadata-SNAPSHOT.jar

jar:install:
    [echo] Installing...
Uploading to org.apache.axis2/jars/axis2-metadata-SNAPSHOT.jar: 
.................... (191K)
Uploading to org.apache.axis2/poms/axis2-metadata-SNAPSHOT.pom: 
.................... (11K)

+----------------------------------------
| Executing multiproject:install-callback Apache Axis 2.0 - JAX-WS
| Memory: 40M/48M
+----------------------------------------
DEPRECATED: the default goal should be specified in the <build> section of project.xml instead of maven.xml
DEPRECATED: the default goal should be specified in the <build> section of project.xml instead of maven.xml

build:end:

Trying to get missing/snapshot dependencies required by Apache Axis 2.0 - JAX-WS:
Attempting to download axis2-metadata-SNAPSHOT.jar.
Skipping download as local copy is up to date!
build:start:

multiproject:install-callback:
    [echo] Running jar:install for Apache Axis 2.0 - JAX-WS
java:prepare-filesystem:
    [mkdir] Created dir: /export/home/illsleyd/continuum/continuum-1.0.3/apps/continuum/working-directory/1/modules/jaxws/target/classes
Running post goal: java:prepare-filesystem

java:compile:
    [echo] Compiling to /export/home/illsleyd/continuum/continuum-1.0.3/apps/continuum/working-directory/1/modules/jaxws/target/classes
    [javac] Compiling 144 source files to /export/home/illsleyd/continuum/continuum-1.0.3/apps/continuum/working-directory/1/modules/jaxws/target/classes
    [javac] /export/home/illsleyd/continuum/continuum-1.0.3/apps/continuum/working-directory/1/modules/jaxws/src/org/apache/axis2/jaxws/marshaller/impl/alt/LegacyExceptionUtil.java:98: warning: non-varargs call of varargs method with inexact argument type for last parameter;
    [javac] cast to java.lang.Class for a varargs call
    [javac] cast to java.lang.Class[] for a non-varargs call and to suppress this warning
    [javac]             Method getFaultInfo = cls.getMethod("getFaultInfo", null);
    [javac]                                                                 ^
    [javac] /export/home/illsleyd/continuum/continuum-1.0.3/apps/continuum/working-directory/1/modules/jaxws/src/org/apache/axis2/jaxws/wrapper/PropertyInfo.java:83: warning: non-varargs call of varargs method with inexact argument type for last parameter;
    [javac] cast to java.lang.Object for a varargs call
    [javac] cast to java.lang.Object[] for a non-varargs call and to suppress this warning
    [javac] 		return method.invoke(targetBean, null);
    [javac]                                                  ^
    [javac] /export/home/illsleyd/continuum/continuum-1.0.3/apps/continuum/working-directory/1/modules/jaxws/src/org/apache/axis2/jaxws/marshaller/impl/alt/MethodMarshallerUtils.java:550: warning: non-varargs call of varargs method with inexact argument type for last parameter;
    [javac] cast to java.lang.Class for a varargs call
    [javac] cast to java.lang.Class[] for a non-varargs call and to suppress this warning
    [javac]                     Method getFaultInfo = t.getClass().getMethod("getFaultInfo", null);
    [javac]                                                                                  ^
    [javac] /export/home/illsleyd/continuum/continuum-1.0.3/apps/continuum/working-directory/1/modules/jaxws/src/org/apache/axis2/jaxws/marshaller/impl/alt/MethodMarshallerUtils.java:551: warning: non-varargs call of varargs method with inexact argument type for last parameter;
    [javac] cast to java.lang.Object for a varargs call
    [javac] cast to java.lang.Object[] for a non-varargs call and to suppress this warning
    [javac]                     faultBeanObject = getFaultInfo.invoke(t, null);
    [javac]                                                              ^
    [javac] Note: Some input files use or override a deprecated API.
    [javac] Note: Recompile with -Xlint:deprecation for details.
    [javac] Note: Some input files use unchecked or unsafe operations.
    [javac] Note: Recompile with -Xlint:unchecked for details.
    [javac] 4 warnings

java:jar-resources:

test:test:
java:prepare-filesystem:
Running post goal: java:prepare-filesystem

java:compile:
    [echo] Compiling to /export/home/illsleyd/continuum/continuum-1.0.3/apps/continuum/working-directory/1/modules/jaxws/target/classes

java:jar-resources:

test:prepare-filesystem:
    [mkdir] Created dir: /export/home/illsleyd/continuum/continuum-1.0.3/apps/continuum/working-directory/1/modules/jaxws/target/test-classes
    [mkdir] Created dir: /export/home/illsleyd/continuum/continuum-1.0.3/apps/continuum/working-directory/1/modules/jaxws/target/test-reports

test:test-resources:
Copying 43 files to /export/home/illsleyd/continuum/continuum-1.0.3/apps/continuum/working-directory/1/modules/jaxws/target/test-classes

test:compile:
    [mkdir] Created dir: /export/home/illsleyd/continuum/continuum-1.0.3/apps/continuum/working-directory/1/modules/jaxws/target/schema
    [mkdir] Created dir: /export/home/illsleyd/continuum/continuum-1.0.3/apps/continuum/working-directory/1/modules/jaxws/target/schema/src
    [mkdir] Created dir: /export/home/illsleyd/continuum/continuum-1.0.3/apps/continuum/working-directory/1/modules/jaxws/target/schema/classes
    [echo] Generating JAX-B classes from XSDs
    [echo] Generating java from soap 11
    [echo] Generating java from echo.xsd
    [echo] Generating java from stock1.xsd
    [echo] Generating java from stock2.xsd
    [echo] Generating java from samplemtom.xsd
    [echo] Generating java from ProxyDocLitWrapped.wsdl
    [echo] Generating java from ProxyDocLitnonWrapped.wsdl
    [echo] Generating java from samplemtomjpeg.wsdl
    [echo] Generating java from RPCLit.wsdl
    [echo] Generating java from gorilla_dlw.wsdl
    [echo] Generating java from SOAP12Echo.wsdl
    [echo] Generating java from AddNumbers.wsdl
    [echo] Generating java from async_doclitwr.wsdl
    [echo] Generating java from FaultyWebService.wsdl
    [echo] Generating java from FaultsService.wsdl
    [echo] Generating java from jaxbsource
    [echo] Generating java from doclit_nonwrap.wsdl for javabean endpoint support
    [echo] Generating java from doclitwrap.wsdl for javabean endpoint support
    [echo] Generating java from doclitbare.wsdl for javabean endpoint support
    [echo] Generating java from EchoMessage.wsdl for javabean endpoint support
    [echo] Generating java from resourceinjection.wsdl for javabean endpoint Resource Injection support
    [echo] Generating java from AnyType.wsdl for javabean endpoint AnyType support
    [echo] Generating java from WSDLMultiTests.wsdl
    [echo] Generating java from Polymorphic shapes.wsdl for javabean endpoint support
    [echo] Generating java from SOAPActionTest.wsdl
    [echo] Compiling generated schema
    [javac] Compiling 218 source files to /export/home/illsleyd/continuum/continuum-1.0.3/apps/continuum/working-directory/1/modules/jaxws/target/schema/classes
    [javac] Note: Some input files use unchecked or unsafe operations.
    [javac] Note: Recompile with -Xlint:unchecked for details.
    [javac] Compiling 192 source files to /export/home/illsleyd/continuum/continuum-1.0.3/apps/continuum/working-directory/1/modules/jaxws/target/test-classes
    [javac] Note: Some input files use or override a deprecated API.
    [javac] Note: Recompile with -Xlint:deprecation for details.
    [javac] Note: Some input files use unchecked or unsafe operations.
    [javac] Note: Recompile with -Xlint:unchecked for details.
Running post goal: test:compile
    [copy] Copying 7 files to /export/home/illsleyd/continuum/continuum-1.0.3/apps/continuum/working-directory/1/modules/jaxws/target/test-classes/services/EchoService
    [copy] Copying 24 files to /export/home/illsleyd/continuum/continuum-1.0.3/apps/continuum/working-directory/1/modules/jaxws/target/test-classes/services/BasicAuthSecurityService
    [copy] Copying 25 files to /export/home/illsleyd/continuum/continuum-1.0.3/apps/continuum/working-directory/1/modules/jaxws/target/test-classes/services/StringProviderService
    [copy] Copying 24 files to /export/home/illsleyd/continuum/continuum-1.0.3/apps/continuum/working-directory/1/modules/jaxws/target/test-classes/services/StringMessageProviderService
    [copy] Copying 24 files to /export/home/illsleyd/continuum/continuum-1.0.3/apps/continuum/working-directory/1/modules/jaxws/target/test-classes/services/SourceProviderService
    [copy] Copying 24 files to /export/home/illsleyd/continuum/continuum-1.0.3/apps/continuum/working-directory/1/modules/jaxws/target/test-classes/services/SourceMessageProviderService
    [copy] Copying 24 files to /export/home/illsleyd/continuum/continuum-1.0.3/apps/continuum/working-directory/1/modules/jaxws/target/test-classes/services/SoapMessageProviderService
    [copy] Copying 31 files to /export/home/illsleyd/continuum/continuum-1.0.3/apps/continuum/working-directory/1/modules/jaxws/target/test-classes/services/JAXBProviderService
    [copy] Copying 29 files to /export/home/illsleyd/continuum/continuum-1.0.3/apps/continuum/working-directory/1/modules/jaxws/target/test-classes/services/SendImageService
    [copy] Copying 3 files to /export/home/illsleyd/continuum/continuum-1.0.3/apps/continuum/working-directory/1/modules/jaxws/target/test-classes/services/SOAP12Service
    [copy] Copying 27 files to /export/home/illsleyd/continuum/continuum-1.0.3/apps/continuum/working-directory/1/modules/jaxws/target/test-classes/services/ProxyDocLitWrapped
    [copy] Copying 27 files to /export/home/illsleyd/continuum/continuum-1.0.3/apps/continuum/working-directory/1/modules/jaxws/target/test-classes/services/ProxyDocLitnonWrapped
    [copy] Copying 27 files to /export/home/illsleyd/continuum/continuum-1.0.3/apps/continuum/working-directory/1/modules/jaxws/target/test-classes/services/RPCLit
    [copy] Copying 5 files to /export/home/illsleyd/continuum/continuum-1.0.3/apps/continuum/working-directory/1/modules/jaxws/target/test-classes/services/SOAP12EchoService
    [copy] Copying 5 files to /export/home/illsleyd/continuum/continuum-1.0.3/apps/continuum/working-directory/1/modules/jaxws/target/test-classes/services/BookStoreService
    [copy] Copying 28 files to /export/home/illsleyd/continuum/continuum-1.0.3/apps/continuum/working-directory/1/modules/jaxws/target/test-classes/services/gorilla_dlw
    [copy] Copying 7 files to /export/home/illsleyd/continuum/continuum-1.0.3/apps/continuum/working-directory/1/modules/jaxws/target/test-classes/services/WSGenService
    [copy] Copying 11 files to /export/home/illsleyd/continuum/continuum-1.0.3/apps/continuum/working-directory/1/modules/jaxws/target/test-classes/services/AddressBookService
    [copy] Copying 4 files to /export/home/illsleyd/continuum/continuum-1.0.3/apps/continuum/working-directory/1/modules/jaxws/target/test-classes/services/MtomSampleService
    [copy] Copying 26 files to /export/home/illsleyd/continuum/continuum-1.0.3/apps/continuum/working-directory/1/modules/jaxws/target/test-classes/services/DocLitNonWrapService
    [copy] Copying 26 files to /export/home/illsleyd/continuum/continuum-1.0.3/apps/continuum/working-directory/1/modules/jaxws/target/test-classes/services/DocLitWrapService
    [copy] Copying 27 files to /export/home/illsleyd/continuum/continuum-1.0.3/apps/continuum/working-directory/1/modules/jaxws/target/test-classes/services/AddNumbersService
    [copy] Copying 31 files to /export/home/illsleyd/continuum/continuum-1.0.3/apps/continuum/working-directory/1/modules/jaxws/target/test-classes/services/AsyncService
    [copy] Copying 27 files to /export/home/illsleyd/continuum/continuum-1.0.3/apps/continuum/working-directory/1/modules/jaxws/target/test-classes/services/FaultyWebServiceService
    [copy] Copying 33 files to /export/home/illsleyd/continuum/continuum-1.0.3/apps/continuum/working-directory/1/modules/jaxws/target/test-classes/services/FaultsService
    [copy] Copying 28 files to /export/home/illsleyd/continuum/continuum-1.0.3/apps/continuum/working-directory/1/modules/jaxws/target/test-classes/services/BareDocLitService
    [copy] Copying 27 files to /export/home/illsleyd/continuum/continuum-1.0.3/apps/continuum/working-directory/1/modules/jaxws/target/test-classes/services/EchoMessageService
    [copy] Copying 26 files to /export/home/illsleyd/continuum/continuum-1.0.3/apps/continuum/working-directory/1/modules/jaxws/target/test-classes/services/ResourceInjectionService
    [copy] Copying 27 files to /export/home/illsleyd/continuum/continuum-1.0.3/apps/continuum/working-directory/1/modules/jaxws/target/test-classes/services/AnyTypeMessageService
    [copy] Copying 30 files to /export/home/illsleyd/continuum/continuum-1.0.3/apps/continuum/working-directory/1/modules/jaxws/target/test-classes/services/PolymorphicShapeService

    [junit] Running org.apache.axis2.jaxws.anytype.tests.AnyTypeTests
    [junit] Tests run: 1, Failures: 0, Errors: 0, Time elapsed: 16.439 sec
    [junit] Running org.apache.axis2.jaxws.attachments.MTOMSerializationTests
    [junit] Tests run: 3, Failures: 0, Errors: 0, Time elapsed: 10.748 sec
    [junit] Running org.apache.axis2.jaxws.client.ClientConfigTests
    [junit] Tests run: 1, Failures: 0, Errors: 0, Time elapsed: 7.665 sec
    [junit] Running org.apache.axis2.jaxws.client.DispatchSoapActionTests
    [junit] Tests run: 1, Failures: 0, Errors: 0, Time elapsed: 11.705 sec
    [junit] Running org.apache.axis2.jaxws.client.PropertyValueTests
    [junit] Tests run: 1, Failures: 0, Errors: 0, Time elapsed: 9.484 sec
    [junit] Running org.apache.axis2.jaxws.client.ProxySoapActionTests
    [junit] Tests run: 1, Failures: 0, Errors: 0, Time elapsed: 17.748 sec
    [junit] Running org.apache.axis2.jaxws.databinding.BindingToProtocolTests
    [junit] Tests run: 4, Failures: 0, Errors: 0, Time elapsed: 4.641 sec
    [junit] Running org.apache.axis2.jaxws.description.AnnotationDescriptionTests
    [junit] Tests run: 1, Failures: 0, Errors: 0, Time elapsed: 8.023 sec
    [junit] Running org.apache.axis2.jaxws.description.GetDescFromBindingProviderTests
    [junit] Tests run: 6, Failures: 0, Errors: 0, Time elapsed: 7.146 sec
    [junit] Running org.apache.axis2.jaxws.description.PortSelectionTests
    [junit] Tests run: 10, Failures: 0, Errors: 0, Time elapsed: 12.107 sec
    [junit] Running org.apache.axis2.jaxws.description.ServiceTests
    [junit] Tests run: 10, Failures: 0, Errors: 0, Time elapsed: 16.734 sec
    [junit] Running org.apache.axis2.jaxws.description.WSDLDescriptionTests
    [junit] Tests run: 4, Failures: 0, Errors: 0, Time elapsed: 8.427 sec
    [junit] Running org.apache.axis2.jaxws.description.WSDLTests
    [junit] Tests run: 4, Failures: 0, Errors: 0, Time elapsed: 8.805 sec
    [junit] Running org.apache.axis2.jaxws.dispatch.DOMSourceDispatchTest
    [junit] Tests run: 9, Failures: 0, Errors: 0, Time elapsed: 12.632 sec
    [junit] Running org.apache.axis2.jaxws.dispatch.JAXBDispatchTest
    [junit] Tests run: 6, Failures: 0, Errors: 0, Time elapsed: 11.374 sec
    [junit] Running org.apache.axis2.jaxws.dispatch.JAXBSourceDispatchTest
    [junit] Tests run: 1, Failures: 0, Errors: 0, Time elapsed: 10.234 sec
    [junit] Running org.apache.axis2.jaxws.dispatch.ParamTests
    [junit] Tests run: 3, Failures: 0, Errors: 0, Time elapsed: 3.305 sec
    [junit] Running org.apache.axis2.jaxws.dispatch.SAXSourceDispatchTest
    [junit] Tests run: 9, Failures: 0, Errors: 0, Time elapsed: 13.124 sec
    [junit] Running org.apache.axis2.jaxws.dispatch.SOAP12DispatchTests
    [junit] Tests run: 2, Failures: 0, Errors: 0, Time elapsed: 8.714 sec
    [junit] Running org.apache.axis2.jaxws.dispatch.SOAPMessageDispatchTest
    [junit] Tests run: 3, Failures: 0, Errors: 0, Time elapsed: 11.599 sec
    [junit] Running org.apache.axis2.jaxws.dispatch.StreamSourceDispatchTest
    [junit] Tests run: 7, Failures: 0, Errors: 0, Time elapsed: 12.077 sec
    [junit] Running org.apache.axis2.jaxws.dispatch.StringDispatchTest
    [junit] Tests run: 12, Failures: 0, Errors: 0, Time elapsed: 16.684 sec
    [junit] Running org.apache.axis2.jaxws.exception.ExceptionFactoryTests
    [junit] Tests run: 4, Failures: 0, Errors: 0, Time elapsed: 5.367 sec
    [junit] Running org.apache.axis2.jaxws.handler.HandlerChainProcessorTests
    [junit] Tests run: 24, Failures: 0, Errors: 0, Time elapsed: 6.812 sec
    [junit] Running org.apache.axis2.jaxws.i18n.JaxwsMessageBundleTests
    [junit] Tests run: 1, Failures: 0, Errors: 0, Time elapsed: 7.627 sec
    [junit] Running org.apache.axis2.jaxws.injection.ResourceInjectionTests
    [junit] Tests run: 6, Failures: 0, Errors: 0, Time elapsed: 9.576 sec
    [junit] Running org.apache.axis2.jaxws.jaxb.wrapper.WrapperToolTest
    [junit] Tests run: 4, Failures: 0, Errors: 0, Time elapsed: 0.786 sec
    [junit] Running org.apache.axis2.jaxws.lifecycle.EndpointLifecycleTests
    [junit] Tests run: 4, Failures: 0, Errors: 0, Time elapsed: 7.931 sec
    [junit] Running org.apache.axis2.jaxws.message.BlockTests
    [junit] Tests run: 24, Failures: 0, Errors: 0, Time elapsed: 8.228 sec
    [junit] Running org.apache.axis2.jaxws.message.FaultTests
    [junit] Tests run: 3, Failures: 0, Errors: 0, Time elapsed: 6.062 sec
    [junit] Running org.apache.axis2.jaxws.message.MessageRPCTests
    [junit] Tests run: 4, Failures: 0, Errors: 0, Time elapsed: 1.666 sec
    [junit] Running org.apache.axis2.jaxws.message.MessageTests
    [junit] Tests run: 14, Failures: 0, Errors: 0, Time elapsed: 9.973 sec
    [junit] Running org.apache.axis2.jaxws.message.SAAJConverterTests
    [junit] Tests run: 3, Failures: 0, Errors: 0, Time elapsed: 6.709 sec
    [junit] Running org.apache.axis2.jaxws.message.SOAP12Tests
    [junit] Tests run: 4, Failures: 0, Errors: 0, Time elapsed: 6.037 sec
    [junit] Running org.apache.axis2.jaxws.message.XMLStreamReaderSplitterTests
    [junit] Tests run: 1, Failures: 0, Errors: 0, Time elapsed: 7.063 sec
    [junit] Running org.apache.axis2.jaxws.misc.JAXBContextTest
    [junit] Tests run: 1, Failures: 0, Errors: 0, Time elapsed: 3.355 sec
    [junit] Running org.apache.axis2.jaxws.misc.NS2PkgTest
    [junit] Tests run: 1, Failures: 0, Errors: 0, Time elapsed: 0.468 sec
    [junit] Running org.apache.axis2.jaxws.nonanonymous.complextype.NonAnonymousComplexTypeTests
    [junit] Tests run: 1, Failures: 0, Errors: 0, Time elapsed: 11.17 sec
    [junit] Running org.apache.axis2.jaxws.polymorphic.shape.tests.PolymorphicTests
    [junit] Tests run: 3, Failures: 0, Errors: 0, Time elapsed: 12.182 sec
    [junit] Running org.apache.axis2.jaxws.provider.JAXBProviderTests
    [junit] Tests run: 2, Failures: 0, Errors: 0, Time elapsed: 11.846 sec
    [junit] Running org.apache.axis2.jaxws.provider.SoapMessageProviderTests
    [junit] Tests run: 7, Failures: 0, Errors: 0, Time elapsed: 11.122 sec
    [junit] Running org.apache.axis2.jaxws.provider.SourceMessageProviderTests
    [junit] Tests run: 1, Failures: 0, Errors: 0, Time elapsed: 7.65 sec
    [junit] Running org.apache.axis2.jaxws.provider.SourceProviderTests
    [junit] Tests run: 10, Failures: 0, Errors: 0, Time elapsed: 8.817 sec
    [junit] Running org.apache.axis2.jaxws.provider.StringMessageProviderTests
    [junit] Tests run: 1, Failures: 0, Errors: 0, Time elapsed: 8.076 sec
    [junit] Running org.apache.axis2.jaxws.provider.StringProviderTests
    [junit] Tests run: 8, Failures: 0, Errors: 0, Time elapsed: 9.554 sec
    [junit] Running org.apache.axis2.jaxws.proxy.GorillaDLWProxyTests
    [junit] Tests run: 7, Failures: 0, Errors: 0, Time elapsed: 13.954 sec
    [junit] Running org.apache.axis2.jaxws.proxy.ProxyNonWrappedTests
    [junit] Tests run: 3, Failures: 0, Errors: 0, Time elapsed: 11.382 sec
    [junit] Running org.apache.axis2.jaxws.proxy.ProxyTests
    [junit] Tests run: 11, Failures: 0, Errors: 0, Time elapsed: 10.143 sec
    [junit] Running org.apache.axis2.jaxws.proxy.RPCProxyTests
    [junit] Tests run: 13, Failures: 0, Errors: 0, Time elapsed: 13.233 sec
    [junit] Running org.apache.axis2.jaxws.proxy.SOAP12ProxyTests
    [junit] Tests run: 3, Failures: 0, Errors: 0, Time elapsed: 9.439 sec
    [junit] Running org.apache.axis2.jaxws.sample.AddNumbersTests
    [junit] Tests run: 2, Failures: 0, Errors: 0, Time elapsed: 8.867 sec
    [junit] Running org.apache.axis2.jaxws.sample.AddressBookTests
    [junit] Tests run: 3, Failures: 0, Errors: 0, Time elapsed: 9.262 sec
    [junit] Running org.apache.axis2.jaxws.sample.BareTests
    [junit] Tests run: 2, Failures: 0, Errors: 0, Time elapsed: 5.551 sec
    [junit] Running org.apache.axis2.jaxws.sample.FaultsServiceTests
    [junit] Tests run: 15, Failures: 0, Errors: 0, Time elapsed: 11.005 sec
    [junit] Running org.apache.axis2.jaxws.sample.FaultyWebServiceTests
    [junit] Tests run: 4, Failures: 0, Errors: 0, Time elapsed: 9.008 sec
    [junit] Running org.apache.axis2.jaxws.sample.MtomSampleByteArrayTests
    [junit] Tests run: 1, Failures: 0, Errors: 1, Time elapsed: 10.759 sec

BUILD FAILED
File...... file:/export/home/illsleyd/.maven/cache/maven-multiproject-plugin-1.5-SNAPSHOT/plugin.jelly
Element... maven:reactor
Line...... 227
Column.... 64
Unable to obtain goal [multiproject:install-callback] -- file:/export/home/illsleyd/.maven/cache/maven-test-plugin-1.8.1-SNAPSHOT/plugin.jelly:155:49: <junit> Test org.apache.axis2.jaxws.sample.MtomSampleByteArrayTests failed
Total time   : 66 minutes 58 seconds 
Finished at  : Wednesday, February 7, 2007 11:17:52 PM GMT+00:00


****************************************************************************



---------------------------------------------------------------------
To unsubscribe, e-mail: axis-dev-unsubscribe@ws.apache.org
For additional commands, e-mail: axis-dev-help@ws.apache.org


Mime
View raw message