axis-java-dev mailing list archives

Site index · List index
Message view « Date » · « Thread »
Top « Date » · « Thread »
From "davidillsley (Continuum)" <davidills...@apache.org>
Subject [continuum] BUILD FAILURE: Axis2
Date Sun, 25 Feb 2007 05:42:15 GMT
Online report : http://localhost:8080/continuum/servlet/continuum/target/ProjectBuild.vm/view/ProjectBuild/id/1/buildId/1124
Build statistics:
  State: Failed
  Previous State: Ok
  Started at: Sun, 25 Feb 2007 05:18:00 +0000
  Finished at: Sun, 25 Feb 2007 05:41:51 +0000
  Total time: 23m 50s
  Build Trigger: Schedule
  Exit code: 70
  Building machine hostname: ws.zones.apache.org
  Operating system : SunOS(unknown)
  Java version : 1.5.0_09(Sun Microsystems Inc.)

Changes
         dims          sync up with maven1 build
             /webservices/axis2/trunk/java/modules/jaxws/pom.xml
           dims          got tests to pass on my sun jdk1.5/winxp, let's see what happens on the zones box
             /webservices/axis2/trunk/java/modules/jaxws/pom.xml
        
****************************************************************************
Output:
****************************************************************************
 __  __
|  \/  |__ _Apache__ ___
| |\/| / _` \ V / -_) ' \  ~ intelligent projects ~
|_|  |_\__,_|\_/\___|_||_|  v. 1.1-beta-3

DEPRECATED: the default goal should be specified in the <build> section of project.xml instead of maven.xml
DEPRECATED: the default goal should be specified in the <build> section of project.xml instead of maven.xml
Trying to get missing/snapshot dependencies required by Apache Axis2:
Attempting to download maven-test-plugin-1.8.1-SNAPSHOT.jar.
Skipping download as local copy is up to date!
Attempting to download maven-multiproject-plugin-1.5-SNAPSHOT.jar.
Skipping download as local copy is up to date!
Attempting to download maven-jar-plugin-1.8-SNAPSHOT.jar.
Skipping download as local copy is up to date!
Attempting to download maven-plugin-plugin-1.8-SNAPSHOT.jar.
Skipping download as local copy is up to date!
    [echo] Current Java Version is: 1.5
    [echo] 
            JDK 1.5 detected, including the following modules:
            modules/metadata/project.xml,modules/saaj-api/project.xml,modules/saaj/project.xml,modules/jaxbri/project.xml,modules/jaxws/project.xml,modules/jaxws-api/project.xml,modules/json/project.xmlmodules/clustering/project.xml
        
build:start:

clean:
modules:clean:
modules:reactor:init:
plugin:download-artifact:

    [echo] Adding to modules.reactor.includes: modules/adb-codegen/project.xml
    [echo] Adding to modules.reactor.includes: modules/adb/project.xml
    [echo] Adding to modules.reactor.includes: modules/addressing/project.xml
    [echo] Adding to modules.reactor.includes: modules/clustering/project.xml
    [echo] Adding to modules.reactor.includes: modules/codegen/project.xml
    [echo] Adding to modules.reactor.includes: modules/integration/project.xml
    [echo] Adding to modules.reactor.includes: modules/java2wsdl/project.xml
    [echo] Adding to modules.reactor.includes: modules/jaxbri/project.xml
    [echo] Adding to modules.reactor.includes: modules/jaxws-api/project.xml
    [echo] Adding to modules.reactor.includes: modules/jaxws/project.xml
    [echo] Adding to modules.reactor.includes: modules/jibx/project.xml
    [echo] Adding to modules.reactor.includes: modules/json/project.xml
    [echo] Adding to modules.reactor.includes: modules/kernel/project.xml
    [echo] Adding to modules.reactor.includes: modules/metadata/project.xml
    [echo] Adding to modules.reactor.includes: modules/mex/project.xml
    [echo] Adding to modules.reactor.includes: modules/mtompolicy/project.xml
    [echo] Adding to modules.reactor.includes: modules/saaj-api/project.xml
    [echo] Adding to modules.reactor.includes: modules/saaj/project.xml
    [echo] Adding to modules.reactor.includes: modules/samples/project.xml
    [echo] Adding to modules.reactor.includes: modules/soapmonitor/project.xml
    [echo] Adding to modules.reactor.includes: modules/spring/project.xml
    [echo] Adding to modules.reactor.includes: modules/tool/project.xml
    [echo] Adding to modules.reactor.includes: modules/webapp/project.xml
    [echo] Adding to modules.reactor.includes: modules/xmlbeans/project.xml

    [echo] +----------------------------------------
    [echo] | Cleaning: modules/adb-codegen
    [echo] +----------------------------------------
    [delete] Deleting directory /export/home/illsleyd/continuum/continuum-1.0.3/apps/continuum/working-directory/1/modules/adb-codegen/target
    [echo] 
    [echo] +----------------------------------------
    [echo] | Cleaning: modules/adb
    [echo] +----------------------------------------
    [delete] Deleting directory /export/home/illsleyd/continuum/continuum-1.0.3/apps/continuum/working-directory/1/modules/adb/target
    [echo] 
    [echo] +----------------------------------------
    [echo] | Cleaning: modules/addressing
    [echo] +----------------------------------------
    [delete] Deleting directory /export/home/illsleyd/continuum/continuum-1.0.3/apps/continuum/working-directory/1/modules/addressing/target
    [echo] 
    [echo] +----------------------------------------
    [echo] | Cleaning: modules/clustering
    [echo] +----------------------------------------
    [echo] 
    [echo] +----------------------------------------
    [echo] | Cleaning: modules/codegen
    [echo] +----------------------------------------
    [delete] Deleting directory /export/home/illsleyd/continuum/continuum-1.0.3/apps/continuum/working-directory/1/modules/codegen/target
    [echo] 
    [echo] +----------------------------------------
    [echo] | Cleaning: modules/integration
    [echo] +----------------------------------------
    [delete] Deleting directory /export/home/illsleyd/continuum/continuum-1.0.3/apps/continuum/working-directory/1/modules/integration/target
    [echo] 
    [echo] +----------------------------------------
    [echo] | Cleaning: modules/java2wsdl
    [echo] +----------------------------------------
    [delete] Deleting directory /export/home/illsleyd/continuum/continuum-1.0.3/apps/continuum/working-directory/1/modules/java2wsdl/target
    [echo] 
    [echo] +----------------------------------------
    [echo] | Cleaning: modules/jaxbri
    [echo] +----------------------------------------
    [delete] Deleting directory /export/home/illsleyd/continuum/continuum-1.0.3/apps/continuum/working-directory/1/modules/jaxbri/target
    [echo] 
    [echo] +----------------------------------------
    [echo] | Cleaning: modules/jaxws-api
    [echo] +----------------------------------------
    [delete] Deleting directory /export/home/illsleyd/continuum/continuum-1.0.3/apps/continuum/working-directory/1/modules/jaxws-api/target
    [echo] 
    [echo] +----------------------------------------
    [echo] | Cleaning: modules/jaxws
    [echo] +----------------------------------------
    [delete] Deleting directory /export/home/illsleyd/continuum/continuum-1.0.3/apps/continuum/working-directory/1/modules/jaxws/target
    [echo] 
    [echo] +----------------------------------------
    [echo] | Cleaning: modules/jibx
    [echo] +----------------------------------------
    [delete] Deleting directory /export/home/illsleyd/continuum/continuum-1.0.3/apps/continuum/working-directory/1/modules/jibx/target
    [echo] 
    [echo] +----------------------------------------
    [echo] | Cleaning: modules/json
    [echo] +----------------------------------------
    [echo] 
    [echo] +----------------------------------------
    [echo] | Cleaning: modules/kernel
    [echo] +----------------------------------------
    [delete] Deleting directory /export/home/illsleyd/continuum/continuum-1.0.3/apps/continuum/working-directory/1/modules/kernel/target
    [echo] 
    [echo] +----------------------------------------
    [echo] | Cleaning: modules/metadata
    [echo] +----------------------------------------
    [delete] Deleting directory /export/home/illsleyd/continuum/continuum-1.0.3/apps/continuum/working-directory/1/modules/metadata/target
    [echo] 
    [echo] +----------------------------------------
    [echo] | Cleaning: modules/mex
    [echo] +----------------------------------------
    [delete] Deleting directory /export/home/illsleyd/continuum/continuum-1.0.3/apps/continuum/working-directory/1/modules/mex/target
    [echo] 
    [echo] +----------------------------------------
    [echo] | Cleaning: modules/mtompolicy
    [echo] +----------------------------------------
    [delete] Deleting directory /export/home/illsleyd/continuum/continuum-1.0.3/apps/continuum/working-directory/1/modules/mtompolicy/target
    [echo] 
    [echo] +----------------------------------------
    [echo] | Cleaning: modules/saaj-api
    [echo] +----------------------------------------
    [delete] Deleting directory /export/home/illsleyd/continuum/continuum-1.0.3/apps/continuum/working-directory/1/modules/saaj-api/target
    [echo] 
    [echo] +----------------------------------------
    [echo] | Cleaning: modules/saaj
    [echo] +----------------------------------------
    [delete] Deleting directory /export/home/illsleyd/continuum/continuum-1.0.3/apps/continuum/working-directory/1/modules/saaj/target
    [echo] 
    [echo] +----------------------------------------
    [echo] | Cleaning: modules/samples
    [echo] +----------------------------------------
    [delete] Deleting directory /export/home/illsleyd/continuum/continuum-1.0.3/apps/continuum/working-directory/1/modules/samples/target
    [echo] 
    [echo] +----------------------------------------
    [echo] | Cleaning: modules/soapmonitor
    [echo] +----------------------------------------
    [delete] Deleting directory /export/home/illsleyd/continuum/continuum-1.0.3/apps/continuum/working-directory/1/modules/soapmonitor/target
    [echo] 
    [echo] +----------------------------------------
    [echo] | Cleaning: modules/spring
    [echo] +----------------------------------------
    [delete] Deleting directory /export/home/illsleyd/continuum/continuum-1.0.3/apps/continuum/working-directory/1/modules/spring/target
    [echo] 
    [echo] +----------------------------------------
    [echo] | Cleaning: modules/tool
    [echo] +----------------------------------------
    [delete] Deleting directory /export/home/illsleyd/continuum/continuum-1.0.3/apps/continuum/working-directory/1/modules/tool/target
    [echo] 
    [echo] +----------------------------------------
    [echo] | Cleaning: modules/webapp
    [echo] +----------------------------------------
    [echo] 
    [echo] +----------------------------------------
    [echo] | Cleaning: modules/xmlbeans
    [echo] +----------------------------------------
    [delete] Deleting directory /export/home/illsleyd/continuum/continuum-1.0.3/apps/continuum/working-directory/1/modules/xmlbeans/target
    [echo] 
    [echo] +----------------------------------------
    [echo] | Cleaning: target and etc/target
    [echo] +----------------------------------------
    [delete] Deleting directory /export/home/illsleyd/continuum/continuum-1.0.3/apps/continuum/working-directory/1/target


jar:
multiproject:install:
multiproject:projects-init:
    [echo] Gathering project list
Starting the reactor...
Our processing order:
Apache Axis 2.0 - Java2WSDL
Apache Axis 2.0 - Kernel
Apache Axis 2.0 - Data Binding
Apache Axis 2.0 - Code Generation
Apache Axis 2.0 - ADB Codegen
Apache Axis 2.0 - Addressing
Apache Axis 2.0 - Samples
Apache Axis 2.0 - spring
Apache Axis 2.0 - XMLBeans Data Binding
Apache Axis 2.0 - Tools
Apache Axis 2.0 - Integration
Apache Axis 2.0 - JAXB-RI Data Binding
Apache Axis 2.0 - SAAJ API
Apache Axis 2.0 - JAXWS API
Apache Axis 2.0 - SAAJ
Apache Axis 2.0 - Metadata
Apache Axis 2.0 - JAX-WS
Apache Axis 2.0 - JiBX Data Binding
Apache Axis 2.0 - Metadata Exchange
Apache Axis 2.0 - MTOM Policy
Apache Axis 2.0 - soapmonitor
+----------------------------------------
| Gathering project list Apache Axis 2.0 - Java2WSDL
| Memory: 21M/29M
+----------------------------------------
+----------------------------------------
| Gathering project list Apache Axis 2.0 - Kernel
| Memory: 21M/29M
+----------------------------------------
+----------------------------------------
| Gathering project list Apache Axis 2.0 - Data Binding
| Memory: 21M/29M
+----------------------------------------
+----------------------------------------
| Gathering project list Apache Axis 2.0 - Code Generation
| Memory: 21M/29M
+----------------------------------------
+----------------------------------------
| Gathering project list Apache Axis 2.0 - ADB Codegen
| Memory: 21M/29M
+----------------------------------------
+----------------------------------------
| Gathering project list Apache Axis 2.0 - Addressing
| Memory: 21M/29M
+----------------------------------------
+----------------------------------------
| Gathering project list Apache Axis 2.0 - Samples
| Memory: 21M/29M
+----------------------------------------
+----------------------------------------
| Gathering project list Apache Axis 2.0 - spring
| Memory: 21M/29M
+----------------------------------------
+----------------------------------------
| Gathering project list Apache Axis 2.0 - XMLBeans Data Binding
| Memory: 21M/29M
+----------------------------------------
+----------------------------------------
| Gathering project list Apache Axis 2.0 - Tools
| Memory: 21M/29M
+----------------------------------------
+----------------------------------------
| Gathering project list Apache Axis 2.0 - Integration
| Memory: 21M/29M
+----------------------------------------
+----------------------------------------
| Gathering project list Apache Axis 2.0 - JAXB-RI Data Binding
| Memory: 21M/29M
+----------------------------------------
+----------------------------------------
| Gathering project list Apache Axis 2.0 - SAAJ API
| Memory: 21M/29M
+----------------------------------------
+----------------------------------------
| Gathering project list Apache Axis 2.0 - JAXWS API
| Memory: 21M/29M
+----------------------------------------
+----------------------------------------
| Gathering project list Apache Axis 2.0 - SAAJ
| Memory: 21M/29M
+----------------------------------------
+----------------------------------------
| Gathering project list Apache Axis 2.0 - Metadata
| Memory: 21M/29M
+----------------------------------------
+----------------------------------------
| Gathering project list Apache Axis 2.0 - JAX-WS
| Memory: 21M/29M
+----------------------------------------
+----------------------------------------
| Gathering project list Apache Axis 2.0 - JiBX Data Binding
| Memory: 21M/29M
+----------------------------------------
+----------------------------------------
| Gathering project list Apache Axis 2.0 - Metadata Exchange
| Memory: 21M/29M
+----------------------------------------
+----------------------------------------
| Gathering project list Apache Axis 2.0 - MTOM Policy
| Memory: 21M/29M
+----------------------------------------
+----------------------------------------
| Gathering project list Apache Axis 2.0 - soapmonitor
| Memory: 21M/29M
+----------------------------------------

multiproject:goal:
Starting the reactor...
Our processing order:
Apache Axis 2.0 - Java2WSDL
Apache Axis 2.0 - Kernel
Apache Axis 2.0 - Data Binding
Apache Axis 2.0 - Code Generation
Apache Axis 2.0 - ADB Codegen
Apache Axis 2.0 - Addressing
Apache Axis 2.0 - Samples
Apache Axis 2.0 - spring
Apache Axis 2.0 - XMLBeans Data Binding
Apache Axis 2.0 - Tools
Apache Axis 2.0 - Integration
Apache Axis 2.0 - JAXB-RI Data Binding
Apache Axis 2.0 - SAAJ API
Apache Axis 2.0 - JAXWS API
Apache Axis 2.0 - SAAJ
Apache Axis 2.0 - Metadata
Apache Axis 2.0 - JAX-WS
Apache Axis 2.0 - JiBX Data Binding
Apache Axis 2.0 - Metadata Exchange
Apache Axis 2.0 - MTOM Policy
Apache Axis 2.0 - soapmonitor
+----------------------------------------
| Executing multiproject:install-callback Apache Axis 2.0 - Java2WSDL
| Memory: 21M/29M
+----------------------------------------
DEPRECATED: the default goal should be specified in the <build> section of project.xml instead of maven.xml
DEPRECATED: the default goal should be specified in the <build> section of project.xml instead of maven.xml
Trying to get missing/snapshot dependencies required by Apache Axis 2.0 - Java2WSDL:
Attempting to download axiom-api-SNAPSHOT.jar.
4/125K
8/125K
12/125K
16/125K
20/125K
24/125K
28/125K
32/125K
36/125K
40/125K
44/125K
48/125K
52/125K
56/125K
60/125K
64/125K
68/125K
72/125K
76/125K
80/125K
84/125K
88/125K
92/125K
95/125K
99/125K
103/125K
107/125K
111/125K
115/125K
119/125K
123/125K
125/125K
125K downloaded
Error retrieving artifact from [http://people.apache.org/repo/m1-snapshot-repository/]: org.apache.maven.verifier.ChecksumVerificationException: Error retrieving checksum file for /org.apache.ws.commons.axiom/jars/axiom-api-SNAPSHOT.jar
Skipping download as local copy is up to date!
Attempting to download axiom-impl-SNAPSHOT.jar.
4/108K
8/108K
12/108K
16/108K
20/108K
24/108K
28/108K
32/108K
35/108K
39/108K
43/108K
46/108K
50/108K
53/108K
57/108K
61/108K
65/108K
68/108K
72/108K
75/108K
79/108K
82/108K
86/108K
90/108K
94/108K
98/108K
102/108K
106/108K
108/108K
108K downloaded
Error retrieving artifact from [http://people.apache.org/repo/m1-snapshot-repository/]: org.apache.maven.verifier.ChecksumVerificationException: Error retrieving checksum file for /org.apache.ws.commons.axiom/jars/axiom-impl-SNAPSHOT.jar
Skipping download as local copy is up to date!
build:start:

multiproject:install-callback:
    [echo] Running jar:install for Apache Axis 2.0 - Java2WSDL
java:prepare-filesystem:
    [mkdir] Created dir: /export/home/illsleyd/continuum/continuum-1.0.3/apps/continuum/working-directory/1/modules/java2wsdl/target/classes
Running post goal: java:prepare-filesystem

java:compile:
    [echo] Compiling to /export/home/illsleyd/continuum/continuum-1.0.3/apps/continuum/working-directory/1/modules/java2wsdl/target/classes
    [javac] Compiling 23 source files to /export/home/illsleyd/continuum/continuum-1.0.3/apps/continuum/working-directory/1/modules/java2wsdl/target/classes

java:jar-resources:
Copying 2 files to /export/home/illsleyd/continuum/continuum-1.0.3/apps/continuum/working-directory/1/modules/java2wsdl/target/classes/META-INF

test:test:
    [echo] No tests to run.

jar:jar:
    [jar] Building jar: /export/home/illsleyd/continuum/continuum-1.0.3/apps/continuum/working-directory/1/modules/java2wsdl/target/axis2-java2wsdl-SNAPSHOT.jar

jar:install:
    [echo] Installing...
Uploading to org.apache.axis2/jars/axis2-java2wsdl-SNAPSHOT.jar: 
.................... (56K)
Uploading to org.apache.axis2/poms/axis2-java2wsdl-SNAPSHOT.pom: 
.................... (14K)

+----------------------------------------
| Executing multiproject:install-callback Apache Axis 2.0 - Kernel
| Memory: 11M/28M
+----------------------------------------
DEPRECATED: the default goal should be specified in the <build> section of project.xml instead of maven.xml
DEPRECATED: the default goal should be specified in the <build> section of project.xml instead of maven.xml

build:end:

Trying to get missing/snapshot dependencies required by Apache Axis 2.0 - Kernel:
Attempting to download axis2-java2wsdl-SNAPSHOT.jar.
Skipping download as local copy is up to date!
Attempting to download neethi-SNAPSHOT.jar.
4/28K
8/28K
12/28K
16/28K
20/28K
24/28K
28/28K
28/28K
28K downloaded
*** CHECKSUM FAILED - Checksum failed on download: local = '26f3fd1c194537f55cacad20df5971a9'; remote = 'bcf57c4175a2a7d38ba4cc74fd6f1c79' - RETRYING
4/28K
8/28K
12/28K
15/28K
16/28K
20/28K
23/28K
27/28K
28/28K
28K downloaded
Error retrieving artifact from [http://people.apache.org/repo/m1-snapshot-repository/]: org.apache.maven.verifier.ChecksumVerificationException: Checksum failed on download: local = '26f3fd1c194537f55cacad20df5971a9'; remote = 'bcf57c4175a2a7d38ba4cc74fd6f1c79'
Attempting to download woden-1.0-incubating-SNAPSHOT.jar.
4/303K
8/303K
12/303K
16/303K
20/303K
24/303K
28/303K
32/303K
36/303K
40/303K
44/303K
48/303K
52/303K
56/303K
60/303K
64/303K
68/303K
72/303K
76/303K
80/303K
84/303K
88/303K
92/303K
95/303K
99/303K
102/303K
106/303K
109/303K
113/303K
116/303K
120/303K
123/303K
127/303K
130/303K
134/303K
138/303K
142/303K
145/303K
149/303K
152/303K
156/303K
159/303K
163/303K
166/303K
170/303K
173/303K
177/303K
180/303K
184/303K
187/303K
191/303K
195/303K
199/303K
202/303K
206/303K
209/303K
213/303K
216/303K
220/303K
223/303K
227/303K
230/303K
234/303K
237/303K
241/303K
244/303K
248/303K
252/303K
256/303K
259/303K
263/303K
266/303K
270/303K
273/303K
277/303K
280/303K
284/303K
287/303K
291/303K
294/303K
298/303K
302/303K
303/303K
303K downloaded
*** CHECKSUM FAILED - Checksum failed on download: local = '86a8ad2ea8e6b771762ba4b063ea6e9f'; remote = '2e8e82d339689520554360341f45746d' - RETRYING
4/303K
8/303K
12/303K
16/303K
20/303K
24/303K
28/303K
32/303K
36/303K
40/303K
44/303K
48/303K
52/303K
56/303K
60/303K
64/303K
68/303K
72/303K
76/303K
80/303K
84/303K
88/303K
92/303K
96/303K
100/303K
104/303K
108/303K
112/303K
116/303K
120/303K
124/303K
128/303K
132/303K
136/303K
140/303K
140/303K
144/303K
147/303K
151/303K
154/303K
158/303K
161/303K
165/303K
168/303K
172/303K
175/303K
179/303K
183/303K
187/303K
190/303K
194/303K
197/303K
201/303K
204/303K
208/303K
211/303K
215/303K
218/303K
222/303K
225/303K
229/303K
232/303K
236/303K
240/303K
244/303K
247/303K
251/303K
254/303K
258/303K
261/303K
265/303K
268/303K
272/303K
275/303K
279/303K
282/303K
286/303K
290/303K
294/303K
297/303K
301/303K
303/303K
303K downloaded
Error retrieving artifact from [http://people.apache.org/repo/m1-snapshot-repository/]: org.apache.maven.verifier.ChecksumVerificationException: Checksum failed on download: local = '86a8ad2ea8e6b771762ba4b063ea6e9f'; remote = '2e8e82d339689520554360341f45746d'
build:start:

multiproject:install-callback:
    [echo] Running jar:install for Apache Axis 2.0 - Kernel
java:prepare-filesystem:
    [mkdir] Created dir: /export/home/illsleyd/continuum/continuum-1.0.3/apps/continuum/working-directory/1/modules/kernel/target/classes
Running post goal: java:prepare-filesystem

java:compile:
    [echo] Compiling to /export/home/illsleyd/continuum/continuum-1.0.3/apps/continuum/working-directory/1/modules/kernel/target/classes
    [javac] Compiling 314 source files to /export/home/illsleyd/continuum/continuum-1.0.3/apps/continuum/working-directory/1/modules/kernel/target/classes
    [javac] Note: Some input files use or override a deprecated API.
    [javac] Note: Recompile with -Xlint:deprecation for details.

java:jar-resources:
Copying 1 file to /export/home/illsleyd/continuum/continuum-1.0.3/apps/continuum/working-directory/1/modules/kernel/target/classes
Copying 2 files to /export/home/illsleyd/continuum/continuum-1.0.3/apps/continuum/working-directory/1/modules/kernel/target/classes
Copying 2 files to /export/home/illsleyd/continuum/continuum-1.0.3/apps/continuum/working-directory/1/modules/kernel/target/classes/META-INF

test:test:
java:prepare-filesystem:
Running post goal: java:prepare-filesystem

java:compile:
    [echo] Compiling to /export/home/illsleyd/continuum/continuum-1.0.3/apps/continuum/working-directory/1/modules/kernel/target/classes
    [javac] Compiling 1 source file to /export/home/illsleyd/continuum/continuum-1.0.3/apps/continuum/working-directory/1/modules/kernel/target/classes

java:jar-resources:

test:prepare-filesystem:
    [mkdir] Created dir: /export/home/illsleyd/continuum/continuum-1.0.3/apps/continuum/working-directory/1/modules/kernel/target/test-classes
    [mkdir] Created dir: /export/home/illsleyd/continuum/continuum-1.0.3/apps/continuum/working-directory/1/modules/kernel/target/test-reports

test:test-resources:
Copying 59 files to /export/home/illsleyd/continuum/continuum-1.0.3/apps/continuum/working-directory/1/modules/kernel/target/test-classes/../test-resources

test:compile:
    [javac] Compiling 93 source files to /export/home/illsleyd/continuum/continuum-1.0.3/apps/continuum/working-directory/1/modules/kernel/target/test-classes
    [javac] Note: Some input files use or override a deprecated API.
    [javac] Note: Recompile with -Xlint:deprecation for details.
Running post goal: test:compile
    [echo] the files are up to date = ${jars.uptodate}
    [mkdir] Created dir: /export/home/illsleyd/continuum/continuum-1.0.3/apps/continuum/working-directory/1/modules/kernel/test-resources/deployment/service2/build/classes
    [mkdir] Created dir: /export/home/illsleyd/continuum/continuum-1.0.3/apps/continuum/working-directory/1/modules/kernel/test-resources/deployment/service2/build/lib
    [copy] Copying 1 file to /export/home/illsleyd/continuum/continuum-1.0.3/apps/continuum/working-directory/1/modules/kernel/test-resources/deployment/service2/build/classes/META-INF
    [mkdir] Created dir: /export/home/illsleyd/continuum/continuum-1.0.3/apps/continuum/working-directory/1/modules/kernel/target/test-resources/deployment/services
    [jar] Building jar: /export/home/illsleyd/continuum/continuum-1.0.3/apps/continuum/working-directory/1/modules/kernel/target/test-resources/deployment/services/service2.jar
    [delete] Deleting directory /export/home/illsleyd/continuum/continuum-1.0.3/apps/continuum/working-directory/1/modules/kernel/test-resources/deployment/service2/build
    [echo] the files are up to date = ${jars.uptodate}
    [mkdir] Created dir: /export/home/illsleyd/continuum/continuum-1.0.3/apps/continuum/working-directory/1/modules/kernel/test-resources/deployment/echo/build/classes
    [mkdir] Created dir: /export/home/illsleyd/continuum/continuum-1.0.3/apps/continuum/working-directory/1/modules/kernel/test-resources/deployment/echo/build/lib
    [copy] Copying 1 file to /export/home/illsleyd/continuum/continuum-1.0.3/apps/continuum/working-directory/1/modules/kernel/test-resources/deployment/echo/build/classes/META-INF
    [mkdir] Created dir: /export/home/illsleyd/continuum/continuum-1.0.3/apps/continuum/working-directory/1/modules/kernel/target/echo
    [jar] Building jar: /export/home/illsleyd/continuum/continuum-1.0.3/apps/continuum/working-directory/1/modules/kernel/target/echo/echo.aar
    [delete] Deleting directory /export/home/illsleyd/continuum/continuum-1.0.3/apps/continuum/working-directory/1/modules/kernel/test-resources/deployment/echo/build
    [echo] the files are up to date = ${jars.uptodate}
    [mkdir] Created dir: /export/home/illsleyd/continuum/continuum-1.0.3/apps/continuum/working-directory/1/modules/kernel/test-resources/deployment/invalidservice/build/classes
    [mkdir] Created dir: /export/home/illsleyd/continuum/continuum-1.0.3/apps/continuum/working-directory/1/modules/kernel/test-resources/deployment/invalidservice/build/lib
    [copy] Copying 1 file to /export/home/illsleyd/continuum/continuum-1.0.3/apps/continuum/working-directory/1/modules/kernel/test-resources/deployment/invalidservice/build/classes/META-INF
    [mkdir] Created dir: /export/home/illsleyd/continuum/continuum-1.0.3/apps/continuum/working-directory/1/modules/kernel/target/test-resources/InvalidDeployment/services
    [jar] Building jar: /export/home/illsleyd/continuum/continuum-1.0.3/apps/continuum/working-directory/1/modules/kernel/target/test-resources/InvalidDeployment/services/invalidService.jar
    [delete] Deleting directory /export/home/illsleyd/continuum/continuum-1.0.3/apps/continuum/working-directory/1/modules/kernel/test-resources/deployment/invalidservice/build
    [echo] the files are up to date = ${jars.uptodate}
    [mkdir] Created dir: /export/home/illsleyd/continuum/continuum-1.0.3/apps/continuum/working-directory/1/modules/kernel/test-resources/deployment/module1/build/classes
    [mkdir] Created dir: /export/home/illsleyd/continuum/continuum-1.0.3/apps/continuum/working-directory/1/modules/kernel/test-resources/deployment/module1/build/lib
    [copy] Copying 1 file to /export/home/illsleyd/continuum/continuum-1.0.3/apps/continuum/working-directory/1/modules/kernel/test-resources/deployment/module1/build/classes/META-INF
    [mkdir] Created dir: /export/home/illsleyd/continuum/continuum-1.0.3/apps/continuum/working-directory/1/modules/kernel/target/test-resources/deployment/modules
    [jar] Building jar: /export/home/illsleyd/continuum/continuum-1.0.3/apps/continuum/working-directory/1/modules/kernel/target/test-resources/deployment/modules/module1.mar
    [delete] Deleting directory /export/home/illsleyd/continuum/continuum-1.0.3/apps/continuum/working-directory/1/modules/kernel/test-resources/deployment/module1/build
    [echo] the files are up to date = ${jars.uptodate}
    [mkdir] Created dir: /export/home/illsleyd/continuum/continuum-1.0.3/apps/continuum/working-directory/1/modules/kernel/test-resources/deployment/serviceModule/build/classes
    [mkdir] Created dir: /export/home/illsleyd/continuum/continuum-1.0.3/apps/continuum/working-directory/1/modules/kernel/test-resources/deployment/serviceModule/build/lib
    [copy] Copying 1 file to /export/home/illsleyd/continuum/continuum-1.0.3/apps/continuum/working-directory/1/modules/kernel/test-resources/deployment/serviceModule/build/classes/META-INF
    [mkdir] Created dir: /export/home/illsleyd/continuum/continuum-1.0.3/apps/continuum/working-directory/1/modules/kernel/target/test-resources/InvalidDeployment/modules
    [jar] Building jar: /export/home/illsleyd/continuum/continuum-1.0.3/apps/continuum/working-directory/1/modules/kernel/target/test-resources/InvalidDeployment/modules/serviceModule.jar
    [delete] Deleting directory /export/home/illsleyd/continuum/continuum-1.0.3/apps/continuum/working-directory/1/modules/kernel/test-resources/deployment/serviceModule/build
    [mkdir] Created dir: /export/home/illsleyd/continuum/continuum-1.0.3/apps/continuum/working-directory/1/modules/kernel/target/test-resources/java2sec/more
    [mkdir] Created dir: /export/home/illsleyd/continuum/continuum-1.0.3/apps/continuum/working-directory/1/modules/kernel/target/test-resources/java2sec/less
    [jar] Building jar: /export/home/illsleyd/continuum/continuum-1.0.3/apps/continuum/working-directory/1/modules/kernel/target/test-resources/java2sec/more/MorePermission.jar
    [delete] Deleting directory /export/home/illsleyd/continuum/continuum-1.0.3/apps/continuum/working-directory/1/modules/kernel/target/test-classes/org/apache/axis2/java/security/driver
    [delete] Deleting directory /export/home/illsleyd/continuum/continuum-1.0.3/apps/continuum/working-directory/1/modules/kernel/target/test-classes/org/apache/axis2/java/security/more
    [delete] Deleting directory /export/home/illsleyd/continuum/continuum-1.0.3/apps/continuum/working-directory/1/modules/kernel/target/test-classes/org/apache/axis2/java/security/action
    [delete] Deleting directory /export/home/illsleyd/continuum/continuum-1.0.3/apps/continuum/working-directory/1/modules/kernel/target/test-classes/org/apache/axis2/java/security/interf
    [jar] Building jar: /export/home/illsleyd/continuum/continuum-1.0.3/apps/continuum/working-directory/1/modules/kernel/target/test-resources/java2sec/less/LessPermission.jar
    [delete] Deleting directory /export/home/illsleyd/continuum/continuum-1.0.3/apps/continuum/working-directory/1/modules/kernel/target/test-classes/org/apache/axis2/java/security/less

    [junit] Running org.apache.axis2.addressing.AddressingHelperTest
    [junit] Tests run: 6, Failures: 0, Errors: 0, Time elapsed: 0.446 sec
    [junit] Running org.apache.axis2.addressing.EndpointReferenceHelperTest
    [junit] Tests run: 2, Failures: 0, Errors: 0, Time elapsed: 0.44 sec
    [junit] Running org.apache.axis2.addressing.EndpointReferenceTypeTest
    [junit] Tests run: 5, Failures: 0, Errors: 0, Time elapsed: 0.662 sec
    [junit] Running org.apache.axis2.addressing.miheaders.RelatesToTest
    [junit] Tests run: 3, Failures: 0, Errors: 0, Time elapsed: 0.39 sec
    [junit] Running org.apache.axis2.addressing.wsdl.WSDL11ActionHelperTest
    [junit] Tests run: 8, Failures: 0, Errors: 0, Time elapsed: 0.814 sec
    [junit] Running org.apache.axis2.context.ContextHierarchyTest
    [junit] Tests run: 2, Failures: 0, Errors: 0, Time elapsed: 0.774 sec
    [junit] Running org.apache.axis2.context.OperationContextTest
    [junit] Tests run: 1, Failures: 0, Errors: 0, Time elapsed: 0.692 sec
    [junit] Running org.apache.axis2.deployment.AddingObserverTest
    [junit] Tests run: 1, Failures: 0, Errors: 0, Time elapsed: 1.01 sec
    [junit] Running org.apache.axis2.deployment.AxisMessageTest
    [junit] Tests run: 1, Failures: 0, Errors: 0, Time elapsed: 1.411 sec
    [junit] Running org.apache.axis2.deployment.BadModuleTest
    [junit] Tests run: 1, Failures: 0, Errors: 0, Time elapsed: 0.682 sec
    [junit] Running org.apache.axis2.deployment.BuildERWithDeploymentTest
    [junit] Tests run: 1, Failures: 0, Errors: 0, Time elapsed: 1.247 sec
    [junit] Running org.apache.axis2.deployment.BuilderSelectorDeploymentTest
    [junit] Tests run: 2, Failures: 0, Errors: 0, Time elapsed: 0.792 sec
    [junit] Running org.apache.axis2.deployment.DeploymentTotalTest
    [junit] Tests run: 1, Failures: 0, Errors: 0, Time elapsed: 1.164 sec
    [junit] Running org.apache.axis2.deployment.MessageFormatterDeploymentTest
    [junit] Tests run: 2, Failures: 0, Errors: 0, Time elapsed: 1.184 sec
    [junit] Running org.apache.axis2.deployment.ModifiedConfigFileTest
    [junit] Tests run: 1, Failures: 0, Errors: 0, Time elapsed: 0.781 sec
    [junit] Running org.apache.axis2.deployment.ModuleDisengagementTest
    [junit] Tests run: 7, Failures: 0, Errors: 0, Time elapsed: 1.439 sec
    [junit] Running org.apache.axis2.deployment.ModuleversionTest
    [junit] Tests run: 2, Failures: 0, Errors: 0, Time elapsed: 0.8 sec
    [junit] Running org.apache.axis2.deployment.OperationExcludeTest
    [junit] Tests run: 1, Failures: 0, Errors: 0, Time elapsed: 1.399 sec
    [junit] Running org.apache.axis2.deployment.SameServiceAddingTest
    [junit] Tests run: 1, Failures: 0, Errors: 0, Time elapsed: 0.818 sec
    [junit] Running org.apache.axis2.deployment.ServiceGroupTest
    [junit] Tests run: 1, Failures: 0, Errors: 0, Time elapsed: 1.432 sec
    [junit] Running org.apache.axis2.deployment.SystemPhasesremovedTest
    [junit] Tests run: 1, Failures: 0, Errors: 0, Time elapsed: 0.707 sec
    [junit] Running org.apache.axis2.deployment.TransportDeploymentTest
    [junit] Tests run: 1, Failures: 0, Errors: 0, Time elapsed: 1.118 sec
    [junit] Running org.apache.axis2.description.RegistryTest
    [junit] Tests run: 5, Failures: 0, Errors: 0, Time elapsed: 0.64 sec
    [junit] Running org.apache.axis2.description.WSDLToAllServicesBuilderTest
    [junit] Tests run: 2, Failures: 0, Errors: 0, Time elapsed: 4.025 sec
    [junit] Running org.apache.axis2.dispatchers.ActionBasedOperationDispatchTest
    [junit] Tests run: 1, Failures: 0, Errors: 0, Time elapsed: 0.779 sec
    [junit] Running org.apache.axis2.dispatchers.RelatesToBasedOperationDispatcherTest
    [junit] Tests run: 1, Failures: 0, Errors: 0, Time elapsed: 0.807 sec
    [junit] Running org.apache.axis2.dispatchers.RelatesToBasedServiceDispatcherTest
    [junit] Tests run: 1, Failures: 0, Errors: 0, Time elapsed: 0.769 sec
    [junit] Running org.apache.axis2.dispatchers.RequestURIBasedOperationDispatcherTest
    [junit] Tests run: 1, Failures: 0, Errors: 0, Time elapsed: 0.763 sec
    [junit] Running org.apache.axis2.dispatchers.RequestURIBasedServiceDispatcherTest
    [junit] Tests run: 1, Failures: 0, Errors: 0, Time elapsed: 0.488 sec
    [junit] Running org.apache.axis2.dispatchers.SOAPMessageBodyBasedOperationDispatcherTest
    [junit] Tests run: 1, Failures: 0, Errors: 0, Time elapsed: 0.805 sec
    [junit] Running org.apache.axis2.dispatchers.SOAPMessageBodyBasedServiceDispatcherTest
    [junit] Tests run: 1, Failures: 0, Errors: 0, Time elapsed: 0.532 sec
    [junit] Running org.apache.axis2.engine.EnginePausingTest
    [junit] Tests run: 1, Failures: 0, Errors: 0, Time elapsed: 0.804 sec
    [junit] Running org.apache.axis2.engine.MessageContextChangeTest
    [junit] Tests run: 1, Failures: 0, Errors: 0, Time elapsed: 0.445 sec
    [junit] Running org.apache.axis2.engine.MessageContextSaveATest
    [junit] Tests run: 4, Failures: 0, Errors: 0, Time elapsed: 1.171 sec
    [junit] Running org.apache.axis2.engine.MessageContextSaveBTest
    [junit] Tests run: 1, Failures: 0, Errors: 0, Time elapsed: 0.841 sec
    [junit] Running org.apache.axis2.engine.MessageContextSaveCTest
    [junit] Tests run: 2, Failures: 0, Errors: 0, Time elapsed: 0.882 sec
    [junit] Running org.apache.axis2.engine.MessageContextSelfManagedDataTest
    [junit] Tests run: 10, Failures: 0, Errors: 0, Time elapsed: 1.918 sec
    [junit] Running org.apache.axis2.engine.MessageContextTest
    [junit] Tests run: 1, Failures: 0, Errors: 0, Time elapsed: 0.538 sec
    [junit] Running org.apache.axis2.engine.ModuleConfigTest
    [junit] Tests run: 2, Failures: 0, Errors: 0, Time elapsed: 1.135 sec
    [junit] Running org.apache.axis2.engine.ModuleEngageTest
    [junit] Tests run: 1, Failures: 0, Errors: 0, Time elapsed: 1.178 sec
    [junit] Running org.apache.axis2.engine.ObjectSaveTest
    [junit] Tests run: 5, Failures: 0, Errors: 0, Time elapsed: 0.756 sec
    [junit] Running org.apache.axis2.engine.OperationContextSaveTest
    [junit] Tests run: 1, Failures: 0, Errors: 0, Time elapsed: 0.706 sec
    [junit] Running org.apache.axis2.engine.OptionsSaveTest
    [junit] Tests run: 1, Failures: 0, Errors: 0, Time elapsed: 1.031 sec
    [junit] Running org.apache.axis2.engine.ParameterAddTest
    [junit] Tests run: 4, Failures: 0, Errors: 0, Time elapsed: 0.703 sec
    [junit] Running org.apache.axis2.engine.SOAPActionBasedDispatcherTest
    [junit] Tests run: 4, Failures: 0, Errors: 0, Time elapsed: 0.847 sec
    [junit] Running org.apache.axis2.java.security.driver.Java2SecTest
    [junit] Tests run: 9, Failures: 0, Errors: 0, Time elapsed: 0.415 sec
    [junit] Running org.apache.axis2.misc.MiscTest
    [junit] Tests run: 1, Failures: 0, Errors: 0, Time elapsed: 0.332 sec
    [junit] Running org.apache.axis2.phaserule.AddingHandlerToEachPhaseTest
    [junit] Tests run: 3, Failures: 0, Errors: 0, Time elapsed: 0.394 sec
    [junit] Running org.apache.axis2.phaserule.BeforeAfterTest
    [junit] Tests run: 1, Failures: 0, Errors: 0, Time elapsed: 0.373 sec
    [junit] Running org.apache.axis2.phaserule.BeforeTest
    [junit] Tests run: 1, Failures: 0, Errors: 0, Time elapsed: 0.493 sec
    [junit] Running org.apache.axis2.phaserule.BeforeWithNoFirstHandlerTest
    [junit] Tests run: 1, Failures: 0, Errors: 0, Time elapsed: 0.48 sec
    [junit] Running org.apache.axis2.phaserule.InvalidPhaseFirstRulesTest
    [junit] Tests run: 1, Failures: 0, Errors: 0, Time elapsed: 0.481 sec
    [junit] Running org.apache.axis2.phaserule.InvalidPhaseFirstTest
    [junit] Tests run: 1, Failures: 0, Errors: 0, Time elapsed: 0.462 sec
    [junit] Running org.apache.axis2.phaserule.InvalidPhaseLastRuleTest
    [junit] Tests run: 1, Failures: 0, Errors: 0, Time elapsed: 0.416 sec
    [junit] Running org.apache.axis2.phaserule.InvalidPhaseRuleTest
    [junit] Tests run: 2, Failures: 0, Errors: 0, Time elapsed: 0.411 sec
    [junit] Running org.apache.axis2.phaserule.InvalidPhaselastTest
    [junit] Tests run: 1, Failures: 0, Errors: 0, Time elapsed: 0.554 sec
    [junit] Running org.apache.axis2.phaserule.PhaseFirstTest
    [junit] Tests run: 1, Failures: 0, Errors: 0, Time elapsed: 0.379 sec
    [junit] Running org.apache.axis2.phaserule.PhaseLastTest
    [junit] Tests run: 1, Failures: 0, Errors: 0, Time elapsed: 0.421 sec
    [junit] Running org.apache.axis2.phaserule.PhaseRuleTest
    [junit] Tests run: 1, Failures: 0, Errors: 0, Time elapsed: 0.385 sec
    [junit] Running org.apache.axis2.phaserule.PreDispatchPhaseRuleTest
    [junit] Tests run: 1, Failures: 0, Errors: 0, Time elapsed: 0.368 sec
    [junit] Running org.apache.axis2.phaserule.SingleHandlerPhaseTest
    [junit] Tests run: 1, Failures: 0, Errors: 0, Time elapsed: 0.418 sec
    [junit] Running org.apache.axis2.transport.tcp.TCPTransportTest
    [junit] Tests run: 1, Failures: 0, Errors: 0, Time elapsed: 0.33 sec
    [junit] Running org.apache.axis2.util.ThreadContextMigratorTest
    [junit] Tests run: 2, Failures: 0, Errors: 0, Time elapsed: 0.42 sec

jar:jar:
    [copy] Copying 1 file to /export/home/illsleyd/continuum/continuum-1.0.3/apps/continuum/working-directory/1/modules/kernel/target/classes/org/apache/axis2/i18n
    [jar] Building jar: /export/home/illsleyd/continuum/continuum-1.0.3/apps/continuum/working-directory/1/modules/kernel/target/axis2-kernel-SNAPSHOT.jar

jar:install:
    [echo] Installing...
Uploading to org.apache.axis2/jars/axis2-kernel-SNAPSHOT.jar: 
.................... (844K)
Uploading to org.apache.axis2/poms/axis2-kernel-SNAPSHOT.pom: 
.................... (15K)

+----------------------------------------
| Executing multiproject:install-callback Apache Axis 2.0 - Data Binding
| Memory: 13M/22M
+----------------------------------------
DEPRECATED: the default goal should be specified in the <build> section of project.xml instead of maven.xml
DEPRECATED: the default goal should be specified in the <build> section of project.xml instead of maven.xml

build:end:

Trying to get missing/snapshot dependencies required by Apache Axis 2.0 - Data Binding:
Attempting to download axiom-dom-SNAPSHOT.jar.
4/130K
8/130K
12/130K
16/130K
20/130K
24/130K
28/130K
32/130K
35/130K
39/130K
43/130K
47/130K
51/130K
55/130K
59/130K
63/130K
67/130K
71/130K
75/130K
79/130K
83/130K
87/130K
91/130K
95/130K
99/130K
103/130K
107/130K
111/130K
115/130K
119/130K
123/130K
127/130K
130/130K
130K downloaded
Error retrieving artifact from [http://people.apache.org/repo/m1-snapshot-repository/]: org.apache.maven.verifier.ChecksumVerificationException: Error retrieving checksum file for /org.apache.ws.commons.axiom/jars/axiom-dom-SNAPSHOT.jar
Skipping download as local copy is up to date!
Attempting to download axis2-kernel-SNAPSHOT.jar.
Skipping download as local copy is up to date!
build:start:

multiproject:install-callback:
    [echo] Running jar:install for Apache Axis 2.0 - Data Binding
java:prepare-filesystem:
    [mkdir] Created dir: /export/home/illsleyd/continuum/continuum-1.0.3/apps/continuum/working-directory/1/modules/adb/target/classes
Running post goal: java:prepare-filesystem

java:compile:
    [echo] Compiling to /export/home/illsleyd/continuum/continuum-1.0.3/apps/continuum/working-directory/1/modules/adb/target/classes
    [javac] Compiling 62 source files to /export/home/illsleyd/continuum/continuum-1.0.3/apps/continuum/working-directory/1/modules/adb/target/classes

java:jar-resources:
Copying 1 file to /export/home/illsleyd/continuum/continuum-1.0.3/apps/continuum/working-directory/1/modules/adb/target/classes
Copying 2 files to /export/home/illsleyd/continuum/continuum-1.0.3/apps/continuum/working-directory/1/modules/adb/target/classes/META-INF

test:test:
java:prepare-filesystem:
Running post goal: java:prepare-filesystem

java:compile:
    [echo] Compiling to /export/home/illsleyd/continuum/continuum-1.0.3/apps/continuum/working-directory/1/modules/adb/target/classes

java:jar-resources:

test:prepare-filesystem:
    [mkdir] Created dir: /export/home/illsleyd/continuum/continuum-1.0.3/apps/continuum/working-directory/1/modules/adb/target/test-classes
    [mkdir] Created dir: /export/home/illsleyd/continuum/continuum-1.0.3/apps/continuum/working-directory/1/modules/adb/target/test-reports

test:test-resources:
Copying 1 file to /export/home/illsleyd/continuum/continuum-1.0.3/apps/continuum/working-directory/1/modules/adb/target/test-classes
Copying 1 file to /export/home/illsleyd/continuum/continuum-1.0.3/apps/continuum/working-directory/1/modules/adb/target/test-classes

test:compile:
    [javac] Compiling 9 source files to /export/home/illsleyd/continuum/continuum-1.0.3/apps/continuum/working-directory/1/modules/adb/target/test-classes

    [junit] Running org.apache.axis2.databinding.ADBSOAPModelBuilderTest
    [junit] Tests run: 5, Failures: 0, Errors: 0, Time elapsed: 0.74 sec
    [junit] Running org.apache.axis2.databinding.utils.NamedStaxOMBuilderTest
    [junit] Tests run: 2, Failures: 0, Errors: 0, Time elapsed: 0.503 sec
    [junit] Running org.apache.axis2.databinding.utils.SimpleArrayReaderStateMachineTest
    [junit] Tests run: 4, Failures: 0, Errors: 0, Time elapsed: 0.469 sec
    [junit] Running org.apache.axis2.databinding.utils.SimpleElementReaderStateMachineTest
    [junit] Tests run: 3, Failures: 0, Errors: 0, Time elapsed: 0.712 sec
    [junit] Running org.apache.axis2.databinding.utils.reader.ADBXMLStreamReaderTest
    [junit] Tests run: 15, Failures: 0, Errors: 0, Time elapsed: 0.834 sec

jar:jar:
    [jar] Building jar: /export/home/illsleyd/continuum/continuum-1.0.3/apps/continuum/working-directory/1/modules/adb/target/axis2-adb-SNAPSHOT.jar

jar:install:
    [echo] Installing...
Uploading to org.apache.axis2/jars/axis2-adb-SNAPSHOT.jar: 
.................... (138K)
Uploading to org.apache.axis2/poms/axis2-adb-SNAPSHOT.pom: 
.................... (14K)

+----------------------------------------
| Executing multiproject:install-callback Apache Axis 2.0 - Code Generation
| Memory: 16M/21M
+----------------------------------------
DEPRECATED: the default goal should be specified in the <build> section of project.xml instead of maven.xml
DEPRECATED: the default goal should be specified in the <build> section of project.xml instead of maven.xml

build:end:

Trying to get missing/snapshot dependencies required by Apache Axis 2.0 - Code Generation:
Attempting to download axis2-adb-SNAPSHOT.jar.
Skipping download as local copy is up to date!
build:start:

multiproject:install-callback:
    [echo] Running jar:install for Apache Axis 2.0 - Code Generation
java:prepare-filesystem:
    [mkdir] Created dir: /export/home/illsleyd/continuum/continuum-1.0.3/apps/continuum/working-directory/1/modules/codegen/target/classes
Running post goal: java:prepare-filesystem

java:compile:
    [echo] Compiling to /export/home/illsleyd/continuum/continuum-1.0.3/apps/continuum/working-directory/1/modules/codegen/target/classes
    [javac] Compiling 69 source files to /export/home/illsleyd/continuum/continuum-1.0.3/apps/continuum/working-directory/1/modules/codegen/target/classes

java:jar-resources:
Copying 33 files to /export/home/illsleyd/continuum/continuum-1.0.3/apps/continuum/working-directory/1/modules/codegen/target/classes
Copying 2 files to /export/home/illsleyd/continuum/continuum-1.0.3/apps/continuum/working-directory/1/modules/codegen/target/classes/META-INF
Running post goal: java:jar-resources

test:test:
java:prepare-filesystem:
Running post goal: java:prepare-filesystem

java:compile:
    [echo] Compiling to /export/home/illsleyd/continuum/continuum-1.0.3/apps/continuum/working-directory/1/modules/codegen/target/classes

java:jar-resources:
Running post goal: java:jar-resources

test:prepare-filesystem:
    [mkdir] Created dir: /export/home/illsleyd/continuum/continuum-1.0.3/apps/continuum/working-directory/1/modules/codegen/target/test-classes
    [mkdir] Created dir: /export/home/illsleyd/continuum/continuum-1.0.3/apps/continuum/working-directory/1/modules/codegen/target/test-reports

test:test-resources:
Copying 6 files to /export/home/illsleyd/continuum/continuum-1.0.3/apps/continuum/working-directory/1/modules/codegen/target/test-classes
Copying 31 files to /export/home/illsleyd/continuum/continuum-1.0.3/apps/continuum/working-directory/1/modules/codegen/target/test-classes

test:compile:
    [javac] Compiling 2 source files to /export/home/illsleyd/continuum/continuum-1.0.3/apps/continuum/working-directory/1/modules/codegen/target/test-classes

    [junit] Running org.apache.axis2.wsdl.WSDLServiceBuilderTest
    [junit] Tests run: 1, Failures: 0, Errors: 0, Time elapsed: 3.871 sec
    [junit] Running org.apache.axis2.wsdl.codegen.extension.SchemaUnwrapperExtensionTest
    [junit] Tests run: 4, Failures: 0, Errors: 0, Time elapsed: 0.776 sec

jar:jar:
    [jar] Building jar: /export/home/illsleyd/continuum/continuum-1.0.3/apps/continuum/working-directory/1/modules/codegen/target/axis2-codegen-SNAPSHOT.jar

jar:install:
    [echo] Installing...
Uploading to org.apache.axis2/jars/axis2-codegen-SNAPSHOT.jar: 
.................... (179K)
Uploading to org.apache.axis2/poms/axis2-codegen-SNAPSHOT.pom: 
.................... (17K)

+----------------------------------------
| Executing multiproject:install-callback Apache Axis 2.0 - ADB Codegen
| Memory: 21M/33M
+----------------------------------------
DEPRECATED: the default goal should be specified in the <build> section of project.xml instead of maven.xml
DEPRECATED: the default goal should be specified in the <build> section of project.xml instead of maven.xml

build:end:

Trying to get missing/snapshot dependencies required by Apache Axis 2.0 - ADB Codegen:
Attempting to download axis2-codegen-SNAPSHOT.jar.
Skipping download as local copy is up to date!
build:start:

multiproject:install-callback:
    [echo] Running jar:install for Apache Axis 2.0 - ADB Codegen
java:prepare-filesystem:
    [mkdir] Created dir: /export/home/illsleyd/continuum/continuum-1.0.3/apps/continuum/working-directory/1/modules/adb-codegen/target/classes
Running post goal: java:prepare-filesystem

java:compile:
    [echo] Compiling to /export/home/illsleyd/continuum/continuum-1.0.3/apps/continuum/working-directory/1/modules/adb-codegen/target/classes
    [javac] Compiling 17 source files to /export/home/illsleyd/continuum/continuum-1.0.3/apps/continuum/working-directory/1/modules/adb-codegen/target/classes

java:jar-resources:
Copying 8 files to /export/home/illsleyd/continuum/continuum-1.0.3/apps/continuum/working-directory/1/modules/adb-codegen/target/classes
Copying 2 files to /export/home/illsleyd/continuum/continuum-1.0.3/apps/continuum/working-directory/1/modules/adb-codegen/target/classes/META-INF

test:test:
java:prepare-filesystem:
Running post goal: java:prepare-filesystem

java:compile:
    [echo] Compiling to /export/home/illsleyd/continuum/continuum-1.0.3/apps/continuum/working-directory/1/modules/adb-codegen/target/classes

java:jar-resources:

test:prepare-filesystem:
    [mkdir] Created dir: /export/home/illsleyd/continuum/continuum-1.0.3/apps/continuum/working-directory/1/modules/adb-codegen/target/test-classes
    [mkdir] Created dir: /export/home/illsleyd/continuum/continuum-1.0.3/apps/continuum/working-directory/1/modules/adb-codegen/target/test-reports

test:test-resources:
Copying 36 files to /export/home/illsleyd/continuum/continuum-1.0.3/apps/continuum/working-directory/1/modules/adb-codegen/target/test-classes
Copying 8 files to /export/home/illsleyd/continuum/continuum-1.0.3/apps/continuum/working-directory/1/modules/adb-codegen/target/test-classes

test:compile:
    [mkdir] Created dir: /export/home/illsleyd/continuum/continuum-1.0.3/apps/continuum/working-directory/1/modules/adb-codegen/target/schema
    [mkdir] Created dir: /export/home/illsleyd/continuum/continuum-1.0.3/apps/continuum/working-directory/1/modules/adb-codegen/target/schema/src
    [mkdir] Created dir: /export/home/illsleyd/continuum/continuum-1.0.3/apps/continuum/working-directory/1/modules/adb-codegen/target/schema/classes
    [echo] Compiling simple_maxOccurs2.xsd
    [echo] Compiling anonymous_complexType.xsd
    [echo] Compiling simple_choice.xsd
    [echo] Compiling simple_particle_all.xsd
    [echo] Compiling simple_maxOccurs.xsd
    [echo] Compiling simple_anytype.xsd
    [echo] Compiling simple-minoccurs0.xsd
    [echo] Compiling complex-minoccurs0.xsd
    [echo] Compiling simple-recursive-datatypes.xsd
    [echo] Compiling mixed_minoccus0.xsd
    [echo] Compiling complete.xsd
    [echo] Compiling simpleExtension.xsd
    [echo] Compiling union.xsd
    [echo] Compiling all.xsd
    [echo] Compiling enumeration.xsd
    [echo] Compiling restrictions.xsd
    [echo] Compiling choice.xsd
    [echo] Compiling list.xsd
    [echo] Compiling element_references.xsd
    [javac] Compiling 193 source files to /export/home/illsleyd/continuum/continuum-1.0.3/apps/continuum/working-directory/1/modules/adb-codegen/target/schema/classes
    [javac] Note: Some input files use unchecked or unsafe operations.
    [javac] Note: Recompile with -Xlint:unchecked for details.
    [javac] Compiling 80 source files to /export/home/illsleyd/continuum/continuum-1.0.3/apps/continuum/working-directory/1/modules/adb-codegen/target/test-classes

    [junit] Running org.apache.axis2.schema.all.AllTest
    [junit] Tests run: 1, Failures: 0, Errors: 0, Time elapsed: 0.563 sec
    [junit] Running org.apache.axis2.schema.choice.ChiceTest
    [junit] Tests run: 1, Failures: 0, Errors: 0, Time elapsed: 0.554 sec
    [junit] Running org.apache.axis2.schema.compile.AnonymousComplexTypeTest
    [junit] Tests run: 1, Failures: 0, Errors: 0, Time elapsed: 3.767 sec
    [junit] Running org.apache.axis2.schema.compile.ComplexAllTest
    [junit] Tests run: 1, Failures: 0, Errors: 0, Time elapsed: 4.368 sec
    [junit] Running org.apache.axis2.schema.compile.ComplexExtensionTest
    [junit] Tests run: 1, Failures: 0, Errors: 0, Time elapsed: 3.455 sec
    [junit] Running org.apache.axis2.schema.compile.ImportTest
    [junit] Tests run: 1, Failures: 0, Errors: 0, Time elapsed: 3.05 sec
    [junit] Running org.apache.axis2.schema.compile.RecursiveCompileTest
    [junit] Tests run: 1, Failures: 0, Errors: 0, Time elapsed: 3.742 sec
    [junit] Running org.apache.axis2.schema.compile.SimpleAnyAttribTest
    [junit] Tests run: 1, Failures: 0, Errors: 0, Time elapsed: 3.421 sec
    [junit] Running org.apache.axis2.schema.compile.SimpleAnyTest
    [junit] Tests run: 1, Failures: 0, Errors: 0, Time elapsed: 3.435 sec
    [junit] Running org.apache.axis2.schema.compile.SimpleAnyTypeTest
    [junit] Tests run: 1, Failures: 0, Errors: 0, Time elapsed: 3.467 sec
    [junit] Running org.apache.axis2.schema.compile.SimpleAttributeTest
    [junit] Tests run: 1, Failures: 0, Errors: 0, Time elapsed: 4.058 sec
    [junit] Running org.apache.axis2.schema.compile.SimpleChoiceTest
    [junit] Tests run: 1, Failures: 0, Errors: 0, Time elapsed: 3.647 sec
    [junit] Running org.apache.axis2.schema.compile.SimpleContentExtensionTest
    [junit] Tests run: 1, Failures: 0, Errors: 0, Time elapsed: 3.124 sec
    [junit] Running org.apache.axis2.schema.compile.SimpleElementReferenceTest
    [junit] Tests run: 1, Failures: 0, Errors: 0, Time elapsed: 3.719 sec
    [junit] Running org.apache.axis2.schema.compile.SimpleElementTest
    [junit] Tests run: 1, Failures: 0, Errors: 0, Time elapsed: 4.044 sec
    [junit] Running org.apache.axis2.schema.compile.SimpleParticleAllTest
    [junit] Tests run: 1, Failures: 0, Errors: 0, Time elapsed: 3.571 sec
    [junit] Running org.apache.axis2.schema.compile.SimpleRestrictionTest
    [junit] Tests run: 1, Failures: 0, Errors: 0, Time elapsed: 4.848 sec
    [junit] Running org.apache.axis2.schema.compile.SimpleSequence2Test
    [junit] Tests run: 1, Failures: 0, Errors: 0, Time elapsed: 3.594 sec
    [junit] Running org.apache.axis2.schema.compile.SimpleSequenceTest
    [junit] Tests run: 1, Failures: 0, Errors: 0, Time elapsed: 4.063 sec
    [junit] Running org.apache.axis2.schema.compile.XmlMaxOccurs2Test
    [junit] Tests run: 1, Failures: 0, Errors: 0, Time elapsed: 3.318 sec
    [junit] Running org.apache.axis2.schema.compile.XmlmaxOccursTest
    [junit] Tests run: 1, Failures: 0, Errors: 0, Time elapsed: 3.595 sec
    [junit] Running org.apache.axis2.schema.compile.simple.SimpleTypeAllCompileTest
    [junit] Tests run: 1, Failures: 0, Errors: 0, Time elapsed: 3.549 sec
    [junit] Running org.apache.axis2.schema.enumeration.EnumerationTest
    [junit] Tests run: 1, Failures: 0, Errors: 0, Time elapsed: 0.598 sec
    [junit] Running org.apache.axis2.schema.extension.ComplexExtenstionTest
    [junit] Tests run: 1, Failures: 0, Errors: 0, Time elapsed: 0.593 sec
    [junit] Running org.apache.axis2.schema.extension.SimpleExtensionTest
    [junit] Tests run: 1, Failures: 0, Errors: 0, Time elapsed: 0.585 sec
    [junit] Running org.apache.axis2.schema.list.ListTest
    [junit] Tests run: 5, Failures: 0, Errors: 0, Time elapsed: 0.599 sec
    [junit] Running org.apache.axis2.schema.populate.derived.DerivedTypeBytePopulateTest
    [junit] Tests run: 1, Failures: 0, Errors: 0, Time elapsed: 0.849 sec
    [junit] Running org.apache.axis2.schema.populate.derived.DerivedTypeIntPopulateTest
    [junit] Tests run: 1, Failures: 0, Errors: 0, Time elapsed: 0.809 sec
    [junit] Running org.apache.axis2.schema.populate.derived.DerivedTypeIntegerPopulateTest
    [junit] Tests run: 1, Failures: 0, Errors: 0, Time elapsed: 0.898 sec
    [junit] Running org.apache.axis2.schema.populate.derived.DerivedTypeLongPopulateTest
    [junit] Tests run: 1, Failures: 0, Errors: 0, Time elapsed: 0.701 sec
    [junit] Running org.apache.axis2.schema.populate.derived.DerivedTypeNegativeIntegerPopulateTest
    [junit] Tests run: 1, Failures: 0, Errors: 0, Time elapsed: 0.711 sec
    [junit] Running org.apache.axis2.schema.populate.derived.DerivedTypeNonNegativeIntegerPopulateTest
    [junit] Tests run: 1, Failures: 0, Errors: 0, Time elapsed: 0.712 sec
    [junit] Running org.apache.axis2.schema.populate.derived.DerivedTypeNonPositiveIntegerPopulateTest
    [junit] Tests run: 1, Failures: 0, Errors: 0, Time elapsed: 0.749 sec
    [junit] Running org.apache.axis2.schema.populate.derived.DerivedTypePositveIntegerPopulateTest
    [junit] Tests run: 1, Failures: 0, Errors: 0, Time elapsed: 0.752 sec
    [junit] Running org.apache.axis2.schema.populate.derived.DerivedTypeShortPopulateTest
    [junit] Tests run: 1, Failures: 0, Errors: 0, Time elapsed: 0.843 sec
    [junit] Running org.apache.axis2.schema.populate.derived.DerivedTypeUnsignedBytePopulateTest
    [junit] Tests run: 1, Failures: 0, Errors: 0, Time elapsed: 0.705 sec
    [junit] Running org.apache.axis2.schema.populate.derived.DerivedTypeUnsignedIntPopulateTest
    [junit] Tests run: 1, Failures: 0, Errors: 0, Time elapsed: 0.742 sec
    [junit] Running org.apache.axis2.schema.populate.derived.DerivedTypeUnsignedLongPopulateTest
    [junit] Tests run: 1, Failures: 0, Errors: 0, Time elapsed: 0.755 sec
    [junit] Running org.apache.axis2.schema.populate.derived.DerivedTypeUnsignedShortPopulateTest
    [junit] Tests run: 1, Failures: 0, Errors: 0, Time elapsed: 0.681 sec
    [junit] Running org.apache.axis2.schema.populate.other.ADBInOutTest
    [junit] Tests run: 2, Failures: 0, Errors: 0, Time elapsed: 0.516 sec
    [junit] Running org.apache.axis2.schema.populate.other.PopulateAnonComplexTypeTest
    [junit] Tests run: 1, Failures: 0, Errors: 0, Time elapsed: 0.519 sec
    [junit] Running org.apache.axis2.schema.populate.other.PopulateAnyTypeTest
    [junit] Tests run: 1, Failures: 0, Errors: 0, Time elapsed: 0.623 sec
    [junit] Running org.apache.axis2.schema.populate.other.PopulateArrayInArrayTest
    [junit] Tests run: 1, Failures: 0, Errors: 0, Time elapsed: 0.619 sec
    [junit] Running org.apache.axis2.schema.populate.other.PopulateArrayTest
    [junit] Tests run: 1, Failures: 0, Errors: 0, Time elapsed: 0.538 sec
    [junit] Running org.apache.axis2.schema.populate.other.PopulateChoiceTest
    [junit] Tests run: 1, Failures: 0, Errors: 0, Time elapsed: 0.548 sec
    [junit] Running org.apache.axis2.schema.populate.other.PopulateComplexMinOccurs0Test
    [junit] Tests run: 4, Failures: 0, Errors: 0, Time elapsed: 0.55 sec
    [junit] Running org.apache.axis2.schema.populate.other.PopulateMinOccurs0Test
    [junit] Tests run: 3, Failures: 0, Errors: 0, Time elapsed: 0.529 sec
    [junit] Running org.apache.axis2.schema.populate.other.PopulateMixedMinoccurs0Test
    [junit] Tests run: 2, Failures: 0, Errors: 0, Time elapsed: 0.502 sec
    [junit] Running org.apache.axis2.schema.populate.other.PopulateParticleAllTest
    [junit] Tests run: 1, Failures: 0, Errors: 0, Time elapsed: 0.515 sec
    [junit] Running org.apache.axis2.schema.populate.other.PopulateRecursiveTest
    [junit] Tests run: 1, Failures: 0, Errors: 0, Time elapsed: 0.609 sec
    [junit] Running org.apache.axis2.schema.populate.simple.SimpleTypeAnyURIPopulateTest
    [junit] Tests run: 1, Failures: 0, Errors: 0, Time elapsed: 0.541 sec
    [junit] Running org.apache.axis2.schema.populate.simple.SimpleTypeBase64BinPopulateTest
    [junit] Tests run: 1, Failures: 0, Errors: 0, Time elapsed: 0.638 sec
    [junit] Running org.apache.axis2.schema.populate.simple.SimpleTypeBooleanPopulateTest
    [junit] Tests run: 1, Failures: 0, Errors: 0, Time elapsed: 0.566 sec
    [junit] Running org.apache.axis2.schema.populate.simple.SimpleTypeDatePopulateTest
    [junit] Tests run: 1, Failures: 0, Errors: 0, Time elapsed: 0.582 sec
    [junit] Running org.apache.axis2.schema.populate.simple.SimpleTypeDateTimePopulateTest
    [junit] Tests run: 1, Failures: 0, Errors: 0, Time elapsed: 0.583 sec
    [junit] Running org.apache.axis2.schema.populate.simple.SimpleTypeDayPopulateTest
    [junit] Tests run: 1, Failures: 0, Errors: 0, Time elapsed: 0.529 sec
    [junit] Running org.apache.axis2.schema.populate.simple.SimpleTypeDoublePopulateTest
    [junit] Tests run: 1, Failures: 0, Errors: 0, Time elapsed: 0.532 sec
    [junit] Running org.apache.axis2.schema.populate.simple.SimpleTypeDurationPopulateTest
    [junit] Tests run: 1, Failures: 0, Errors: 0, Time elapsed: 0.535 sec
    [junit] Running org.apache.axis2.schema.populate.simple.SimpleTypeFloatPopulateTest
    [junit] Tests run: 1, Failures: 0, Errors: 0, Time elapsed: 0.544 sec
    [junit] Running org.apache.axis2.schema.populate.simple.SimpleTypeHexBinaryPopulateTest
    [junit] Tests run: 1, Failures: 0, Errors: 0, Time elapsed: 0.546 sec
    [junit] Running org.apache.axis2.schema.populate.simple.SimpleTypeMonthDayPopulateTest
    [junit] Tests run: 1, Failures: 0, Errors: 0, Time elapsed: 0.518 sec
    [junit] Running org.apache.axis2.schema.populate.simple.SimpleTypeQNamePopulateTest
    [junit] Tests run: 1, Failures: 0, Errors: 0, Time elapsed: 0.501 sec
    [junit] Running org.apache.axis2.schema.populate.simple.SimpleTypeTimePopulateTest
    [junit] Tests run: 1, Failures: 0, Errors: 0, Time elapsed: 0.52 sec
    [junit] Running org.apache.axis2.schema.populate.simple.SimpleTypegMonthPopulateTest
    [junit] Tests run: 1, Failures: 0, Errors: 0, Time elapsed: 0.528 sec
    [junit] Running org.apache.axis2.schema.populate.simple.SimpleTypegYearMonthPopulateTest
    [junit] Tests run: 1, Failures: 0, Errors: 0, Time elapsed: 0.578 sec
    [junit] Running org.apache.axis2.schema.populate.simple.SimpleTypegYearPopulateTest
    [junit] Tests run: 1, Failures: 0, Errors: 0, Time elapsed: 0.551 sec
    [junit] Running org.apache.axis2.schema.references.ElementReferenceTest
    [junit] Tests run: 2, Failures: 0, Errors: 0, Time elapsed: 0.587 sec
    [junit] Running org.apache.axis2.schema.restriction.ComplexRestrictionTest
    [junit] Tests run: 1, Failures: 0, Errors: 0, Time elapsed: 0.392 sec
    [junit] Running org.apache.axis2.schema.restriction.SimpleRestrictionTest
    [junit] Tests run: 5, Failures: 0, Errors: 0, Time elapsed: 1.073 sec
    [junit] Running org.apache.axis2.schema.testsuite.AnyElementsTest
    [junit] Tests run: 3, Failures: 0, Errors: 0, Time elapsed: 0.938 sec
    [junit] Running org.apache.axis2.schema.testsuite.CustomElementsTest
    [junit] Tests run: 3, Failures: 0, Errors: 0, Time elapsed: 0.75 sec
    [junit] Running org.apache.axis2.schema.testsuite.IntElementsTest
    [junit] Tests run: 3, Failures: 0, Errors: 0, Time elapsed: 0.844 sec
    [junit] Running org.apache.axis2.schema.testsuite.OuterElementsTest
    [junit] Tests run: 5, Failures: 0, Errors: 0, Time elapsed: 0.841 sec
    [junit] Running org.apache.axis2.schema.testsuite.StringElementsTest
    [junit] Tests run: 3, Failures: 0, Errors: 0, Time elapsed: 1.101 sec
    [junit] Running org.apache.axis2.schema.testsuite.XsdAnyElementsTest
    [junit] Tests run: 3, Failures: 0, Errors: 0, Time elapsed: 0.943 sec
    [junit] Running org.apache.axis2.schema.union.UnionTest
    [junit] Tests run: 4, Failures: 0, Errors: 0, Time elapsed: 0.802 sec

jar:jar:
    [jar] Building jar: /export/home/illsleyd/continuum/continuum-1.0.3/apps/continuum/working-directory/1/modules/adb-codegen/target/axis2-adb-codegen-SNAPSHOT.jar

jar:install:
    [echo] Installing...
Uploading to org.apache.axis2/jars/axis2-adb-codegen-SNAPSHOT.jar: 
.................... (121K)
Uploading to org.apache.axis2/poms/axis2-adb-codegen-SNAPSHOT.pom: 
.................... (15K)

+----------------------------------------
| Executing multiproject:install-callback Apache Axis 2.0 - Addressing
| Memory: 47M/59M
+----------------------------------------
DEPRECATED: the default goal should be specified in the <build> section of project.xml instead of maven.xml
DEPRECATED: the default goal should be specified in the <build> section of project.xml instead of maven.xml

build:end:

build:start:

multiproject:install-callback:
    [echo] Running jar:install for Apache Axis 2.0 - Addressing
java:prepare-filesystem:
    [mkdir] Created dir: /export/home/illsleyd/continuum/continuum-1.0.3/apps/continuum/working-directory/1/modules/addressing/target/classes
Running post goal: java:prepare-filesystem

java:compile:
    [echo] Compiling to /export/home/illsleyd/continuum/continuum-1.0.3/apps/continuum/working-directory/1/modules/addressing/target/classes
    [javac] Compiling 9 source files to /export/home/illsleyd/continuum/continuum-1.0.3/apps/continuum/working-directory/1/modules/addressing/target/classes
Running post goal: java:compile
    [mkdir] Created dir: /export/home/illsleyd/continuum/continuum-1.0.3/apps/continuum/working-directory/1/modules/addressing/target/classes/META-INF
    [copy] Copying 1 file to /export/home/illsleyd/continuum/continuum-1.0.3/apps/continuum/working-directory/1/modules/addressing/target/classes/META-INF
    [copy] Copying 1 file to /export/home/illsleyd/continuum/continuum-1.0.3/apps/continuum/working-directory/1/modules/addressing/target/classes/META-INF
    [copy] Copying 1 file to /export/home/illsleyd/continuum/continuum-1.0.3/apps/continuum/working-directory/1/modules/addressing/target/classes/META-INF
    [copy] Copying 1 file to /export/home/illsleyd/continuum/continuum-1.0.3/apps/continuum/working-directory/1/modules/addressing/target
    [mkdir] Created dir: /export/home/illsleyd/continuum/continuum-1.0.3/apps/continuum/working-directory/1/modules/addressing/target/modules
    [jar] Building jar: /export/home/illsleyd/continuum/continuum-1.0.3/apps/continuum/working-directory/1/modules/addressing/target/addressing-SNAPSHOT.mar
    [copy] Copying 1 file to /export/home/illsleyd/continuum/continuum-1.0.3/apps/continuum/working-directory/1/modules/addressing/target/modules
    [copy] Copying 1 file to /export/home/illsleyd/.maven/repository/org.apache.axis2/mars

java:jar-resources:
Copying 1 file to /export/home/illsleyd/continuum/continuum-1.0.3/apps/continuum/working-directory/1/modules/addressing/target/classes

test:test:
java:prepare-filesystem:
Running post goal: java:prepare-filesystem

java:compile:
    [echo] Compiling to /export/home/illsleyd/continuum/continuum-1.0.3/apps/continuum/working-directory/1/modules/addressing/target/classes
Running post goal: java:compile
    [copy] Copying 1 file to /export/home/illsleyd/continuum/continuum-1.0.3/apps/continuum/working-directory/1/modules/addressing/target/classes/META-INF
    [copy] Copying 1 file to /export/home/illsleyd/continuum/continuum-1.0.3/apps/continuum/working-directory/1/modules/addressing/target/classes/META-INF
    [jar] Building jar: /export/home/illsleyd/continuum/continuum-1.0.3/apps/continuum/working-directory/1/modules/addressing/target/addressing-SNAPSHOT.mar

java:jar-resources:

test:prepare-filesystem:
    [mkdir] Created dir: /export/home/illsleyd/continuum/continuum-1.0.3/apps/continuum/working-directory/1/modules/addressing/target/test-classes
    [mkdir] Created dir: /export/home/illsleyd/continuum/continuum-1.0.3/apps/continuum/working-directory/1/modules/addressing/target/test-reports

test:test-resources:
Copying 35 files to /export/home/illsleyd/continuum/continuum-1.0.3/apps/continuum/working-directory/1/modules/addressing/target/test-classes
Copying 2 files to /export/home/illsleyd/continuum/continuum-1.0.3/apps/continuum/working-directory/1/modules/addressing/target/test-classes

test:compile:
    [javac] Compiling 8 source files to /export/home/illsleyd/continuum/continuum-1.0.3/apps/continuum/working-directory/1/modules/addressing/target/test-classes
    [javac] Note: /export/home/illsleyd/continuum/continuum-1.0.3/apps/continuum/working-directory/1/modules/addressing/test/org/apache/axis2/handlers/addressing/AddressingOutHandlerTest.java uses or overrides a deprecated API.
    [javac] Note: Recompile with -Xlint:deprecation for details.

    [junit] Running org.apache.axis2.addressing.AddressingFaultsTest
    [junit] Tests run: 6, Failures: 0, Errors: 0, Time elapsed: 0.526 sec
    [junit] Running org.apache.axis2.handlers.addressing.AddressingFinalInHandlerTest
    [junit] Tests run: 17, Failures: 0, Errors: 0, Time elapsed: 0.819 sec
    [junit] Running org.apache.axis2.handlers.addressing.AddressingInFaultHandlerTest
    [junit] Tests run: 4, Failures: 0, Errors: 0, Time elapsed: 0.942 sec
    [junit] Running org.apache.axis2.handlers.addressing.AddressingOutHandlerTest
    [junit] Tests run: 6, Failures: 0, Errors: 0, Time elapsed: 1.399 sec
    [junit] Running org.apache.axis2.handlers.addressing.AddressingSubmissionInHandlerTest
    [junit] Tests run: 14, Failures: 0, Errors: 0, Time elapsed: 0.686 sec
    [junit] Running org.apache.axis2.handlers.addressing.AddressingValidationHandlerTest
    [junit] Tests run: 4, Failures: 0, Errors: 0, Time elapsed: 1.08 sec

jar:jar:
    [jar] Building jar: /export/home/illsleyd/continuum/continuum-1.0.3/apps/continuum/working-directory/1/modules/addressing/target/axis2-addressing-SNAPSHOT.jar

jar:install:
    [echo] Installing...
Uploading to org.apache.axis2/jars/axis2-addressing-SNAPSHOT.jar: 
.................... (38K)
Uploading to org.apache.axis2/poms/axis2-addressing-SNAPSHOT.pom: 
.................... (15K)

+----------------------------------------
| Executing multiproject:install-callback Apache Axis 2.0 - Samples
| Memory: 46M/60M
+----------------------------------------
DEPRECATED: the default goal should be specified in the <build> section of project.xml instead of maven.xml
DEPRECATED: the default goal should be specified in the <build> section of project.xml instead of maven.xml

build:end:

Trying to get missing/snapshot dependencies required by Apache Axis 2.0 - Samples:
Attempting to download axis2-addressing-SNAPSHOT.jar.
Skipping download as local copy is up to date!
build:start:

multiproject:install-callback:
    [echo] Running jar:install for Apache Axis 2.0 - Samples
java:prepare-filesystem:
    [mkdir] Created dir: /export/home/illsleyd/continuum/continuum-1.0.3/apps/continuum/working-directory/1/modules/samples/target/classes
Running post goal: java:prepare-filesystem

java:compile:
    [echo] Compiling to /export/home/illsleyd/continuum/continuum-1.0.3/apps/continuum/working-directory/1/modules/samples/target/classes
    [javac] Compiling 5 source files to /export/home/illsleyd/continuum/continuum-1.0.3/apps/continuum/working-directory/1/modules/samples/target/classes

java:jar-resources:
Copying 2 files to /export/home/illsleyd/continuum/continuum-1.0.3/apps/continuum/working-directory/1/modules/samples/target/classes/META-INF

test:test:
java:prepare-filesystem:
Running post goal: java:prepare-filesystem

java:compile:
Overriding previous definition of reference to samples.src.path
    [echo] Compiling to /export/home/illsleyd/continuum/continuum-1.0.3/apps/continuum/working-directory/1/modules/samples/target/classes

java:jar-resources:

test:prepare-filesystem:
    [mkdir] Created dir: /export/home/illsleyd/continuum/continuum-1.0.3/apps/continuum/working-directory/1/modules/samples/target/test-classes
    [mkdir] Created dir: /export/home/illsleyd/continuum/continuum-1.0.3/apps/continuum/working-directory/1/modules/samples/target/test-reports

test:test-resources:

test:compile:

Running post goal: test:test
create-samples:
    [mkdir] Created dir: /export/home/illsleyd/continuum/continuum-1.0.3/apps/continuum/working-directory/1/modules/samples/target/samples/userguide
    [mkdir] Created dir: /export/home/illsleyd/continuum/continuum-1.0.3/apps/continuum/working-directory/1/modules/samples/target/samples/wsdl
    [copy] Copying 2 files to /export/home/illsleyd/continuum/continuum-1.0.3/apps/continuum/working-directory/1/modules/samples/target/samples/wsdl
userguide:
    [mkdir] Created dir: /export/home/illsleyd/continuum/continuum-1.0.3/apps/continuum/working-directory/1/modules/samples/target/samples/userguide/src
    [copy] Copying 22 files to /export/home/illsleyd/continuum/continuum-1.0.3/apps/continuum/working-directory/1/modules/samples/target/samples/userguide/src
    [jar] Building MANIFEST-only jar: /export/home/illsleyd/continuum/continuum-1.0.3/apps/continuum/working-directory/1/modules/samples/target/samples/userguide/sample.jar

googleSpellcheck:
    [mkdir] Created dir: /export/home/illsleyd/continuum/continuum-1.0.3/apps/continuum/working-directory/1/modules/samples/target/googlespellcheck
    [jar] Building MANIFEST-only jar: /export/home/illsleyd/continuum/continuum-1.0.3/apps/continuum/working-directory/1/modules/samples/target/googlespellcheck/googleSpellcheck.jar

yahooRESTSearch:
    [mkdir] Created dir: /export/home/illsleyd/continuum/continuum-1.0.3/apps/continuum/working-directory/1/modules/samples/target/yahoorestsearch
    [jar] Building jar: /export/home/illsleyd/continuum/continuum-1.0.3/apps/continuum/working-directory/1/modules/samples/target/yahoorestsearch/yahooRESTSearch.jar

version:
    [mkdir] Created dir: /export/home/illsleyd/continuum/continuum-1.0.3/apps/continuum/working-directory/1/modules/samples/target/version
    [jar] Building jar: /export/home/illsleyd/continuum/continuum-1.0.3/apps/continuum/working-directory/1/modules/samples/target/version/version.jar
    [copy] Copying 1 file to /export/home/illsleyd/continuum/continuum-1.0.3/apps/continuum/working-directory/1/modules/samples/target/toWar/services

groovy:
    [mkdir] Created dir: /export/home/illsleyd/continuum/continuum-1.0.3/apps/continuum/working-directory/1/modules/samples/target/groovy
    [copy] Copying 1 file to /export/home/illsleyd/continuum/continuum-1.0.3/apps/continuum/working-directory/1/modules/samples/target/classes/sample/groovy
    [mkdir] Created dir: /export/home/illsleyd/continuum/continuum-1.0.3/apps/continuum/working-directory/1/modules/samples/target/classes/sample/groovy/lib
    [mkdir] Created dir: /export/home/illsleyd/continuum/continuum-1.0.3/apps/continuum/working-directory/1/modules/samples/target/classes/sample/groovy/META-INF
    [mkdir] Created dir: /export/home/illsleyd/continuum/continuum-1.0.3/apps/continuum/working-directory/1/modules/samples/target/classes/sample/groovy/sample
    [mkdir] Created dir: /export/home/illsleyd/continuum/continuum-1.0.3/apps/continuum/working-directory/1/modules/samples/target/classes/sample/groovy/sample/groovy
    [copy] Copying 1 file to /export/home/illsleyd/continuum/continuum-1.0.3/apps/continuum/working-directory/1/modules/samples/target/classes/sample/groovy/sample/groovy
    [copy] Copying 1 file to /export/home/illsleyd/continuum/continuum-1.0.3/apps/continuum/working-directory/1/modules/samples/target/classes/sample/groovy/META-INF
    [delete] Deleting: /export/home/illsleyd/continuum/continuum-1.0.3/apps/continuum/working-directory/1/modules/samples/target/classes/sample/groovy/GroovyReceiver.class
    [copy] Copying 1 file to /export/home/illsleyd/continuum/continuum-1.0.3/apps/continuum/working-directory/1/modules/samples/target/classes/sample/groovy/lib
    [jar] Building jar: /export/home/illsleyd/continuum/continuum-1.0.3/apps/continuum/working-directory/1/modules/samples/target/groovy/groovyService.aar



jar:jar:
    [jar] Building jar: /export/home/illsleyd/continuum/continuum-1.0.3/apps/continuum/working-directory/1/modules/samples/target/axis2-samples-SNAPSHOT.jar

jar:install:
    [echo] Installing...
Uploading to org.apache.axis2/jars/axis2-samples-SNAPSHOT.jar: 
.................... (1623K)
Uploading to org.apache.axis2/poms/axis2-samples-SNAPSHOT.pom: 
.................... (16K)

+----------------------------------------
| Executing multiproject:install-callback Apache Axis 2.0 - spring
| Memory: 49M/60M
+----------------------------------------
DEPRECATED: the default goal should be specified in the <build> section of project.xml instead of maven.xml
DEPRECATED: the default goal should be specified in the <build> section of project.xml instead of maven.xml

build:end:

build:start:

multiproject:install-callback:
    [echo] Running jar:install for Apache Axis 2.0 - spring
java:prepare-filesystem:
    [mkdir] Created dir: /export/home/illsleyd/continuum/continuum-1.0.3/apps/continuum/working-directory/1/modules/spring/target/classes
Running post goal: java:prepare-filesystem

java:compile:
    [echo] Compiling to /export/home/illsleyd/continuum/continuum-1.0.3/apps/continuum/working-directory/1/modules/spring/target/classes
    [javac] Compiling 3 source files to /export/home/illsleyd/continuum/continuum-1.0.3/apps/continuum/working-directory/1/modules/spring/target/classes

java:jar-resources:
Copying 2 files to /export/home/illsleyd/continuum/continuum-1.0.3/apps/continuum/working-directory/1/modules/spring/target/classes/META-INF

test:test:
    [echo] No tests to run.

jar:jar:
    [jar] Building jar: /export/home/illsleyd/continuum/continuum-1.0.3/apps/continuum/working-directory/1/modules/spring/target/axis2-spring-SNAPSHOT.jar

jar:install:
    [echo] Installing...
Uploading to org.apache.axis2/jars/axis2-spring-SNAPSHOT.jar: 
.................... (9K)
Uploading to org.apache.axis2/poms/axis2-spring-SNAPSHOT.pom: 
.................... (14K)

+----------------------------------------
| Executing multiproject:install-callback Apache Axis 2.0 - XMLBeans Data Binding
| Memory: 46M/60M
+----------------------------------------
DEPRECATED: the default goal should be specified in the <build> section of project.xml instead of maven.xml
DEPRECATED: the default goal should be specified in the <build> section of project.xml instead of maven.xml

build:end:

build:start:

multiproject:install-callback:
    [echo] Running jar:install for Apache Axis 2.0 - XMLBeans Data Binding
java:prepare-filesystem:
    [mkdir] Created dir: /export/home/illsleyd/continuum/continuum-1.0.3/apps/continuum/working-directory/1/modules/xmlbeans/target/classes
Running post goal: java:prepare-filesystem

java:compile:
    [echo] Compiling to /export/home/illsleyd/continuum/continuum-1.0.3/apps/continuum/working-directory/1/modules/xmlbeans/target/classes
    [javac] Compiling 2 source files to /export/home/illsleyd/continuum/continuum-1.0.3/apps/continuum/working-directory/1/modules/xmlbeans/target/classes

java:jar-resources:
Copying 1 file to /export/home/illsleyd/continuum/continuum-1.0.3/apps/continuum/working-directory/1/modules/xmlbeans/target/classes
Copying 2 files to /export/home/illsleyd/continuum/continuum-1.0.3/apps/continuum/working-directory/1/modules/xmlbeans/target/classes/META-INF

test:test:
java:prepare-filesystem:
Running post goal: java:prepare-filesystem

java:compile:
    [echo] Compiling to /export/home/illsleyd/continuum/continuum-1.0.3/apps/continuum/working-directory/1/modules/xmlbeans/target/classes

java:jar-resources:

test:prepare-filesystem:
    [mkdir] Created dir: /export/home/illsleyd/continuum/continuum-1.0.3/apps/continuum/working-directory/1/modules/xmlbeans/target/test-classes
    [mkdir] Created dir: /export/home/illsleyd/continuum/continuum-1.0.3/apps/continuum/working-directory/1/modules/xmlbeans/target/test-reports

test:test-resources:
Copying 23 files to /export/home/illsleyd/continuum/continuum-1.0.3/apps/continuum/working-directory/1/modules/xmlbeans/target/test-classes
Copying 1 file to /export/home/illsleyd/continuum/continuum-1.0.3/apps/continuum/working-directory/1/modules/xmlbeans/target/test-classes

test:compile:
    [javac] Compiling 16 source files to /export/home/illsleyd/continuum/continuum-1.0.3/apps/continuum/working-directory/1/modules/xmlbeans/target/test-classes

    [junit] Running org.apache.axis2.xmlbeans.WSDL2Java10Test
    [junit] Tests run: 1, Failures: 0, Errors: 0, Time elapsed: 15.051 sec
    [junit] Running org.apache.axis2.xmlbeans.WSDL2Java11Test
    [junit] Tests run: 1, Failures: 0, Errors: 0, Time elapsed: 15.621 sec
    [junit] Running org.apache.axis2.xmlbeans.WSDL2Java12Test
    [junit] Tests run: 1, Failures: 0, Errors: 0, Time elapsed: 3.938 sec
    [junit] Running org.apache.axis2.xmlbeans.WSDL2Java13Test
    [junit] Tests run: 1, Failures: 0, Errors: 0, Time elapsed: 0.719 sec
    [junit] Running org.apache.axis2.xmlbeans.WSDL2Java1Test
    [junit] Tests run: 1, Failures: 0, Errors: 0, Time elapsed: 16.968 sec
    [junit] Running org.apache.axis2.xmlbeans.WSDL2Java2Test
    [junit] Tests run: 1, Failures: 0, Errors: 0, Time elapsed: 0.686 sec
    [junit] Running org.apache.axis2.xmlbeans.WSDL2Java3Test
    [junit] Tests run: 1, Failures: 0, Errors: 0, Time elapsed: 15.402 sec
    [junit] Running org.apache.axis2.xmlbeans.WSDL2Java4Test
    [junit] Tests run: 1, Failures: 0, Errors: 0, Time elapsed: 28.003 sec
    [junit] Running org.apache.axis2.xmlbeans.WSDL2Java5Test
    [junit] Tests run: 1, Failures: 0, Errors: 0, Time elapsed: 19.146 sec
    [junit] Running org.apache.axis2.xmlbeans.WSDL2Java6Test
    [junit] Tests run: 1, Failures: 0, Errors: 0, Time elapsed: 16.742 sec
    [junit] Running org.apache.axis2.xmlbeans.WSDL2Java7Test
    [junit] Tests run: 1, Failures: 0, Errors: 0, Time elapsed: 15.079 sec
    [junit] Running org.apache.axis2.xmlbeans.WSDL2Java8Test
    [junit] Tests run: 1, Failures: 0, Errors: 0, Time elapsed: 18.62 sec
    [junit] Running org.apache.axis2.xmlbeans.WSDL2Java9Test
    [junit] Tests run: 1, Failures: 0, Errors: 0, Time elapsed: 17.461 sec

jar:jar:
    [jar] Building jar: /export/home/illsleyd/continuum/continuum-1.0.3/apps/continuum/working-directory/1/modules/xmlbeans/target/axis2-xmlbeans-SNAPSHOT.jar

jar:install:
    [echo] Installing...
Uploading to org.apache.axis2/jars/axis2-xmlbeans-SNAPSHOT.jar: 
.................... (22K)
Uploading to org.apache.axis2/poms/axis2-xmlbeans-SNAPSHOT.pom: 
.................... (15K)

+----------------------------------------
| Executing multiproject:install-callback Apache Axis 2.0 - Tools
| Memory: 34M/60M
+----------------------------------------
DEPRECATED: the default goal should be specified in the <build> section of project.xml instead of maven.xml
DEPRECATED: the default goal should be specified in the <build> section of project.xml instead of maven.xml

build:end:

build:start:

multiproject:install-callback:
    [echo] Running jar:install for Apache Axis 2.0 - Tools
java:prepare-filesystem:
    [mkdir] Created dir: /export/home/illsleyd/continuum/continuum-1.0.3/apps/continuum/working-directory/1/modules/tool/target/classes
Running post goal: java:prepare-filesystem

java:compile:
    [echo] Compiling to /export/home/illsleyd/continuum/continuum-1.0.3/apps/continuum/working-directory/1/modules/tool/target/classes
    [javac] Compiling 1 source file to /export/home/illsleyd/continuum/continuum-1.0.3/apps/continuum/working-directory/1/modules/tool/target/classes

java:jar-resources:
Copying 2 files to /export/home/illsleyd/continuum/continuum-1.0.3/apps/continuum/working-directory/1/modules/tool/target/classes
Copying 2 files to /export/home/illsleyd/continuum/continuum-1.0.3/apps/continuum/working-directory/1/modules/tool/target/classes/META-INF

test:test:
    [echo] No tests to run.

jar:jar:
    [jar] Building jar: /export/home/illsleyd/continuum/continuum-1.0.3/apps/continuum/working-directory/1/modules/tool/target/axis2-tools-SNAPSHOT.jar

jar:install:
    [echo] Installing...
Uploading to org.apache.axis2/jars/axis2-tools-SNAPSHOT.jar: 
.................... (9K)
Uploading to org.apache.axis2/poms/axis2-tools-SNAPSHOT.pom: 
.................... (13K)

+----------------------------------------
| Executing multiproject:install-callback Apache Axis 2.0 - Integration
| Memory: 30M/60M
+----------------------------------------
DEPRECATED: the default goal should be specified in the <build> section of project.xml instead of maven.xml
DEPRECATED: the default goal should be specified in the <build> section of project.xml instead of maven.xml

build:end:

Trying to get missing/snapshot dependencies required by Apache Axis 2.0 - Integration:
Attempting to download axis2-adb-codegen-SNAPSHOT.jar.
4/121K
8/121K
12/121K
16/121K
20/121K
24/121K
28/121K
32/121K
35/121K
39/121K
43/121K
47/121K
51/121K
55/121K
59/121K
63/121K
67/121K
71/121K
75/121K
79/121K
83/121K
87/121K
91/121K
95/121K
99/121K
103/121K
107/121K
111/121K
115/121K
119/121K
121/121K
121K downloaded
Error retrieving artifact from [http://people.apache.org/repo/m1-snapshot-repository/]: org.apache.maven.verifier.ChecksumVerificationException: Error retrieving checksum file for /org.apache.axis2/jars/axis2-adb-codegen-SNAPSHOT.jar
Skipping download as local copy is up to date!
Attempting to download axis2-samples-SNAPSHOT.jar.
4/1623K
8/1623K
12/1623K
16/1623K
20/1623K
24/1623K
28/1623K
32/1623K
35/1623K
39/1623K
43/1623K
46/1623K
50/1623K
53/1623K
57/1623K
61/1623K
65/1623K
68/1623K
72/1623K
75/1623K
79/1623K
82/1623K
86/1623K
90/1623K
94/1623K
98/1623K
102/1623K
103/1623K
107/1623K
110/1623K
114/1623K
118/1623K
122/1623K
125/1623K
129/1623K
132/1623K
136/1623K
139/1623K
143/1623K
146/1623K
150/1623K
153/1623K
157/1623K
160/1623K
164/1623K
167/1623K
171/1623K
175/1623K
179/1623K
182/1623K
186/1623K
190/1623K
194/1623K
196/1623K
200/1623K
203/1623K
207/1623K
210/1623K
214/1623K
217/1623K
221/1623K
224/1623K
228/1623K
232/1623K
236/1623K
239/1623K
243/1623K
246/1623K
250/1623K
253/1623K
257/1623K
260/1623K
264/1623K
267/1623K
271/1623K
274/1623K
278/1623K
282/1623K
286/1623K
289/1623K
293/1623K
296/1623K
300/1623K
303/1623K
307/1623K
310/1623K
314/1623K
317/1623K
321/1623K
324/1623K
328/1623K
331/1623K
335/1623K
339/1623K
343/1623K
346/1623K
350/1623K
353/1623K
357/1623K
360/1623K
364/1623K
367/1623K
371/1623K
374/1623K
378/1623K
381/1623K
385/1623K
388/1623K
392/1623K
396/1623K
400/1623K
403/1623K
407/1623K
410/1623K
414/1623K
417/1623K
421/1623K
424/1623K
428/1623K
432/1623K
436/1623K
440/1623K
444/1623K
445/1623K
449/1623K
453/1623K
457/1623K
460/1623K
464/1623K
467/1623K
471/1623K
474/1623K
478/1623K
481/1623K
485/1623K
488/1623K
492/1623K
495/1623K
499/1623K
503/1623K
507/1623K
510/1623K
514/1623K
517/1623K
521/1623K
524/1623K
528/1623K
531/1623K
535/1623K
538/1623K
542/1623K
545/1623K
549/1623K
552/1623K
556/1623K
560/1623K
564/1623K
567/1623K
571/1623K
574/1623K
578/1623K
581/1623K
585/1623K
588/1623K
592/1623K
595/1623K
599/1623K
602/1623K
606/1623K
609/1623K
613/1623K
617/1623K
621/1623K
624/1623K
628/1623K
631/1623K
635/1623K
638/1623K
642/1623K
645/1623K
649/1623K
652/1623K
656/1623K
659/1623K
663/1623K
666/1623K
670/1623K
674/1623K
678/1623K
681/1623K
685/1623K
688/1623K
692/1623K
695/1623K
699/1623K
702/1623K
706/1623K
709/1623K
713/1623K
716/1623K
720/1623K
724/1623K
728/1623K
731/1623K
735/1623K
738/1623K
742/1623K
745/1623K
749/1623K
752/1623K
756/1623K
759/1623K
763/1623K
766/1623K
770/1623K
773/1623K
777/1623K
781/1623K
785/1623K
788/1623K
792/1623K
795/1623K
799/1623K
802/1623K
806/1623K
809/1623K
813/1623K
816/1623K
820/1623K
823/1623K
827/1623K
830/1623K
834/1623K
838/1623K
842/1623K
845/1623K
849/1623K
852/1623K
856/1623K
859/1623K
863/1623K
866/1623K
870/1623K
873/1623K
877/1623K
880/1623K
884/1623K
887/1623K
891/1623K
895/1623K
899/1623K
902/1623K
906/1623K
909/1623K
913/1623K
916/1623K
920/1623K
923/1623K
927/1623K
930/1623K
934/1623K
937/1623K
941/1623K
945/1623K
949/1623K
952/1623K
956/1623K
959/1623K
963/1623K
967/1623K
968/1623K
972/1623K
975/1623K
979/1623K
982/1623K
986/1623K
988/1623K
992/1623K
995/1623K
999/1623K
1002/1623K
1006/1623K
1009/1623K
1013/1623K
1016/1623K
1020/1623K
1023/1623K
1027/1623K
1030/1623K
1034/1623K
1038/1623K
1042/1623K
1046/1623K
1050/1623K
1054/1623K
1058/1623K
1062/1623K
1066/1623K
1070/1623K
1074/1623K
1076/1623K
1080/1623K
1083/1623K
1087/1623K
1090/1623K
1094/1623K
1097/1623K
1101/1623K
1104/1623K
1108/1623K
1111/1623K
1115/1623K
1118/1623K
1122/1623K
1124/1623K
1128/1623K
1131/1623K
1135/1623K
1138/1623K
1142/1623K
1144/1623K
1148/1623K
1152/1623K
1156/1623K
1159/1623K
1163/1623K
1166/1623K
1170/1623K
1173/1623K
1177/1623K
1180/1623K
1184/1623K
1187/1623K
1191/1623K
1194/1623K
1198/1623K
1200/1623K
1204/1623K
1207/1623K
1211/1623K
1214/1623K
1218/1623K
1220/1623K
1224/1623K
1228/1623K
1232/1623K
1235/1623K
1239/1623K
1242/1623K
1246/1623K
1248/1623K
1252/1623K
1256/1623K
1260/1623K
1263/1623K
1267/1623K
1268/1623K
1272/1623K
1276/1623K
1280/1623K
1284/1623K
1288/1623K
1291/1623K
1295/1623K
1298/1623K
1302/1623K
1304/1623K
1308/1623K
1312/1623K
1316/1623K
1319/1623K
1323/1623K
1324/1623K
1328/1623K
1332/1623K
1336/1623K
1340/1623K
1344/1623K
1347/1623K
1351/1623K
1354/1623K
1358/1623K
1360/1623K
1364/1623K
1368/1623K
1372/1623K
1375/1623K
1379/1623K
1380/1623K
1384/1623K
1388/1623K
1392/1623K
1396/1623K
1400/1623K
1403/1623K
1407/1623K
1408/1623K
1412/1623K
1416/1623K
1420/1623K
1424/1623K
1428/1623K
1431/1623K
1435/1623K
1436/1623K
1440/1623K
1444/1623K
1448/1623K
1452/1623K
1456/1623K
1459/1623K
1463/1623K
1464/1623K
1468/1623K
1472/1623K
1476/1623K
1480/1623K
1484/1623K
1487/1623K
1491/1623K
1492/1623K
1496/1623K
1500/1623K
1504/1623K
1508/1623K
1512/1623K
1516/1623K
1520/1623K
1524/1623K
1528/1623K
1532/1623K
1536/1623K
1540/1623K
1544/1623K
1548/1623K
1552/1623K
1556/1623K
1560/1623K
1564/1623K
1568/1623K
1572/1623K
1576/1623K
1580/1623K
1584/1623K
1588/1623K
1592/1623K
1596/1623K
1600/1623K
1604/1623K
1608/1623K
1612/1623K
1616/1623K
1620/1623K
1623/1623K
1623K downloaded
Error retrieving artifact from [http://people.apache.org/repo/m1-snapshot-repository/]: org.apache.maven.verifier.ChecksumVerificationException: Error retrieving checksum file for /org.apache.axis2/jars/axis2-samples-SNAPSHOT.jar
Skipping download as local copy is up to date!
Attempting to download axis2-spring-SNAPSHOT.jar.
4/9K
8/9K
9/9K
9K downloaded
Error retrieving artifact from [http://people.apache.org/repo/m1-snapshot-repository/]: org.apache.maven.verifier.ChecksumVerificationException: Error retrieving checksum file for /org.apache.axis2/jars/axis2-spring-SNAPSHOT.jar
Skipping download as local copy is up to date!
Attempting to download axis2-xmlbeans-SNAPSHOT.jar.
Skipping download as local copy is up to date!
Attempting to download axis2-tools-SNAPSHOT.jar.
Skipping download as local copy is up to date!
build:start:

multiproject:install-callback:
    [echo] Running jar:install for Apache Axis 2.0 - Integration
java:prepare-filesystem:
    [mkdir] Created dir: /export/home/illsleyd/continuum/continuum-1.0.3/apps/continuum/working-directory/1/modules/integration/target/classes
Running post goal: java:prepare-filesystem

java:compile:
    [echo] Compiling to /export/home/illsleyd/continuum/continuum-1.0.3/apps/continuum/working-directory/1/modules/integration/target/classes
    [javac] Compiling 136 source files to /export/home/illsleyd/continuum/continuum-1.0.3/apps/continuum/working-directory/1/modules/integration/target/classes
    [javac] Note: /export/home/illsleyd/continuum/continuum-1.0.3/apps/continuum/working-directory/1/modules/integration/src/test/soap12testing/client/SOAPComparator.java uses or overrides a deprecated API.
    [javac] Note: Recompile with -Xlint:deprecation for details.

java:jar-resources:
Copying 1 file to /export/home/illsleyd/continuum/continuum-1.0.3/apps/continuum/working-directory/1/modules/integration/target/classes
Copying 2 files to /export/home/illsleyd/continuum/continuum-1.0.3/apps/continuum/working-directory/1/modules/integration/target/classes/META-INF

test:test:
java:prepare-filesystem:
Running post goal: java:prepare-filesystem

java:compile:
    [echo] Compiling to /export/home/illsleyd/continuum/continuum-1.0.3/apps/continuum/working-directory/1/modules/integration/target/classes
    [javac] Compiling 10 source files to /export/home/illsleyd/continuum/continuum-1.0.3/apps/continuum/working-directory/1/modules/integration/target/classes

java:jar-resources:

test:prepare-filesystem:
    [mkdir] Created dir: /export/home/illsleyd/continuum/continuum-1.0.3/apps/continuum/working-directory/1/modules/integration/target/test-classes
    [mkdir] Created dir: /export/home/illsleyd/continuum/continuum-1.0.3/apps/continuum/working-directory/1/modules/integration/target/test-reports

test:test-resources:
Copying 150 files to /export/home/illsleyd/continuum/continuum-1.0.3/apps/continuum/working-directory/1/modules/integration/target/test-classes

test:compile:
    [copy] Copying 1 file to /export/home/illsleyd/continuum/continuum-1.0.3/apps/continuum/working-directory/1/modules/integration/target/test-classes/modules
    [mkdir] Created dir: /export/home/illsleyd/continuum/continuum-1.0.3/apps/continuum/working-directory/1/modules/integration/target/wsdl
    [echo] Compiling DocumentUnwrappingTest.wsdl 
    [mkdir] Created dir: /export/home/illsleyd/continuum/continuum-1.0.3/apps/continuum/working-directory/1/modules/integration/target/wsdl/documentunwrapping
    [java] log4j:WARN No appenders could be found for logger (org.apache.axis2.description.AxisService).
    [java] log4j:WARN Please initialize the log4j system properly.
    [mkdir] Created dir: /export/home/illsleyd/continuum/continuum-1.0.3/apps/continuum/working-directory/1/modules/integration/target/wsdl/documentunwrapping/build
    [mkdir] Created dir: /export/home/illsleyd/continuum/continuum-1.0.3/apps/continuum/working-directory/1/modules/integration/target/wsdl/documentunwrapping/build/classes
    [mkdir] Created dir: /export/home/illsleyd/continuum/continuum-1.0.3/apps/continuum/working-directory/1/modules/integration/target/wsdl/documentunwrapping/build/lib
    [echo] Stax Availability= true
    [echo] Axis2 Availability= true
    [javac] Compiling 26 source files to /export/home/illsleyd/continuum/continuum-1.0.3/apps/continuum/working-directory/1/modules/integration/target/wsdl/documentunwrapping/build/classes
    [javac] Note: Some input files use unchecked or unsafe operations.
    [javac] Note: Recompile with -Xlint:unchecked for details.
    [copy] Copying 2 files to /export/home/illsleyd/continuum/continuum-1.0.3/apps/continuum/working-directory/1/modules/integration/target/wsdl/documentunwrapping/build/classes/META-INF
    [jar] Building jar: /export/home/illsleyd/continuum/continuum-1.0.3/apps/continuum/working-directory/1/modules/integration/target/wsdl/documentunwrapping/build/lib/DocumentUnwrappingTestService.aar
    [echo] Compiling RPCUnwrappingTest.wsdl 
    [mkdir] Created dir: /export/home/illsleyd/continuum/continuum-1.0.3/apps/continuum/working-directory/1/modules/integration/target/wsdl/rpcunwrapping
    [java] log4j:WARN No appenders could be found for logger (org.apache.axis2.description.AxisService).
    [java] log4j:WARN Please initialize the log4j system properly.
    [mkdir] Created dir: /export/home/illsleyd/continuum/continuum-1.0.3/apps/continuum/working-directory/1/modules/integration/target/wsdl/rpcunwrapping/build
    [mkdir] Created dir: /export/home/illsleyd/continuum/continuum-1.0.3/apps/continuum/working-directory/1/modules/integration/target/wsdl/rpcunwrapping/build/classes
    [mkdir] Created dir: /export/home/illsleyd/continuum/continuum-1.0.3/apps/continuum/working-directory/1/modules/integration/target/wsdl/rpcunwrapping/build/lib
    [echo] Stax Availability= true
    [echo] Axis2 Availability= true
    [javac] Compiling 20 source files to /export/home/illsleyd/continuum/continuum-1.0.3/apps/continuum/working-directory/1/modules/integration/target/wsdl/rpcunwrapping/build/classes
    [javac] Note: Some input files use unchecked or unsafe operations.
    [javac] Note: Recompile with -Xlint:unchecked for details.
    [copy] Copying 2 files to /export/home/illsleyd/continuum/continuum-1.0.3/apps/continuum/working-directory/1/modules/integration/target/wsdl/rpcunwrapping/build/classes/META-INF
    [jar] Building jar: /export/home/illsleyd/continuum/continuum-1.0.3/apps/continuum/working-directory/1/modules/integration/target/wsdl/rpcunwrapping/build/lib/RPCUnwrappingServiceTest.aar
    [java] log4j:WARN No appenders could be found for logger (org.apache.axis2.description.AxisService).
    [java] log4j:WARN Please initialize the log4j system properly.
    [copy] Copying 1 file to /export/home/illsleyd/continuum/continuum-1.0.3/apps/continuum/working-directory/1/modules/integration/target/perf/src/samples/wsdl/perf
    [mkdir] Created dir: /export/home/illsleyd/continuum/continuum-1.0.3/apps/continuum/working-directory/1/modules/integration/target/perf/build
    [mkdir] Created dir: /export/home/illsleyd/continuum/continuum-1.0.3/apps/continuum/working-directory/1/modules/integration/target/perf/build/classes
    [mkdir] Created dir: /export/home/illsleyd/continuum/continuum-1.0.3/apps/continuum/working-directory/1/modules/integration/target/perf/build/lib
    [jar] Building jar: /export/home/illsleyd/continuum/continuum-1.0.3/apps/continuum/working-directory/1/modules/integration/target/perf/build/lib/XBeans-packaged.jar
    [echo] XmlBeans Availability = true
    [echo] Stax Availability= true
    [echo] Axis2 Availability= true
    [javac] Compiling 211 source files to /export/home/illsleyd/continuum/continuum-1.0.3/apps/continuum/working-directory/1/modules/integration/target/perf/build/classes
    [javac] Note: Some input files use or override a deprecated API.
    [javac] Note: Recompile with -Xlint:deprecation for details.
    [javac] Note: Some input files use unchecked or unsafe operations.
    [javac] Note: Recompile with -Xlint:unchecked for details.
    [copy] Copying 2 files to /export/home/illsleyd/continuum/continuum-1.0.3/apps/continuum/working-directory/1/modules/integration/target/perf/build/classes/META-INF
    [copy] Copying 1 file to /export/home/illsleyd/continuum/continuum-1.0.3/apps/continuum/working-directory/1/modules/integration/target/perf/build/classes/lib
    [jar] Building jar: /export/home/illsleyd/continuum/continuum-1.0.3/apps/continuum/working-directory/1/modules/integration/target/perf/build/lib/PerfPortType.aar
    [mkdir] Created dir: /export/home/illsleyd/continuum/continuum-1.0.3/apps/continuum/working-directory/1/modules/integration/target/perf/build/repo
    [mkdir] Created dir: /export/home/illsleyd/continuum/continuum-1.0.3/apps/continuum/working-directory/1/modules/integration/target/perf/build/repo/services
    [copy] Copying 1 file to /export/home/illsleyd/continuum/continuum-1.0.3/apps/continuum/working-directory/1/modules/integration/target/perf/build/repo/services
    [echo] XmlBeans Availability = true
    [echo] Stax Availability= true
    [echo] Axis2 Availability= true
    [javac] Compiling 1 source file to /export/home/illsleyd/continuum/continuum-1.0.3/apps/continuum/working-directory/1/modules/integration/target/perf/build/classes
    [javac] /export/home/illsleyd/continuum/continuum-1.0.3/apps/continuum/working-directory/1/modules/integration/target/perf/test/samples/wsdl/perf/PerfPortTypeTest.java:46: warning: non-varargs call of varargs method with inexact argument type for last parameter;
    [javac] cast to java.lang.Class for a varargs call
    [javac] cast to java.lang.Class[] for a non-varargs call and to suppress this warning
    [javac]                             creatorMethod = declaredClass.getMethod("newInstance",null);
    [javac]                                                                                   ^
    [javac] /export/home/illsleyd/continuum/continuum-1.0.3/apps/continuum/working-directory/1/modules/integration/target/perf/test/samples/wsdl/perf/PerfPortTypeTest.java:53: warning: non-varargs call of varargs method with inexact argument type for last parameter;
    [javac] cast to java.lang.Object for a varargs call
    [javac] cast to java.lang.Object[] for a non-varargs call and to suppress this warning
    [javac]                     return  (org.apache.xmlbeans.XmlObject)creatorMethod.invoke(null,null);
    [javac]                                                                                      ^
    [javac] 2 warnings
    [jar] Building jar: /export/home/illsleyd/continuum/continuum-1.0.3/apps/continuum/working-directory/1/modules/integration/target/perf/build/lib/PerfPortType-test-client.jar
    [move] Moving 1 file to /export/home/illsleyd/continuum/continuum-1.0.3/apps/continuum/working-directory/1/modules/integration/target/perf/build/lib
    [move] Moving 1 file to /export/home/illsleyd/continuum/continuum-1.0.3/apps/continuum/working-directory/1/modules/integration/target/perf/build/lib
    [java] log4j:WARN No appenders could be found for logger (org.apache.axis2.description.AxisService).
    [java] log4j:WARN Please initialize the log4j system properly.
    [copy] Copying 1 file to /export/home/illsleyd/continuum/continuum-1.0.3/apps/continuum/working-directory/1/modules/integration/target/perf2/src/samples/wsdl/perf2
    [mkdir] Created dir: /export/home/illsleyd/continuum/continuum-1.0.3/apps/continuum/working-directory/1/modules/integration/target/perf2/build
    [mkdir] Created dir: /export/home/illsleyd/continuum/continuum-1.0.3/apps/continuum/working-directory/1/modules/integration/target/perf2/build/classes
    [mkdir] Created dir: /export/home/illsleyd/continuum/continuum-1.0.3/apps/continuum/working-directory/1/modules/integration/target/perf2/build/lib
    [echo] Stax Availability= true
    [echo] Axis2 Availability= true
    [javac] Compiling 6 source files to /export/home/illsleyd/continuum/continuum-1.0.3/apps/continuum/working-directory/1/modules/integration/target/perf2/build/classes
    [javac] Note: Some input files use unchecked or unsafe operations.
    [javac] Note: Recompile with -Xlint:unchecked for details.
    [copy] Copying 2 files to /export/home/illsleyd/continuum/continuum-1.0.3/apps/continuum/working-directory/1/modules/integration/target/perf2/build/classes/META-INF
    [jar] Building jar: /export/home/illsleyd/continuum/continuum-1.0.3/apps/continuum/working-directory/1/modules/integration/target/perf2/build/lib/PerfPortType.aar
    [mkdir] Created dir: /export/home/illsleyd/continuum/continuum-1.0.3/apps/continuum/working-directory/1/modules/integration/target/perf2/build/repo
    [mkdir] Created dir: /export/home/illsleyd/continuum/continuum-1.0.3/apps/continuum/working-directory/1/modules/integration/target/perf2/build/repo/services
    [copy] Copying 1 file to /export/home/illsleyd/continuum/continuum-1.0.3/apps/continuum/working-directory/1/modules/integration/target/perf2/build/repo/services
    [echo] Stax Availability= true
    [echo] Axis2 Availability= true
    [javac] Compiling 1 source file to /export/home/illsleyd/continuum/continuum-1.0.3/apps/continuum/working-directory/1/modules/integration/target/perf2/build/classes
    [jar] Building jar: /export/home/illsleyd/continuum/continuum-1.0.3/apps/continuum/working-directory/1/modules/integration/target/perf2/build/lib/PerfPortType-test-client.jar
    [move] Moving 1 file to /export/home/illsleyd/continuum/continuum-1.0.3/apps/continuum/working-directory/1/modules/integration/target/perf2/build/lib
    [java] Time to build schema type system: 1.824 seconds
    [java] Time to generate code: 1.294 seconds
    [java] Time to compile code: 7.901 seconds
    [echo] Running codegen RPC WSDLs - take 1
    [java] log4j:WARN No appenders could be found for logger (org.apache.axis2.description.AxisService).
    [java] log4j:WARN Please initialize the log4j system properly.
    [mkdir] Created dir: /export/home/illsleyd/continuum/continuum-1.0.3/apps/continuum/working-directory/1/modules/integration/target/rpc-test1/build
    [mkdir] Created dir: /export/home/illsleyd/continuum/continuum-1.0.3/apps/continuum/working-directory/1/modules/integration/target/rpc-test1/build/classes
    [mkdir] Created dir: /export/home/illsleyd/continuum/continuum-1.0.3/apps/continuum/working-directory/1/modules/integration/target/rpc-test1/build/lib
    [mkdir] Created dir: /export/home/illsleyd/continuum/continuum-1.0.3/apps/continuum/working-directory/1/modules/integration/target/rpc-test1/test
    [echo] Stax Availability= true
    [echo] Axis2 Availability= true
    [javac] Compiling 2 source files to /export/home/illsleyd/continuum/continuum-1.0.3/apps/continuum/working-directory/1/modules/integration/target/rpc-test1/build/classes
    [javac] Note: /export/home/illsleyd/continuum/continuum-1.0.3/apps/continuum/working-directory/1/modules/integration/target/rpc-test1/src/com/example/www/ServiceNameStub.java uses unchecked or unsafe operations.
    [javac] Note: Recompile with -Xlint:unchecked for details.
    [jar] Building jar: /export/home/illsleyd/continuum/continuum-1.0.3/apps/continuum/working-directory/1/modules/integration/target/rpc-test1/build/lib/ServiceName-test-client.jar
    [echo] Running codegen RPC WSDLs - take 2
    [java] log4j:WARN No appenders could be found for logger (org.apache.axis2.description.AxisService).
    [java] log4j:WARN Please initialize the log4j system properly.
    [mkdir] Created dir: /export/home/illsleyd/continuum/continuum-1.0.3/apps/continuum/working-directory/1/modules/integration/target/rpc-test2/build
    [mkdir] Created dir: /export/home/illsleyd/continuum/continuum-1.0.3/apps/continuum/working-directory/1/modules/integration/target/rpc-test2/build/classes
    [mkdir] Created dir: /export/home/illsleyd/continuum/continuum-1.0.3/apps/continuum/working-directory/1/modules/integration/target/rpc-test2/build/lib
    [mkdir] Created dir: /export/home/illsleyd/continuum/continuum-1.0.3/apps/continuum/working-directory/1/modules/integration/target/rpc-test2/test
    [echo] Stax Availability= true
    [echo] Axis2 Availability= true
    [javac] Compiling 2 source files to /export/home/illsleyd/continuum/continuum-1.0.3/apps/continuum/working-directory/1/modules/integration/target/rpc-test2/build/classes
    [javac] Note: /export/home/illsleyd/continuum/continuum-1.0.3/apps/continuum/working-directory/1/modules/integration/target/rpc-test2/src/com/example/www/ServiceNameStub.java uses unchecked or unsafe operations.
    [javac] Note: Recompile with -Xlint:unchecked for details.
    [jar] Building jar: /export/home/illsleyd/continuum/continuum-1.0.3/apps/continuum/working-directory/1/modules/integration/target/rpc-test2/build/lib/ServiceName-test-client.jar
    [echo] Running codegen RPC WSDLs - take 3
    [java] log4j:WARN No appenders could be found for logger (org.apache.axis2.description.AxisService).
    [java] log4j:WARN Please initialize the log4j system properly.
    [mkdir] Created dir: /export/home/illsleyd/continuum/continuum-1.0.3/apps/continuum/working-directory/1/modules/integration/target/rpc-test3/build
    [mkdir] Created dir: /export/home/illsleyd/continuum/continuum-1.0.3/apps/continuum/working-directory/1/modules/integration/target/rpc-test3/build/classes
    [mkdir] Created dir: /export/home/illsleyd/continuum/continuum-1.0.3/apps/continuum/working-directory/1/modules/integration/target/rpc-test3/build/lib
    [mkdir] Created dir: /export/home/illsleyd/continuum/continuum-1.0.3/apps/continuum/working-directory/1/modules/integration/target/rpc-test3/test
    [jar] Building jar: /export/home/illsleyd/continuum/continuum-1.0.3/apps/continuum/working-directory/1/modules/integration/target/rpc-test3/build/lib/XBeans-packaged.jar
    [echo] XmlBeans Availability = true
    [echo] Stax Availability= true
    [echo] Axis2 Availability= true
    [javac] Compiling 210 source files to /export/home/illsleyd/continuum/continuum-1.0.3/apps/continuum/working-directory/1/modules/integration/target/rpc-test3/build/classes
    [javac] Note: Some input files use or override a deprecated API.
    [javac] Note: Recompile with -Xlint:deprecation for details.
    [javac] Note: /export/home/illsleyd/continuum/continuum-1.0.3/apps/continuum/working-directory/1/modules/integration/target/rpc-test3/src/com/example/www/ServiceNameStub.java uses unchecked or unsafe operations.
    [javac] Note: Recompile with -Xlint:unchecked for details.
    [jar] Building jar: /export/home/illsleyd/continuum/continuum-1.0.3/apps/continuum/working-directory/1/modules/integration/target/rpc-test3/build/lib/ServiceName-test-client.jar
    [echo] Running codegen RPC WSDLs - take 4
    [java] log4j:WARN No appenders could be found for logger (org.apache.axis2.description.AxisService).
    [java] log4j:WARN Please initialize the log4j system properly.
    [mkdir] Created dir: /export/home/illsleyd/continuum/continuum-1.0.3/apps/continuum/working-directory/1/modules/integration/target/rpc-test4/build
    [mkdir] Created dir: /export/home/illsleyd/continuum/continuum-1.0.3/apps/continuum/working-directory/1/modules/integration/target/rpc-test4/build/classes
    [mkdir] Created dir: /export/home/illsleyd/continuum/continuum-1.0.3/apps/continuum/working-directory/1/modules/integration/target/rpc-test4/build/lib
    [mkdir] Created dir: /export/home/illsleyd/continuum/continuum-1.0.3/apps/continuum/working-directory/1/modules/integration/target/rpc-test4/test
    [jar] Building jar: /export/home/illsleyd/continuum/continuum-1.0.3/apps/continuum/working-directory/1/modules/integration/target/rpc-test4/build/lib/XBeans-packaged.jar
    [echo] XmlBeans Availability = true
    [echo] Stax Availability= true
    [echo] Axis2 Availability= true
    [javac] Compiling 210 source files to /export/home/illsleyd/continuum/continuum-1.0.3/apps/continuum/working-directory/1/modules/integration/target/rpc-test4/build/classes
    [javac] Note: Some input files use or override a deprecated API.
    [javac] Note: Recompile with -Xlint:deprecation for details.
    [javac] Note: /export/home/illsleyd/continuum/continuum-1.0.3/apps/continuum/working-directory/1/modules/integration/target/rpc-test4/src/com/example/www/ServiceNameMessageReceiverInOut.java uses unchecked or unsafe operations.
    [javac] Note: Recompile with -Xlint:unchecked for details.
    [copy] Copying 2 files to /export/home/illsleyd/continuum/continuum-1.0.3/apps/continuum/working-directory/1/modules/integration/target/rpc-test4/build/classes/META-INF
    [copy] Copying 1 file to /export/home/illsleyd/continuum/continuum-1.0.3/apps/continuum/working-directory/1/modules/integration/target/rpc-test4/build/classes/lib
    [jar] Building jar: /export/home/illsleyd/continuum/continuum-1.0.3/apps/continuum/working-directory/1/modules/integration/target/rpc-test4/build/lib/ServiceName.aar
    [echo] Running codegen RPC WSDLs with helper mode -  take 1
    [java] log4j:WARN No appenders could be found for logger (org.apache.axis2.description.AxisService).
    [java] log4j:WARN Please initialize the log4j system properly.
    [mkdir] Created dir: /export/home/illsleyd/continuum/continuum-1.0.3/apps/continuum/working-directory/1/modules/integration/target/helper-test1/build
    [mkdir] Created dir: /export/home/illsleyd/continuum/continuum-1.0.3/apps/continuum/working-directory/1/modules/integration/target/helper-test1/build/classes
    [mkdir] Created dir: /export/home/illsleyd/continuum/continuum-1.0.3/apps/continuum/working-directory/1/modules/integration/target/helper-test1/build/lib
    [mkdir] Created dir: /export/home/illsleyd/continuum/continuum-1.0.3/apps/continuum/working-directory/1/modules/integration/target/helper-test1/test
    [echo] Stax Availability= true
    [echo] Axis2 Availability= true
    [javac] Compiling 8 source files to /export/home/illsleyd/continuum/continuum-1.0.3/apps/continuum/working-directory/1/modules/integration/target/helper-test1/build/classes
    [javac] Note: Some input files use unchecked or unsafe operations.
    [javac] Note: Recompile with -Xlint:unchecked for details.
    [jar] Building jar: /export/home/illsleyd/continuum/continuum-1.0.3/apps/continuum/working-directory/1/modules/integration/target/helper-test1/build/lib/ServiceName-test-client.jar
    [echo] Running codegen RPC WSDLs with helper mode -  take 2
    [java] log4j:WARN No appenders could be found for logger (org.apache.axis2.description.AxisService).
    [java] log4j:WARN Please initialize the log4j system properly.
    [mkdir] Created dir: /export/home/illsleyd/continuum/continuum-1.0.3/apps/continuum/working-directory/1/modules/integration/target/helper-test2/build
    [mkdir] Created dir: /export/home/illsleyd/continuum/continuum-1.0.3/apps/continuum/working-directory/1/modules/integration/target/helper-test2/build/classes
    [mkdir] Created dir: /export/home/illsleyd/continuum/continuum-1.0.3/apps/continuum/working-directory/1/modules/integration/target/helper-test2/build/lib
    [mkdir] Created dir: /export/home/illsleyd/continuum/continuum-1.0.3/apps/continuum/working-directory/1/modules/integration/target/helper-test2/test
    [echo] Stax Availability= true
    [echo] Axis2 Availability= true
    [javac] Compiling 8 source files to /export/home/illsleyd/continuum/continuum-1.0.3/apps/continuum/working-directory/1/modules/integration/target/helper-test2/build/classes
    [javac] Note: Some input files use unchecked or unsafe operations.
    [javac] Note: Recompile with -Xlint:unchecked for details.
    [jar] Building jar: /export/home/illsleyd/continuum/continuum-1.0.3/apps/continuum/working-directory/1/modules/integration/target/helper-test2/build/lib/ServiceName-test-client.jar
    [echo] Running codegen for Enterprise WSDL - take 1
    [java] log4j:WARN No appenders could be found for logger (org.apache.axis2.description.AxisService).
    [java] log4j:WARN Please initialize the log4j system properly.
    [mkdir] Created dir: /export/home/illsleyd/continuum/continuum-1.0.3/apps/continuum/working-directory/1/modules/integration/target/enterprise-test1/build
    [mkdir] Created dir: /export/home/illsleyd/continuum/continuum-1.0.3/apps/continuum/working-directory/1/modules/integration/target/enterprise-test1/build/classes
    [mkdir] Created dir: /export/home/illsleyd/continuum/continuum-1.0.3/apps/continuum/working-directory/1/modules/integration/target/enterprise-test1/build/lib
    [mkdir] Created dir: /export/home/illsleyd/continuum/continuum-1.0.3/apps/continuum/working-directory/1/modules/integration/target/enterprise-test1/test
    [jar] Building jar: /export/home/illsleyd/continuum/continuum-1.0.3/apps/continuum/working-directory/1/modules/integration/target/enterprise-test1/build/lib/XBeans-packaged.jar
    [echo] XmlBeans Availability = true
    [echo] Stax Availability= true
    [echo] Axis2 Availability= true
    [javac] Compiling 740 source files to /export/home/illsleyd/continuum/continuum-1.0.3/apps/continuum/working-directory/1/modules/integration/target/enterprise-test1/build/classes
    [javac] Note: Some input files use or override a deprecated API.
    [javac] Note: Recompile with -Xlint:deprecation for details.
    [javac] Note: Some input files use unchecked or unsafe operations.
    [javac] Note: Recompile with -Xlint:unchecked for details.
    [jar] Building jar: /export/home/illsleyd/continuum/continuum-1.0.3/apps/continuum/working-directory/1/modules/integration/target/enterprise-test1/build/lib/SforceService-test-client.jar
    [echo] Running codegen for Enterprise WSDL - take 2
    [java] log4j:WARN No appenders could be found for logger (org.apache.axis2.description.AxisService).
    [java] log4j:WARN Please initialize the log4j system properly.
    [mkdir] Created dir: /export/home/illsleyd/continuum/continuum-1.0.3/apps/continuum/working-directory/1/modules/integration/target/enterprise-test2/build
    [mkdir] Created dir: /export/home/illsleyd/continuum/continuum-1.0.3/apps/continuum/working-directory/1/modules/integration/target/enterprise-test2/build/classes
    [mkdir] Created dir: /export/home/illsleyd/continuum/continuum-1.0.3/apps/continuum/working-directory/1/modules/integration/target/enterprise-test2/build/lib
    [mkdir] Created dir: /export/home/illsleyd/continuum/continuum-1.0.3/apps/continuum/working-directory/1/modules/integration/target/enterprise-test2/test
    [echo] Stax Availability= true
    [echo] Axis2 Availability= true
    [javac] Compiling 10 source files to /export/home/illsleyd/continuum/continuum-1.0.3/apps/continuum/working-directory/1/modules/integration/target/enterprise-test2/build/classes
    [javac] Note: /export/home/illsleyd/continuum/continuum-1.0.3/apps/continuum/working-directory/1/modules/integration/target/enterprise-test2/src/com/sforce/soap/enterprise/SforceServiceStub.java uses unchecked or unsafe operations.
    [javac] Note: Recompile with -Xlint:unchecked for details.
    [jar] Building jar: /export/home/illsleyd/continuum/continuum-1.0.3/apps/continuum/working-directory/1/modules/integration/target/enterprise-test2/build/lib/SforceService-test-client.jar
    [echo] Running codegen for Enterprise WSDL - take 3
    [java] log4j:WARN No appenders could be found for logger (org.apache.axis2.description.AxisService).
    [java] log4j:WARN Please initialize the log4j system properly.
    [mkdir] Created dir: /export/home/illsleyd/continuum/continuum-1.0.3/apps/continuum/working-directory/1/modules/integration/target/enterprise-test3/build
    [mkdir] Created dir: /export/home/illsleyd/continuum/continuum-1.0.3/apps/continuum/working-directory/1/modules/integration/target/enterprise-test3/build/classes
    [mkdir] Created dir: /export/home/illsleyd/continuum/continuum-1.0.3/apps/continuum/working-directory/1/modules/integration/target/enterprise-test3/build/lib
    [mkdir] Created dir: /export/home/illsleyd/continuum/continuum-1.0.3/apps/continuum/working-directory/1/modules/integration/target/enterprise-test3/test
    [jar] Building jar: /export/home/illsleyd/continuum/continuum-1.0.3/apps/continuum/working-directory/1/modules/integration/target/enterprise-test3/build/lib/XBeans-packaged.jar
    [echo] XmlBeans Availability = true
    [echo] Stax Availability= true
    [echo] Axis2 Availability= true
    [javac] Compiling 742 source files to /export/home/illsleyd/continuum/continuum-1.0.3/apps/continuum/working-directory/1/modules/integration/target/enterprise-test3/build/classes
    [javac] Note: Some input files use or override a deprecated API.
    [javac] Note: Recompile with -Xlint:deprecation for details.
    [javac] Note: Some input files use unchecked or unsafe operations.
    [javac] Note: Recompile with -Xlint:unchecked for details.
    [copy] Copying 2 files to /export/home/illsleyd/continuum/continuum-1.0.3/apps/continuum/working-directory/1/modules/integration/target/enterprise-test3/build/classes/META-INF
    [copy] Copying 1 file to /export/home/illsleyd/continuum/continuum-1.0.3/apps/continuum/working-directory/1/modules/integration/target/enterprise-test3/build/classes/lib
    [jar] Building jar: /export/home/illsleyd/continuum/continuum-1.0.3/apps/continuum/working-directory/1/modules/integration/target/enterprise-test3/build/lib/SforceService.aar
    [echo] Running codegen for Enterprise WSDL - take 4
    [java] log4j:WARN No appenders could be found for logger (org.apache.axis2.description.AxisService).
    [java] log4j:WARN Please initialize the log4j system properly.
    [mkdir] Created dir: /export/home/illsleyd/continuum/continuum-1.0.3/apps/continuum/working-directory/1/modules/integration/target/enterprise-test4/build
    [mkdir] Created dir: /export/home/illsleyd/continuum/continuum-1.0.3/apps/continuum/working-directory/1/modules/integration/target/enterprise-test4/build/classes
    [mkdir] Created dir: /export/home/illsleyd/continuum/continuum-1.0.3/apps/continuum/working-directory/1/modules/integration/target/enterprise-test4/build/lib
    [mkdir] Created dir: /export/home/illsleyd/continuum/continuum-1.0.3/apps/continuum/working-directory/1/modules/integration/target/enterprise-test4/test
    [jar] Building jar: /export/home/illsleyd/continuum/continuum-1.0.3/apps/continuum/working-directory/1/modules/integration/target/enterprise-test4/build/lib/XBeans-packaged.jar
    [echo] XmlBeans Availability = true
    [echo] Stax Availability= true
    [echo] Axis2 Availability= true
    [javac] Compiling 742 source files to /export/home/illsleyd/continuum/continuum-1.0.3/apps/continuum/working-directory/1/modules/integration/target/enterprise-test4/build/classes
    [javac] Note: Some input files use or override a deprecated API.
    [javac] Note: Recompile with -Xlint:deprecation for details.
    [javac] Note: Some input files use unchecked or unsafe operations.
    [javac] Note: Recompile with -Xlint:unchecked for details.
    [copy] Copying 2 files to /export/home/illsleyd/continuum/continuum-1.0.3/apps/continuum/working-directory/1/modules/integration/target/enterprise-test4/build/classes/META-INF
    [copy] Copying 1 file to /export/home/illsleyd/continuum/continuum-1.0.3/apps/continuum/working-directory/1/modules/integration/target/enterprise-test4/build/classes/lib
    [jar] Building jar: /export/home/illsleyd/continuum/continuum-1.0.3/apps/continuum/working-directory/1/modules/integration/target/enterprise-test4/build/lib/SforceService.aar
    [echo] Running codegen for eBaySvc WSDL
    [java] log4j:WARN No appenders could be found for logger (org.apache.axis2.description.AxisService).
    [java] log4j:WARN Please initialize the log4j system properly.
    [mkdir] Created dir: /export/home/illsleyd/continuum/continuum-1.0.3/apps/continuum/working-directory/1/modules/integration/target/eBaySvc/build
    [mkdir] Created dir: /export/home/illsleyd/continuum/continuum-1.0.3/apps/continuum/working-directory/1/modules/integration/target/eBaySvc/build/classes
    [mkdir] Created dir: /export/home/illsleyd/continuum/continuum-1.0.3/apps/continuum/working-directory/1/modules/integration/target/eBaySvc/build/lib
    [echo] Stax Availability= true
    [echo] Axis2 Availability= true
    [javac] Compiling 1016 source files to /export/home/illsleyd/continuum/continuum-1.0.3/apps/continuum/working-directory/1/modules/integration/target/eBaySvc/build/classes
    [javac] Note: Some input files use unchecked or unsafe operations.
    [javac] Note: Recompile with -Xlint:unchecked for details.
    [copy] Copying 2 files to /export/home/illsleyd/continuum/continuum-1.0.3/apps/continuum/working-directory/1/modules/integration/target/eBaySvc/build/classes/META-INF
    [jar] Building jar: /export/home/illsleyd/continuum/continuum-1.0.3/apps/continuum/working-directory/1/modules/integration/target/eBaySvc/build/lib/EBayAPIInterfaceService.aar
    [echo] Running codegen for eBaySvc WSDL Back word compatibiliy
    [java] log4j:WARN No appenders could be found for logger (org.apache.axis2.description.AxisService).
    [java] log4j:WARN Please initialize the log4j system properly.
    [mkdir] Created dir: /export/home/illsleyd/continuum/continuum-1.0.3/apps/continuum/working-directory/1/modules/integration/target/eBaySvcB/build
    [mkdir] Created dir: /export/home/illsleyd/continuum/continuum-1.0.3/apps/continuum/working-directory/1/modules/integration/target/eBaySvcB/build/classes
    [mkdir] Created dir: /export/home/illsleyd/continuum/continuum-1.0.3/apps/continuum/working-directory/1/modules/integration/target/eBaySvcB/build/lib
    [echo] Stax Availability= true
    [echo] Axis2 Availability= true
    [javac] Compiling 1015 source files to /export/home/illsleyd/continuum/continuum-1.0.3/apps/continuum/working-directory/1/modules/integration/target/eBaySvcB/build/classes
    [javac] Note: Some input files use unchecked or unsafe operations.
    [javac] Note: Recompile with -Xlint:unchecked for details.
    [copy] Copying 2 files to /export/home/illsleyd/continuum/continuum-1.0.3/apps/continuum/working-directory/1/modules/integration/target/eBaySvcB/build/classes/META-INF
    [jar] Building jar: /export/home/illsleyd/continuum/continuum-1.0.3/apps/continuum/working-directory/1/modules/integration/target/eBaySvcB/build/lib/EBayAPIInterfaceService.aar
    [echo] Running codegen for eBaySvc WSDL with un wrapping 
    [java] log4j:WARN No appenders could be found for logger (org.apache.axis2.description.AxisService).
    [java] log4j:WARN Please initialize the log4j system properly.
    [mkdir] Created dir: /export/home/illsleyd/continuum/continuum-1.0.3/apps/continuum/working-directory/1/modules/integration/target/eBaySvcUW/build
    [mkdir] Created dir: /export/home/illsleyd/continuum/continuum-1.0.3/apps/continuum/working-directory/1/modules/integration/target/eBaySvcUW/build/classes
    [mkdir] Created dir: /export/home/illsleyd/continuum/continuum-1.0.3/apps/continuum/working-directory/1/modules/integration/target/eBaySvcUW/build/lib
    [echo] Stax Availability= true
    [echo] Axis2 Availability= true
    [javac] Compiling 1016 source files to /export/home/illsleyd/continuum/continuum-1.0.3/apps/continuum/working-directory/1/modules/integration/target/eBaySvcUW/build/classes
    [javac] Note: Some input files use unchecked or unsafe operations.
    [javac] Note: Recompile with -Xlint:unchecked for details.
    [copy] Copying 2 files to /export/home/illsleyd/continuum/continuum-1.0.3/apps/continuum/working-directory/1/modules/integration/target/eBaySvcUW/build/classes/META-INF
    [jar] Building jar: /export/home/illsleyd/continuum/continuum-1.0.3/apps/continuum/working-directory/1/modules/integration/target/eBaySvcUW/build/lib/EBayAPIInterfaceService.aar
    [javac] Compiling 105 source files to /export/home/illsleyd/continuum/continuum-1.0.3/apps/continuum/working-directory/1/modules/integration/target/test-classes
    [javac] Note: /export/home/illsleyd/continuum/continuum-1.0.3/apps/continuum/working-directory/1/modules/integration/test/org/apache/axis2/engine/MessageContextInjectionTest.java uses or overrides a deprecated API.
    [javac] Note: Recompile with -Xlint:deprecation for details.
Running post goal: test:compile
    [mkdir] Created dir: /export/home/illsleyd/continuum/continuum-1.0.3/apps/continuum/working-directory/1/modules/integration/target/test-resources/samples/modules
    [mkdir] Created dir: /export/home/illsleyd/continuum/continuum-1.0.3/apps/continuum/working-directory/1/modules/integration/target/test-resources/samples/conf
    [mkdir] Created dir: /export/home/illsleyd/continuum/continuum-1.0.3/apps/continuum/working-directory/1/modules/integration/target/test-resources/repository-client/modules
    [mkdir] Created dir: /export/home/illsleyd/continuum/continuum-1.0.3/apps/continuum/working-directory/1/modules/integration/target/test-resources/repository-client/conf
    [copy] Copying 1 file to /export/home/illsleyd/continuum/continuum-1.0.3/apps/continuum/working-directory/1/modules/integration/target/test-resources/samples/modules
    [copy] Copying 1 file to /export/home/illsleyd/continuum/continuum-1.0.3/apps/continuum/working-directory/1/modules/integration/target/test-resources/samples/conf
    [copy] Copying 1 file to /export/home/illsleyd/continuum/continuum-1.0.3/apps/continuum/working-directory/1/modules/integration/target/test-resources/repository-client/modules
    [copy] Copying 1 file to /export/home/illsleyd/continuum/continuum-1.0.3/apps/continuum/working-directory/1/modules/integration/target/test-resources/repository-client/conf
    [mkdir] Created dir: /export/home/illsleyd/continuum/continuum-1.0.3/apps/continuum/working-directory/1/modules/integration/target/toWar/services
    [mkdir] Created dir: /export/home/illsleyd/continuum/continuum-1.0.3/apps/continuum/working-directory/1/modules/integration/target/test-resources/chunking-enabledRepository
    [mkdir] Created dir: /export/home/illsleyd/continuum/continuum-1.0.3/apps/continuum/working-directory/1/modules/integration/target/test-resources/chunking-enabledRepository/conf
    [copy] Copying 1 file to /export/home/illsleyd/continuum/continuum-1.0.3/apps/continuum/working-directory/1/modules/integration/target/test-resources/chunking-enabledRepository/conf
    [mkdir] Created dir: /export/home/illsleyd/continuum/continuum-1.0.3/apps/continuum/working-directory/1/modules/integration/target/test-resources/chunking-disabledRepository
    [mkdir] Created dir: /export/home/illsleyd/continuum/continuum-1.0.3/apps/continuum/working-directory/1/modules/integration/target/test-resources/chunking-disabledRepository/conf
    [copy] Copying 1 file to /export/home/illsleyd/continuum/continuum-1.0.3/apps/continuum/working-directory/1/modules/integration/target/test-resources/chunking-disabledRepository/conf
    [mkdir] Created dir: /export/home/illsleyd/continuum/continuum-1.0.3/apps/continuum/working-directory/1/modules/integration/target/test-resources/jms-enabled-server-repository
    [mkdir] Created dir: /export/home/illsleyd/continuum/continuum-1.0.3/apps/continuum/working-directory/1/modules/integration/target/test-resources/jms-enabled-server-repository/conf
    [mkdir] Created dir: /export/home/illsleyd/continuum/continuum-1.0.3/apps/continuum/working-directory/1/modules/integration/target/test-resources/jms-enabled-server-repository/modules
    [copy] Copying 1 file to /export/home/illsleyd/continuum/continuum-1.0.3/apps/continuum/working-directory/1/modules/integration/target/test-resources/jms-enabled-server-repository/conf
    [copy] Copying 1 file to /export/home/illsleyd/continuum/continuum-1.0.3/apps/continuum/working-directory/1/modules/integration/target/test-resources/jms-enabled-server-repository/modules
    [mkdir] Created dir: /export/home/illsleyd/continuum/continuum-1.0.3/apps/continuum/working-directory/1/modules/integration/target/test-resources/jms-enabled-client-repository
    [mkdir] Created dir: /export/home/illsleyd/continuum/continuum-1.0.3/apps/continuum/working-directory/1/modules/integration/target/test-resources/jms-enabled-client-repository/conf
    [mkdir] Created dir: /export/home/illsleyd/continuum/continuum-1.0.3/apps/continuum/working-directory/1/modules/integration/target/test-resources/jms-enabled-client-repository/modules
    [copy] Copying 1 file to /export/home/illsleyd/continuum/continuum-1.0.3/apps/continuum/working-directory/1/modules/integration/target/test-resources/jms-enabled-client-repository/conf
    [copy] Copying 1 file to /export/home/illsleyd/continuum/continuum-1.0.3/apps/continuum/working-directory/1/modules/integration/target/test-resources/jms-enabled-client-repository/modules
    [mkdir] Created dir: /export/home/illsleyd/continuum/continuum-1.0.3/apps/continuum/working-directory/1/modules/integration/target/test-resources/mail-transport-client-enabledRepository
    [mkdir] Created dir: /export/home/illsleyd/continuum/continuum-1.0.3/apps/continuum/working-directory/1/modules/integration/target/test-resources/mail-transport-client-enabledRepository/conf
    [mkdir] Created dir: /export/home/illsleyd/continuum/continuum-1.0.3/apps/continuum/working-directory/1/modules/integration/target/test-resources/mail-transport-client-enabledRepository/modules
    [copy] Copying 1 file to /export/home/illsleyd/continuum/continuum-1.0.3/apps/continuum/working-directory/1/modules/integration/target/test-resources/mail-transport-client-enabledRepository/conf
    [copy] Copying 1 file to /export/home/illsleyd/continuum/continuum-1.0.3/apps/continuum/working-directory/1/modules/integration/target/test-resources/mail-transport-client-enabledRepository/modules
    [mkdir] Created dir: /export/home/illsleyd/continuum/continuum-1.0.3/apps/continuum/working-directory/1/modules/integration/target/test-resources/mail-transport-server-enabledRepository
    [mkdir] Created dir: /export/home/illsleyd/continuum/continuum-1.0.3/apps/continuum/working-directory/1/modules/integration/target/test-resources/mail-transport-server-enabledRepository/conf
    [mkdir] Created dir: /export/home/illsleyd/continuum/continuum-1.0.3/apps/continuum/working-directory/1/modules/integration/target/test-resources/mail-transport-server-enabledRepository/modules
    [copy] Copying 1 file to /export/home/illsleyd/continuum/continuum-1.0.3/apps/continuum/working-directory/1/modules/integration/target/test-resources/mail-transport-server-enabledRepository/conf
    [copy] Copying 1 file to /export/home/illsleyd/continuum/continuum-1.0.3/apps/continuum/working-directory/1/modules/integration/target/test-resources/mail-transport-server-enabledRepository/modules
    [mkdir] Created dir: /export/home/illsleyd/continuum/continuum-1.0.3/apps/continuum/working-directory/1/modules/integration/target/test-resources/MessageContextInjectionRepo
    [mkdir] Created dir: /export/home/illsleyd/continuum/continuum-1.0.3/apps/continuum/working-directory/1/modules/integration/target/test-resources/integrationRepo/modules
    [mkdir] Created dir: /export/home/illsleyd/continuum/continuum-1.0.3/apps/continuum/working-directory/1/modules/integration/target/test-resources/integrationRepo/conf
    [copy] Copying 1 file to /export/home/illsleyd/continuum/continuum-1.0.3/apps/continuum/working-directory/1/modules/integration/target/test-resources/integrationRepo/modules
    [copy] Copying 1 file to /export/home/illsleyd/continuum/continuum-1.0.3/apps/continuum/working-directory/1/modules/integration/target/test-resources/integrationRepo/conf
    [mkdir] Created dir: /export/home/illsleyd/continuum/continuum-1.0.3/apps/continuum/working-directory/1/modules/integration/target/test-resources/commons-http-enabledRepository
    [mkdir] Created dir: /export/home/illsleyd/continuum/continuum-1.0.3/apps/continuum/working-directory/1/modules/integration/target/test-resources/commons-http-enabledRepository/conf
    [copy] Copying 1 file to /export/home/illsleyd/continuum/continuum-1.0.3/apps/continuum/working-directory/1/modules/integration/target/test-resources/commons-http-enabledRepository/conf
    [mkdir] Created dir: /export/home/illsleyd/continuum/continuum-1.0.3/apps/continuum/working-directory/1/modules/integration/target/test-resources/MTOM-enabledRepository
    [mkdir] Created dir: /export/home/illsleyd/continuum/continuum-1.0.3/apps/continuum/working-directory/1/modules/integration/target/test-resources/MTOM-enabledRepository/conf
    [mkdir] Created dir: /export/home/illsleyd/continuum/continuum-1.0.3/apps/continuum/working-directory/1/modules/integration/target/test-resources/MTOM-enabledRepository/modules
    [copy] Copying 1 file to /export/home/illsleyd/continuum/continuum-1.0.3/apps/continuum/working-directory/1/modules/integration/target/test-resources/MTOM-enabledRepository/conf
    [copy] Copying 1 file to /export/home/illsleyd/continuum/continuum-1.0.3/apps/continuum/working-directory/1/modules/integration/target/test-resources/MTOM-enabledRepository/modules
    [mkdir] Created dir: /export/home/illsleyd/continuum/continuum-1.0.3/apps/continuum/working-directory/1/modules/integration/target/test-resources/MTOM-fileCache-enabledRepository
    [mkdir] Created dir: /export/home/illsleyd/continuum/continuum-1.0.3/apps/continuum/working-directory/1/modules/integration/target/test-resources/MTOM-fileCache-enabledRepository/conf
    [copy] Copying 1 file to /export/home/illsleyd/continuum/continuum-1.0.3/apps/continuum/working-directory/1/modules/integration/target/test-resources/MTOM-fileCache-enabledRepository/conf
    [copy] Copying 1 file to /export/home/illsleyd/continuum/continuum-1.0.3/apps/continuum/working-directory/1/modules/integration/target/test-resources/MTOM-fileCache-enabledRepository/modules
    [mkdir] Created dir: /export/home/illsleyd/continuum/continuum-1.0.3/apps/continuum/working-directory/1/modules/integration/target/test-resources/SwA-enabledRepository
    [mkdir] Created dir: /export/home/illsleyd/continuum/continuum-1.0.3/apps/continuum/working-directory/1/modules/integration/target/test-resources/SwA-enabledRepository/conf
    [copy] Copying 1 file to /export/home/illsleyd/continuum/continuum-1.0.3/apps/continuum/working-directory/1/modules/integration/target/test-resources/SwA-enabledRepository/conf
    [copy] Copying 1 file to /export/home/illsleyd/continuum/continuum-1.0.3/apps/continuum/working-directory/1/modules/integration/target/test-resources/SwA-enabledRepository/modules
    [mkdir] Created dir: /export/home/illsleyd/continuum/continuum-1.0.3/apps/continuum/working-directory/1/modules/integration/target/test-resources/SwA-fileCache-enabledRepository
    [mkdir] Created dir: /export/home/illsleyd/continuum/continuum-1.0.3/apps/continuum/working-directory/1/modules/integration/target/test-resources/SwA-fileCache-enabledRepository/conf
    [copy] Copying 1 file to /export/home/illsleyd/continuum/continuum-1.0.3/apps/continuum/working-directory/1/modules/integration/target/test-resources/SwA-fileCache-enabledRepository/conf
    [copy] Copying 1 file to /export/home/illsleyd/continuum/continuum-1.0.3/apps/continuum/working-directory/1/modules/integration/target/test-resources/SwA-fileCache-enabledRepository/modules
    [mkdir] Created dir: /export/home/illsleyd/continuum/continuum-1.0.3/apps/continuum/working-directory/1/modules/integration/target/groovyRepo
    [mkdir] Created dir: /export/home/illsleyd/continuum/continuum-1.0.3/apps/continuum/working-directory/1/modules/integration/target/groovyRepo/conf
    [mkdir] Created dir: /export/home/illsleyd/continuum/continuum-1.0.3/apps/continuum/working-directory/1/modules/integration/target/groovyRepo/services
    [mkdir] Created dir: /export/home/illsleyd/continuum/continuum-1.0.3/apps/continuum/working-directory/1/modules/integration/target/groovyRepo/modules
    [copy] Copying 1 file to /export/home/illsleyd/continuum/continuum-1.0.3/apps/continuum/working-directory/1/modules/integration/target/groovyRepo/services
    [copy] Copying 1 file to /export/home/illsleyd/continuum/continuum-1.0.3/apps/continuum/working-directory/1/modules/integration/target/groovyRepo/modules
    [copy] Copying 1 file to /export/home/illsleyd/continuum/continuum-1.0.3/apps/continuum/working-directory/1/modules/integration/target/groovyRepo/conf
    [mkdir] Created dir: /export/home/illsleyd/continuum/continuum-1.0.3/apps/continuum/working-directory/1/modules/integration/target/test-resources/spring
    [copy] Copying 1 file to /export/home/illsleyd/continuum/continuum-1.0.3/apps/continuum/working-directory/1/modules/integration/target/test-classes/spring
    [mkdir] Created dir: /export/home/illsleyd/continuum/continuum-1.0.3/apps/continuum/working-directory/1/modules/integration/target/test-resources/deployment_repo
    [mkdir] Created dir: /export/home/illsleyd/continuum/continuum-1.0.3/apps/continuum/working-directory/1/modules/integration/target/test-resources/deployment_repo/conf
    [mkdir] Created dir: /export/home/illsleyd/continuum/continuum-1.0.3/apps/continuum/working-directory/1/modules/integration/target/test-resources/deployment_repo/services
    [mkdir] Created dir: /export/home/illsleyd/continuum/continuum-1.0.3/apps/continuum/working-directory/1/modules/integration/target/test-resources/deployment_repo/modules
    [copy] Copying 1 file to /export/home/illsleyd/continuum/continuum-1.0.3/apps/continuum/working-directory/1/modules/integration/target/test-resources/deployment_repo/conf
    [copy] Copying 1 file to /export/home/illsleyd/continuum/continuum-1.0.3/apps/continuum/working-directory/1/modules/integration/target/test-resources/deployment_repo/modules
    [mkdir] Created dir: /export/home/illsleyd/continuum/continuum-1.0.3/apps/continuum/working-directory/1/modules/integration/target/Repository
    [mkdir] Created dir: /export/home/illsleyd/continuum/continuum-1.0.3/apps/continuum/working-directory/1/modules/integration/target/Repository/conf
    [mkdir] Created dir: /export/home/illsleyd/continuum/continuum-1.0.3/apps/continuum/working-directory/1/modules/integration/target/Repository/services
    [mkdir] Created dir: /export/home/illsleyd/continuum/continuum-1.0.3/apps/continuum/working-directory/1/modules/integration/target/Repository/modules
    [copy] Copying 1 file to /export/home/illsleyd/continuum/continuum-1.0.3/apps/continuum/working-directory/1/modules/integration/target/Repository/modules
    [copy] Copying 1 file to /export/home/illsleyd/continuum/continuum-1.0.3/apps/continuum/working-directory/1/modules/integration/target/Repository/conf
    [mkdir] Created dir: /export/home/illsleyd/continuum/continuum-1.0.3/apps/continuum/working-directory/1/modules/integration/target/perf2/build/repo/conf
    [mkdir] Created dir: /export/home/illsleyd/continuum/continuum-1.0.3/apps/continuum/working-directory/1/modules/integration/target/perf/build/repo/conf
    [copy] Copying 1 file to /export/home/illsleyd/continuum/continuum-1.0.3/apps/continuum/working-directory/1/modules/integration/target/perf2/build/repo/conf
    [copy] Copying 1 file to /export/home/illsleyd/continuum/continuum-1.0.3/apps/continuum/working-directory/1/modules/integration/target/perf/build/repo/conf
    [mkdir] Created dir: /export/home/illsleyd/continuum/continuum-1.0.3/apps/continuum/working-directory/1/modules/integration/target/perf2/build/repo/modules
    [copy] Copying 1 file to /export/home/illsleyd/continuum/continuum-1.0.3/apps/continuum/working-directory/1/modules/integration/target/perf2/build/repo/modules
    [mkdir] Created dir: /export/home/illsleyd/continuum/continuum-1.0.3/apps/continuum/working-directory/1/modules/integration/target/perf/build/repo/modules
    [copy] Copying 1 file to /export/home/illsleyd/continuum/continuum-1.0.3/apps/continuum/working-directory/1/modules/integration/target/perf/build/repo/modules
    [echo] the files are up to date = ${jars.uptodate}
    [mkdir] Created dir: /export/home/illsleyd/continuum/continuum-1.0.3/apps/continuum/working-directory/1/modules/integration/test-resources/SOAP12Testing/SOAP12TestModuleB/build/classes
    [mkdir] Created dir: /export/home/illsleyd/continuum/continuum-1.0.3/apps/continuum/working-directory/1/modules/integration/test-resources/SOAP12Testing/SOAP12TestModuleB/build/lib
    [javac] Compiling 4 source files to /export/home/illsleyd/continuum/continuum-1.0.3/apps/continuum/working-directory/1/modules/integration/test-resources/SOAP12Testing/SOAP12TestModuleB/build/classes
    [javac] Note: /export/home/illsleyd/continuum/continuum-1.0.3/apps/continuum/working-directory/1/modules/integration/test-resources/SOAP12Testing/SOAP12TestModuleB/org/apache/axis2/soap12testing/handlers/SOAP12InFlowHandlerDefaultB.java uses or overrides a deprecated API.
    [javac] Note: Recompile with -Xlint:deprecation for details.
    [copy] Copying 1 file to /export/home/illsleyd/continuum/continuum-1.0.3/apps/continuum/working-directory/1/modules/integration/test-resources/SOAP12Testing/SOAP12TestModuleB/build/classes/META-INF
    [jar] Building jar: /export/home/illsleyd/continuum/continuum-1.0.3/apps/continuum/working-directory/1/modules/integration/target/Repository/modules/SOAP12TestModuleB.jar
    [delete] Deleting directory /export/home/illsleyd/continuum/continuum-1.0.3/apps/continuum/working-directory/1/modules/integration/test-resources/SOAP12Testing/SOAP12TestModuleB/build
    [echo] the files are up to date = ${jars.uptodate}
    [mkdir] Created dir: /export/home/illsleyd/continuum/continuum-1.0.3/apps/continuum/working-directory/1/modules/integration/test-resources/SOAP12Testing/SOAP12TestModuleC/build/classes
    [mkdir] Created dir: /export/home/illsleyd/continuum/continuum-1.0.3/apps/continuum/working-directory/1/modules/integration/test-resources/SOAP12Testing/SOAP12TestModuleC/build/lib
    [javac] Compiling 4 source files to /export/home/illsleyd/continuum/continuum-1.0.3/apps/continuum/working-directory/1/modules/integration/test-resources/SOAP12Testing/SOAP12TestModuleC/build/classes
    [javac] Note: /export/home/illsleyd/continuum/continuum-1.0.3/apps/continuum/working-directory/1/modules/integration/test-resources/SOAP12Testing/SOAP12TestModuleC/org/apache/axis2/soap12testing/handlers/SOAP12InFlowHandlerDefaultC.java uses or overrides a deprecated API.
    [javac] Note: Recompile with -Xlint:deprecation for details.
    [copy] Copying 1 file to /export/home/illsleyd/continuum/continuum-1.0.3/apps/continuum/working-directory/1/modules/integration/test-resources/SOAP12Testing/SOAP12TestModuleC/build/classes/META-INF
    [jar] Building jar: /export/home/illsleyd/continuum/continuum-1.0.3/apps/continuum/working-directory/1/modules/integration/target/Repository/modules/SOAP12TestModuleC.jar
    [delete] Deleting directory /export/home/illsleyd/continuum/continuum-1.0.3/apps/continuum/working-directory/1/modules/integration/test-resources/SOAP12Testing/SOAP12TestModuleC/build
    [echo] the files are up to date = ${jars.uptodate}
    [mkdir] Created dir: /export/home/illsleyd/continuum/continuum-1.0.3/apps/continuum/working-directory/1/modules/integration/test-resources/SOAP12Testing/SOAP12TestServiceB/build/classes
    [mkdir] Created dir: /export/home/illsleyd/continuum/continuum-1.0.3/apps/continuum/working-directory/1/modules/integration/test-resources/SOAP12Testing/SOAP12TestServiceB/build/lib
    [javac] Compiling 1 source file to /export/home/illsleyd/continuum/continuum-1.0.3/apps/continuum/working-directory/1/modules/integration/test-resources/SOAP12Testing/SOAP12TestServiceB/build/classes
    [copy] Copying 1 file to /export/home/illsleyd/continuum/continuum-1.0.3/apps/continuum/working-directory/1/modules/integration/test-resources/SOAP12Testing/SOAP12TestServiceB/build/classes/META-INF
    [jar] Building jar: /export/home/illsleyd/continuum/continuum-1.0.3/apps/continuum/working-directory/1/modules/integration/target/Repository/services/SOAP12TestServiceB.jar
    [delete] Deleting directory /export/home/illsleyd/continuum/continuum-1.0.3/apps/continuum/working-directory/1/modules/integration/test-resources/SOAP12Testing/SOAP12TestServiceB/build
    [echo] the files are up to date = ${jars.uptodate}
    [mkdir] Created dir: /export/home/illsleyd/continuum/continuum-1.0.3/apps/continuum/working-directory/1/modules/integration/test-resources/SOAP12Testing/SOAP12TestServiceC/build/classes
    [mkdir] Created dir: /export/home/illsleyd/continuum/continuum-1.0.3/apps/continuum/working-directory/1/modules/integration/test-resources/SOAP12Testing/SOAP12TestServiceC/build/lib
    [javac] Compiling 1 source file to /export/home/illsleyd/continuum/continuum-1.0.3/apps/continuum/working-directory/1/modules/integration/test-resources/SOAP12Testing/SOAP12TestServiceC/build/classes
    [copy] Copying 1 file to /export/home/illsleyd/continuum/continuum-1.0.3/apps/continuum/working-directory/1/modules/integration/test-resources/SOAP12Testing/SOAP12TestServiceC/build/classes/META-INF
    [jar] Building jar: /export/home/illsleyd/continuum/continuum-1.0.3/apps/continuum/working-directory/1/modules/integration/target/Repository/services/SOAP12TestServiceC.jar
    [delete] Deleting directory /export/home/illsleyd/continuum/continuum-1.0.3/apps/continuum/working-directory/1/modules/integration/test-resources/SOAP12Testing/SOAP12TestServiceC/build

    [junit] Running org.apache.axis2.addressing.AddressingServiceTest
    [junit] Tests run: 3, Failures: 0, Errors: 0, Time elapsed: 4.724 sec
    [junit] Running org.apache.axis2.addressing.MultiHopRedirectServiceTest
    [junit] Tests run: 1, Failures: 0, Errors: 0, Time elapsed: 7.273 sec
    [junit] Running org.apache.axis2.async.AsyncServiceTest
    [junit] Tests run: 1, Failures: 0, Errors: 0, Time elapsed: 8.012 sec
    [junit] Running org.apache.axis2.async.AsyncServiceWithTransportFailureTest
    [junit] Tests run: 1, Failures: 0, Errors: 0, Time elapsed: 8.337 sec
    [junit] Running org.apache.axis2.codegen.InvalidFaultWsdlTest
    [junit] Tests run: 1, Failures: 0, Errors: 0, Time elapsed: 1.458 sec
    [junit] Running org.apache.axis2.deployment.TargetResolverServiceTest
    [junit] Tests run: 1, Failures: 0, Errors: 0, Time elapsed: 7.148 sec
    [junit] Running org.apache.axis2.engine.CallUnregisteredServiceTest
    [junit] Tests run: 1, Failures: 0, Errors: 0, Time elapsed: 4.913 sec
    [junit] Running org.apache.axis2.engine.CharactersetEncodingTest
    [junit] Tests run: 11, Failures: 0, Errors: 0, Time elapsed: 8.37 sec
    [junit] Running org.apache.axis2.engine.CommonsHTTPEchoRawXMLTest
    [junit] Tests run: 2, Failures: 0, Errors: 0, Time elapsed: 5.686 sec
    [junit] Running org.apache.axis2.engine.EchoRawRuntimeProxyTest
    [junit] Tests run: 1, Failures: 0, Errors: 0, Time elapsed: 7.519 sec
    [junit] Running org.apache.axis2.engine.EchoRawXMLChunkedTest
    [junit] Tests run: 1, Failures: 0, Errors: 0, Time elapsed: 7.048 sec
    [junit] Running org.apache.axis2.engine.EchoRawXMLLoadTest
    [junit] Tests run: 1, Failures: 0, Errors: 0, Time elapsed: 6.969 sec
    [junit] Running org.apache.axis2.engine.EchoRawXMLMultipleASyncTest
    [junit] Tests run: 2, Failures: 0, Errors: 1, Time elapsed: 16.277 sec

BUILD FAILED
File...... file:/export/home/illsleyd/.maven/cache/maven-multiproject-plugin-1.5-SNAPSHOT/plugin.jelly
Element... maven:reactor
Line...... 227
Column.... 64
Unable to obtain goal [multiproject:install-callback] -- file:/export/home/illsleyd/.maven/cache/maven-test-plugin-1.8.1-SNAPSHOT/plugin.jelly:155:49: <junit> Test org.apache.axis2.engine.EchoRawXMLMultipleASyncTest failed
Total time   : 23 minutes 47 seconds 
Finished at  : Sunday, February 25, 2007 5:41:50 AM GMT+00:00


****************************************************************************



---------------------------------------------------------------------
To unsubscribe, e-mail: axis-dev-unsubscribe@ws.apache.org
For additional commands, e-mail: axis-dev-help@ws.apache.org


Mime
View raw message