axis-java-dev mailing list archives

Site index · List index
Message view « Date » · « Thread »
Top « Date » · « Thread »
From "davidillsley (Continuum)" <davidills...@apache.org>
Subject [continuum] BUILD FAILURE: Axis2
Date Sun, 18 Feb 2007 17:25:43 GMT
Online report : http://localhost:8080/continuum/servlet/continuum/target/ProjectBuild.vm/view/ProjectBuild/id/1/buildId/971
Build statistics:
  State: Failed
  Previous State: Failed
  Started at: Sun, 18 Feb 2007 17:01:54 +0000
  Finished at: Sun, 18 Feb 2007 17:25:19 +0000
  Total time: 23m 24s
  Build Trigger: Schedule
  Exit code: 70
  Building machine hostname: ws.zones.apache.org
  Operating system : SunOS(unknown)
  Java version : 1.5.0_09(Sun Microsystems Inc.)

Changes
         scheu          AXIS2-2210
Contributor: Rich Scheuerle
Cach @PostConstruct and @PreDestroy methods
             /webservices/axis2/trunk/java/modules/jaxws/src/org/apache/axis2/jaxws/runtime/description/injection/ResourceInjectionServiceRuntimeDescription.java
            /webservices/axis2/trunk/java/modules/jaxws/src/org/apache/axis2/jaxws/runtime/description/injection/impl/ResourceInjectionServiceRuntimeDescriptionBuilder.java
            /webservices/axis2/trunk/java/modules/jaxws/src/org/apache/axis2/jaxws/runtime/description/injection/impl/ResourceInjectionServiceRuntimeDescriptionImpl.java
            /webservices/axis2/trunk/java/modules/jaxws/src/org/apache/axis2/jaxws/server/endpoint/lifecycle/impl/EndpointLifecycleManagerImpl.java
        
****************************************************************************
Output:
****************************************************************************
 __  __
|  \/  |__ _Apache__ ___
| |\/| / _` \ V / -_) ' \  ~ intelligent projects ~
|_|  |_\__,_|\_/\___|_||_|  v. 1.1-beta-3

DEPRECATED: the default goal should be specified in the <build> section of project.xml instead of maven.xml
DEPRECATED: the default goal should be specified in the <build> section of project.xml instead of maven.xml
Trying to get missing/snapshot dependencies required by Apache Axis2:
Attempting to download maven-test-plugin-1.8.1-SNAPSHOT.jar.
Skipping download as local copy is up to date!
Attempting to download maven-multiproject-plugin-1.5-SNAPSHOT.jar.
Skipping download as local copy is up to date!
Attempting to download maven-jar-plugin-1.8-SNAPSHOT.jar.
Skipping download as local copy is up to date!
Attempting to download maven-plugin-plugin-1.8-SNAPSHOT.jar.
Skipping download as local copy is up to date!
    [echo] Current Java Version is: 1.5
    [echo] 
            JDK 1.5 detected, including the following modules:
            modules/metadata/project.xml,modules/saaj-api/project.xml,modules/saaj/project.xml,modules/jaxbri/project.xml,modules/jaxws/project.xml,modules/jaxws-api/project.xml,modules/json/project.xml
        
build:start:

clean:
modules:clean:
modules:reactor:init:
plugin:download-artifact:

    [echo] Adding to modules.reactor.includes: modules/adb-codegen/project.xml
    [echo] Adding to modules.reactor.includes: modules/adb/project.xml
    [echo] Adding to modules.reactor.includes: modules/addressing/project.xml
    [echo] Adding to modules.reactor.includes: modules/codegen/project.xml
    [echo] Adding to modules.reactor.includes: modules/integration/project.xml
    [echo] Adding to modules.reactor.includes: modules/java2wsdl/project.xml
    [echo] Adding to modules.reactor.includes: modules/jaxbri/project.xml
    [echo] Adding to modules.reactor.includes: modules/jaxws-api/project.xml
    [echo] Adding to modules.reactor.includes: modules/jaxws/project.xml
    [echo] Adding to modules.reactor.includes: modules/jibx/project.xml
    [echo] Adding to modules.reactor.includes: modules/json/project.xml
    [echo] Adding to modules.reactor.includes: modules/kernel/project.xml
    [echo] Adding to modules.reactor.includes: modules/metadata/project.xml
    [echo] Adding to modules.reactor.includes: modules/mex/project.xml
    [echo] Adding to modules.reactor.includes: modules/mtompolicy/project.xml
    [echo] Adding to modules.reactor.includes: modules/saaj-api/project.xml
    [echo] Adding to modules.reactor.includes: modules/saaj/project.xml
    [echo] Adding to modules.reactor.includes: modules/samples/project.xml
    [echo] Adding to modules.reactor.includes: modules/soapmonitor/project.xml
    [echo] Adding to modules.reactor.includes: modules/spring/project.xml
    [echo] Adding to modules.reactor.includes: modules/tool/project.xml
    [echo] Adding to modules.reactor.includes: modules/webapp/project.xml
    [echo] Adding to modules.reactor.includes: modules/xmlbeans/project.xml

    [echo] +----------------------------------------
    [echo] | Cleaning: modules/adb-codegen
    [echo] +----------------------------------------
    [delete] Deleting directory /export/home/illsleyd/continuum/continuum-1.0.3/apps/continuum/working-directory/1/modules/adb-codegen/target
    [echo] 
    [echo] +----------------------------------------
    [echo] | Cleaning: modules/adb
    [echo] +----------------------------------------
    [delete] Deleting directory /export/home/illsleyd/continuum/continuum-1.0.3/apps/continuum/working-directory/1/modules/adb/target
    [echo] 
    [echo] +----------------------------------------
    [echo] | Cleaning: modules/addressing
    [echo] +----------------------------------------
    [delete] Deleting directory /export/home/illsleyd/continuum/continuum-1.0.3/apps/continuum/working-directory/1/modules/addressing/target
    [echo] 
    [echo] +----------------------------------------
    [echo] | Cleaning: modules/codegen
    [echo] +----------------------------------------
    [delete] Deleting directory /export/home/illsleyd/continuum/continuum-1.0.3/apps/continuum/working-directory/1/modules/codegen/target
    [echo] 
    [echo] +----------------------------------------
    [echo] | Cleaning: modules/integration
    [echo] +----------------------------------------
    [delete] Deleting directory /export/home/illsleyd/continuum/continuum-1.0.3/apps/continuum/working-directory/1/modules/integration/target
    [echo] 
    [echo] +----------------------------------------
    [echo] | Cleaning: modules/java2wsdl
    [echo] +----------------------------------------
    [delete] Deleting directory /export/home/illsleyd/continuum/continuum-1.0.3/apps/continuum/working-directory/1/modules/java2wsdl/target
    [echo] 
    [echo] +----------------------------------------
    [echo] | Cleaning: modules/jaxbri
    [echo] +----------------------------------------
    [delete] Deleting directory /export/home/illsleyd/continuum/continuum-1.0.3/apps/continuum/working-directory/1/modules/jaxbri/target
    [echo] 
    [echo] +----------------------------------------
    [echo] | Cleaning: modules/jaxws-api
    [echo] +----------------------------------------
    [delete] Deleting directory /export/home/illsleyd/continuum/continuum-1.0.3/apps/continuum/working-directory/1/modules/jaxws-api/target
    [echo] 
    [echo] +----------------------------------------
    [echo] | Cleaning: modules/jaxws
    [echo] +----------------------------------------
    [delete] Deleting directory /export/home/illsleyd/continuum/continuum-1.0.3/apps/continuum/working-directory/1/modules/jaxws/target
    [echo] 
    [echo] +----------------------------------------
    [echo] | Cleaning: modules/jibx
    [echo] +----------------------------------------
    [echo] 
    [echo] +----------------------------------------
    [echo] | Cleaning: modules/json
    [echo] +----------------------------------------
    [echo] 
    [echo] +----------------------------------------
    [echo] | Cleaning: modules/kernel
    [echo] +----------------------------------------
    [delete] Deleting directory /export/home/illsleyd/continuum/continuum-1.0.3/apps/continuum/working-directory/1/modules/kernel/target
    [echo] 
    [echo] +----------------------------------------
    [echo] | Cleaning: modules/metadata
    [echo] +----------------------------------------
    [delete] Deleting directory /export/home/illsleyd/continuum/continuum-1.0.3/apps/continuum/working-directory/1/modules/metadata/target
    [echo] 
    [echo] +----------------------------------------
    [echo] | Cleaning: modules/mex
    [echo] +----------------------------------------
    [echo] 
    [echo] +----------------------------------------
    [echo] | Cleaning: modules/mtompolicy
    [echo] +----------------------------------------
    [echo] 
    [echo] +----------------------------------------
    [echo] | Cleaning: modules/saaj-api
    [echo] +----------------------------------------
    [delete] Deleting directory /export/home/illsleyd/continuum/continuum-1.0.3/apps/continuum/working-directory/1/modules/saaj-api/target
    [echo] 
    [echo] +----------------------------------------
    [echo] | Cleaning: modules/saaj
    [echo] +----------------------------------------
    [delete] Deleting directory /export/home/illsleyd/continuum/continuum-1.0.3/apps/continuum/working-directory/1/modules/saaj/target
    [echo] 
    [echo] +----------------------------------------
    [echo] | Cleaning: modules/samples
    [echo] +----------------------------------------
    [delete] Deleting directory /export/home/illsleyd/continuum/continuum-1.0.3/apps/continuum/working-directory/1/modules/samples/target
    [echo] 
    [echo] +----------------------------------------
    [echo] | Cleaning: modules/soapmonitor
    [echo] +----------------------------------------
    [echo] 
    [echo] +----------------------------------------
    [echo] | Cleaning: modules/spring
    [echo] +----------------------------------------
    [delete] Deleting directory /export/home/illsleyd/continuum/continuum-1.0.3/apps/continuum/working-directory/1/modules/spring/target
    [echo] 
    [echo] +----------------------------------------
    [echo] | Cleaning: modules/tool
    [echo] +----------------------------------------
    [delete] Deleting directory /export/home/illsleyd/continuum/continuum-1.0.3/apps/continuum/working-directory/1/modules/tool/target
    [echo] 
    [echo] +----------------------------------------
    [echo] | Cleaning: modules/webapp
    [echo] +----------------------------------------
    [echo] 
    [echo] +----------------------------------------
    [echo] | Cleaning: modules/xmlbeans
    [echo] +----------------------------------------
    [delete] Deleting directory /export/home/illsleyd/continuum/continuum-1.0.3/apps/continuum/working-directory/1/modules/xmlbeans/target
    [echo] 
    [echo] +----------------------------------------
    [echo] | Cleaning: target and etc/target
    [echo] +----------------------------------------


jar:
multiproject:install:
multiproject:projects-init:
    [echo] Gathering project list
Starting the reactor...
Our processing order:
Apache Axis 2.0 - Java2WSDL
Apache Axis 2.0 - Kernel
Apache Axis 2.0 - Data Binding
Apache Axis 2.0 - Code Generation
Apache Axis 2.0 - ADB Codegen
Apache Axis 2.0 - Addressing
Apache Axis 2.0 - Samples
Apache Axis 2.0 - spring
Apache Axis 2.0 - XMLBeans Data Binding
Apache Axis 2.0 - Tools
Apache Axis 2.0 - Integration
Apache Axis 2.0 - JAXB-RI Data Binding
Apache Axis 2.0 - SAAJ API
Apache Axis 2.0 - JAXWS API
Apache Axis 2.0 - SAAJ
Apache Axis 2.0 - Metadata
Apache Axis 2.0 - JAX-WS
Apache Axis 2.0 - JiBX Data Binding
Apache Axis 2.0 - JSON
Apache Axis 2.0 - Metadata Exchange
Apache Axis 2.0 - MTOM Policy
Apache Axis 2.0 - soapmonitor
+----------------------------------------
| Gathering project list Apache Axis 2.0 - Java2WSDL
| Memory: 24M/40M
+----------------------------------------
+----------------------------------------
| Gathering project list Apache Axis 2.0 - Kernel
| Memory: 24M/40M
+----------------------------------------
+----------------------------------------
| Gathering project list Apache Axis 2.0 - Data Binding
| Memory: 24M/40M
+----------------------------------------
+----------------------------------------
| Gathering project list Apache Axis 2.0 - Code Generation
| Memory: 24M/40M
+----------------------------------------
+----------------------------------------
| Gathering project list Apache Axis 2.0 - ADB Codegen
| Memory: 24M/40M
+----------------------------------------
+----------------------------------------
| Gathering project list Apache Axis 2.0 - Addressing
| Memory: 24M/40M
+----------------------------------------
+----------------------------------------
| Gathering project list Apache Axis 2.0 - Samples
| Memory: 24M/40M
+----------------------------------------
+----------------------------------------
| Gathering project list Apache Axis 2.0 - spring
| Memory: 24M/40M
+----------------------------------------
+----------------------------------------
| Gathering project list Apache Axis 2.0 - XMLBeans Data Binding
| Memory: 24M/40M
+----------------------------------------
+----------------------------------------
| Gathering project list Apache Axis 2.0 - Tools
| Memory: 24M/40M
+----------------------------------------
+----------------------------------------
| Gathering project list Apache Axis 2.0 - Integration
| Memory: 24M/40M
+----------------------------------------
+----------------------------------------
| Gathering project list Apache Axis 2.0 - JAXB-RI Data Binding
| Memory: 24M/40M
+----------------------------------------
+----------------------------------------
| Gathering project list Apache Axis 2.0 - SAAJ API
| Memory: 24M/40M
+----------------------------------------
+----------------------------------------
| Gathering project list Apache Axis 2.0 - JAXWS API
| Memory: 24M/40M
+----------------------------------------
+----------------------------------------
| Gathering project list Apache Axis 2.0 - SAAJ
| Memory: 24M/40M
+----------------------------------------
+----------------------------------------
| Gathering project list Apache Axis 2.0 - Metadata
| Memory: 24M/40M
+----------------------------------------
+----------------------------------------
| Gathering project list Apache Axis 2.0 - JAX-WS
| Memory: 24M/40M
+----------------------------------------
+----------------------------------------
| Gathering project list Apache Axis 2.0 - JiBX Data Binding
| Memory: 24M/40M
+----------------------------------------
+----------------------------------------
| Gathering project list Apache Axis 2.0 - JSON
| Memory: 24M/40M
+----------------------------------------
+----------------------------------------
| Gathering project list Apache Axis 2.0 - Metadata Exchange
| Memory: 24M/40M
+----------------------------------------
+----------------------------------------
| Gathering project list Apache Axis 2.0 - MTOM Policy
| Memory: 24M/40M
+----------------------------------------
+----------------------------------------
| Gathering project list Apache Axis 2.0 - soapmonitor
| Memory: 24M/40M
+----------------------------------------

multiproject:goal:
Starting the reactor...
Our processing order:
Apache Axis 2.0 - Java2WSDL
Apache Axis 2.0 - Kernel
Apache Axis 2.0 - Data Binding
Apache Axis 2.0 - Code Generation
Apache Axis 2.0 - ADB Codegen
Apache Axis 2.0 - Addressing
Apache Axis 2.0 - Samples
Apache Axis 2.0 - spring
Apache Axis 2.0 - XMLBeans Data Binding
Apache Axis 2.0 - Tools
Apache Axis 2.0 - Integration
Apache Axis 2.0 - JAXB-RI Data Binding
Apache Axis 2.0 - SAAJ API
Apache Axis 2.0 - JAXWS API
Apache Axis 2.0 - SAAJ
Apache Axis 2.0 - Metadata
Apache Axis 2.0 - JAX-WS
Apache Axis 2.0 - JiBX Data Binding
Apache Axis 2.0 - JSON
Apache Axis 2.0 - Metadata Exchange
Apache Axis 2.0 - MTOM Policy
Apache Axis 2.0 - soapmonitor
+----------------------------------------
| Executing multiproject:install-callback Apache Axis 2.0 - Java2WSDL
| Memory: 24M/40M
+----------------------------------------
DEPRECATED: the default goal should be specified in the <build> section of project.xml instead of maven.xml
DEPRECATED: the default goal should be specified in the <build> section of project.xml instead of maven.xml
Trying to get missing/snapshot dependencies required by Apache Axis 2.0 - Java2WSDL:
Attempting to download axiom-api-SNAPSHOT.jar.
4/124K
8/124K
12/124K
16/124K
20/124K
24/124K
28/124K
32/124K
36/124K
40/124K
44/124K
48/124K
49/124K
51/124K
55/124K
59/124K
63/124K
67/124K
71/124K
75/124K
79/124K
83/124K
87/124K
91/124K
95/124K
99/124K
103/124K
107/124K
111/124K
115/124K
119/124K
123/124K
124/124K
124K downloaded
Error retrieving artifact from [http://people.apache.org/repo/m1-snapshot-repository/]: org.apache.maven.verifier.ChecksumVerificationException: Error retrieving checksum file for /org.apache.ws.commons.axiom/jars/axiom-api-SNAPSHOT.jar
Skipping download as local copy is up to date!
Attempting to download axiom-impl-SNAPSHOT.jar.
4/108K
8/108K
12/108K
16/108K
20/108K
24/108K
28/108K
32/108K
36/108K
40/108K
44/108K
48/108K
49/108K
51/108K
55/108K
58/108K
62/108K
65/108K
69/108K
73/108K
77/108K
79/108K
83/108K
86/108K
90/108K
93/108K
97/108K
100/108K
104/108K
108/108K
108K downloaded
Error retrieving artifact from [http://people.apache.org/repo/m1-snapshot-repository/]: org.apache.maven.verifier.ChecksumVerificationException: Error retrieving checksum file for /org.apache.ws.commons.axiom/jars/axiom-impl-SNAPSHOT.jar
Skipping download as local copy is up to date!
build:start:

multiproject:install-callback:
    [echo] Running jar:install for Apache Axis 2.0 - Java2WSDL
java:prepare-filesystem:
    [mkdir] Created dir: /export/home/illsleyd/continuum/continuum-1.0.3/apps/continuum/working-directory/1/modules/java2wsdl/target/classes
Running post goal: java:prepare-filesystem

java:compile:
    [echo] Compiling to /export/home/illsleyd/continuum/continuum-1.0.3/apps/continuum/working-directory/1/modules/java2wsdl/target/classes
    [javac] Compiling 22 source files to /export/home/illsleyd/continuum/continuum-1.0.3/apps/continuum/working-directory/1/modules/java2wsdl/target/classes

java:jar-resources:
Copying 2 files to /export/home/illsleyd/continuum/continuum-1.0.3/apps/continuum/working-directory/1/modules/java2wsdl/target/classes/META-INF

test:test:
    [echo] No tests to run.

jar:jar:
    [jar] Building jar: /export/home/illsleyd/continuum/continuum-1.0.3/apps/continuum/working-directory/1/modules/java2wsdl/target/axis2-java2wsdl-SNAPSHOT.jar

jar:install:
    [echo] Installing...
Uploading to org.apache.axis2/jars/axis2-java2wsdl-SNAPSHOT.jar: 
.................... (55K)
Uploading to org.apache.axis2/poms/axis2-java2wsdl-SNAPSHOT.pom: 
.................... (14K)

+----------------------------------------
| Executing multiproject:install-callback Apache Axis 2.0 - Kernel
| Memory: 24M/40M
+----------------------------------------
DEPRECATED: the default goal should be specified in the <build> section of project.xml instead of maven.xml
DEPRECATED: the default goal should be specified in the <build> section of project.xml instead of maven.xml

build:end:

Trying to get missing/snapshot dependencies required by Apache Axis 2.0 - Kernel:
Attempting to download axis2-java2wsdl-SNAPSHOT.jar.
Skipping download as local copy is up to date!
Attempting to download neethi-SNAPSHOT.jar.
4/28K
8/28K
12/28K
16/28K
20/28K
24/28K
28/28K
28/28K
28K downloaded
*** CHECKSUM FAILED - Checksum failed on download: local = '7adbb73921d69b6bb976f0901ea8d209'; remote = '1f65b228ee693e9f83e0c8517ffdbc7c' - RETRYING
4/28K
8/28K
12/28K
16/28K
20/28K
22/28K
26/28K
28/28K
28K downloaded
Error retrieving artifact from [http://people.apache.org/repo/m1-snapshot-repository/]: org.apache.maven.verifier.ChecksumVerificationException: Checksum failed on download: local = '7adbb73921d69b6bb976f0901ea8d209'; remote = '1f65b228ee693e9f83e0c8517ffdbc7c'
Attempting to download woden-1.0-incubating-SNAPSHOT.jar.
4/303K
8/303K
12/303K
16/303K
20/303K
24/303K
28/303K
32/303K
36/303K
40/303K
44/303K
48/303K
49/303K
51/303K
55/303K
58/303K
62/303K
66/303K
70/303K
72/303K
76/303K
79/303K
83/303K
86/303K
90/303K
93/303K
97/303K
100/303K
104/303K
108/303K
112/303K
115/303K
119/303K
122/303K
126/303K
129/303K
133/303K
136/303K
140/303K
143/303K
147/303K
150/303K
154/303K
157/303K
161/303K
165/303K
169/303K
172/303K
176/303K
179/303K
183/303K
186/303K
190/303K
193/303K
197/303K
200/303K
204/303K
207/303K
211/303K
215/303K
219/303K
222/303K
226/303K
229/303K
233/303K
236/303K
240/303K
243/303K
247/303K
250/303K
254/303K
257/303K
261/303K
264/303K
268/303K
272/303K
276/303K
279/303K
283/303K
283/303K
287/303K
290/303K
294/303K
297/303K
301/303K
303/303K
303K downloaded
*** CHECKSUM FAILED - Checksum failed on download: local = 'b8d35040e1d24ef5c6c8c5994164336a'; remote = '2e8e82d339689520554360341f45746d' - RETRYING
4/303K
8/303K
12/303K
16/303K
20/303K
24/303K
28/303K
32/303K
36/303K
40/303K
44/303K
48/303K
52/303K
56/303K
60/303K
64/303K
68/303K
72/303K
76/303K
80/303K
84/303K
88/303K
92/303K
96/303K
100/303K
104/303K
108/303K
112/303K
116/303K
118/303K
122/303K
126/303K
130/303K
133/303K
137/303K
140/303K
144/303K
147/303K
151/303K
154/303K
158/303K
161/303K
165/303K
168/303K
172/303K
175/303K
179/303K
183/303K
187/303K
190/303K
194/303K
197/303K
201/303K
204/303K
208/303K
211/303K
215/303K
218/303K
222/303K
225/303K
229/303K
232/303K
236/303K
240/303K
244/303K
247/303K
251/303K
254/303K
258/303K
261/303K
265/303K
268/303K
272/303K
275/303K
279/303K
282/303K
286/303K
290/303K
294/303K
297/303K
301/303K
303/303K
303K downloaded
Error retrieving artifact from [http://people.apache.org/repo/m1-snapshot-repository/]: org.apache.maven.verifier.ChecksumVerificationException: Checksum failed on download: local = 'b8d35040e1d24ef5c6c8c5994164336a'; remote = '2e8e82d339689520554360341f45746d'
build:start:

multiproject:install-callback:
    [echo] Running jar:install for Apache Axis 2.0 - Kernel
java:prepare-filesystem:
    [mkdir] Created dir: /export/home/illsleyd/continuum/continuum-1.0.3/apps/continuum/working-directory/1/modules/kernel/target/classes
Running post goal: java:prepare-filesystem

java:compile:
    [echo] Compiling to /export/home/illsleyd/continuum/continuum-1.0.3/apps/continuum/working-directory/1/modules/kernel/target/classes
    [javac] Compiling 309 source files to /export/home/illsleyd/continuum/continuum-1.0.3/apps/continuum/working-directory/1/modules/kernel/target/classes
    [javac] Note: Some input files use or override a deprecated API.
    [javac] Note: Recompile with -Xlint:deprecation for details.

java:jar-resources:
Copying 1 file to /export/home/illsleyd/continuum/continuum-1.0.3/apps/continuum/working-directory/1/modules/kernel/target/classes
Copying 2 files to /export/home/illsleyd/continuum/continuum-1.0.3/apps/continuum/working-directory/1/modules/kernel/target/classes
Copying 2 files to /export/home/illsleyd/continuum/continuum-1.0.3/apps/continuum/working-directory/1/modules/kernel/target/classes/META-INF

test:test:
java:prepare-filesystem:
Running post goal: java:prepare-filesystem

java:compile:
    [echo] Compiling to /export/home/illsleyd/continuum/continuum-1.0.3/apps/continuum/working-directory/1/modules/kernel/target/classes
    [javac] Compiling 1 source file to /export/home/illsleyd/continuum/continuum-1.0.3/apps/continuum/working-directory/1/modules/kernel/target/classes

java:jar-resources:

test:prepare-filesystem:
    [mkdir] Created dir: /export/home/illsleyd/continuum/continuum-1.0.3/apps/continuum/working-directory/1/modules/kernel/target/test-classes
    [mkdir] Created dir: /export/home/illsleyd/continuum/continuum-1.0.3/apps/continuum/working-directory/1/modules/kernel/target/test-reports

test:test-resources:
Copying 59 files to /export/home/illsleyd/continuum/continuum-1.0.3/apps/continuum/working-directory/1/modules/kernel/target/test-classes/../test-resources

test:compile:
    [javac] Compiling 93 source files to /export/home/illsleyd/continuum/continuum-1.0.3/apps/continuum/working-directory/1/modules/kernel/target/test-classes
    [javac] Note: Some input files use or override a deprecated API.
    [javac] Note: Recompile with -Xlint:deprecation for details.
Running post goal: test:compile
    [echo] the files are up to date = ${jars.uptodate}
    [mkdir] Created dir: /export/home/illsleyd/continuum/continuum-1.0.3/apps/continuum/working-directory/1/modules/kernel/test-resources/deployment/service2/build/classes
    [mkdir] Created dir: /export/home/illsleyd/continuum/continuum-1.0.3/apps/continuum/working-directory/1/modules/kernel/test-resources/deployment/service2/build/lib
    [copy] Copying 1 file to /export/home/illsleyd/continuum/continuum-1.0.3/apps/continuum/working-directory/1/modules/kernel/test-resources/deployment/service2/build/classes/META-INF
    [mkdir] Created dir: /export/home/illsleyd/continuum/continuum-1.0.3/apps/continuum/working-directory/1/modules/kernel/target/test-resources/deployment/services
    [jar] Building jar: /export/home/illsleyd/continuum/continuum-1.0.3/apps/continuum/working-directory/1/modules/kernel/target/test-resources/deployment/services/service2.jar
    [delete] Deleting directory /export/home/illsleyd/continuum/continuum-1.0.3/apps/continuum/working-directory/1/modules/kernel/test-resources/deployment/service2/build
    [echo] the files are up to date = ${jars.uptodate}
    [mkdir] Created dir: /export/home/illsleyd/continuum/continuum-1.0.3/apps/continuum/working-directory/1/modules/kernel/test-resources/deployment/echo/build/classes
    [mkdir] Created dir: /export/home/illsleyd/continuum/continuum-1.0.3/apps/continuum/working-directory/1/modules/kernel/test-resources/deployment/echo/build/lib
    [copy] Copying 1 file to /export/home/illsleyd/continuum/continuum-1.0.3/apps/continuum/working-directory/1/modules/kernel/test-resources/deployment/echo/build/classes/META-INF
    [mkdir] Created dir: /export/home/illsleyd/continuum/continuum-1.0.3/apps/continuum/working-directory/1/modules/kernel/target/echo
    [jar] Building jar: /export/home/illsleyd/continuum/continuum-1.0.3/apps/continuum/working-directory/1/modules/kernel/target/echo/echo.aar
    [delete] Deleting directory /export/home/illsleyd/continuum/continuum-1.0.3/apps/continuum/working-directory/1/modules/kernel/test-resources/deployment/echo/build
    [echo] the files are up to date = ${jars.uptodate}
    [mkdir] Created dir: /export/home/illsleyd/continuum/continuum-1.0.3/apps/continuum/working-directory/1/modules/kernel/test-resources/deployment/invalidservice/build/classes
    [mkdir] Created dir: /export/home/illsleyd/continuum/continuum-1.0.3/apps/continuum/working-directory/1/modules/kernel/test-resources/deployment/invalidservice/build/lib
    [copy] Copying 1 file to /export/home/illsleyd/continuum/continuum-1.0.3/apps/continuum/working-directory/1/modules/kernel/test-resources/deployment/invalidservice/build/classes/META-INF
    [mkdir] Created dir: /export/home/illsleyd/continuum/continuum-1.0.3/apps/continuum/working-directory/1/modules/kernel/target/test-resources/InvalidDeployment/services
    [jar] Building jar: /export/home/illsleyd/continuum/continuum-1.0.3/apps/continuum/working-directory/1/modules/kernel/target/test-resources/InvalidDeployment/services/invalidService.jar
    [delete] Deleting directory /export/home/illsleyd/continuum/continuum-1.0.3/apps/continuum/working-directory/1/modules/kernel/test-resources/deployment/invalidservice/build
    [echo] the files are up to date = ${jars.uptodate}
    [mkdir] Created dir: /export/home/illsleyd/continuum/continuum-1.0.3/apps/continuum/working-directory/1/modules/kernel/test-resources/deployment/module1/build/classes
    [mkdir] Created dir: /export/home/illsleyd/continuum/continuum-1.0.3/apps/continuum/working-directory/1/modules/kernel/test-resources/deployment/module1/build/lib
    [copy] Copying 1 file to /export/home/illsleyd/continuum/continuum-1.0.3/apps/continuum/working-directory/1/modules/kernel/test-resources/deployment/module1/build/classes/META-INF
    [mkdir] Created dir: /export/home/illsleyd/continuum/continuum-1.0.3/apps/continuum/working-directory/1/modules/kernel/target/test-resources/deployment/modules
    [jar] Building jar: /export/home/illsleyd/continuum/continuum-1.0.3/apps/continuum/working-directory/1/modules/kernel/target/test-resources/deployment/modules/module1.mar
    [delete] Deleting directory /export/home/illsleyd/continuum/continuum-1.0.3/apps/continuum/working-directory/1/modules/kernel/test-resources/deployment/module1/build
    [echo] the files are up to date = ${jars.uptodate}
    [mkdir] Created dir: /export/home/illsleyd/continuum/continuum-1.0.3/apps/continuum/working-directory/1/modules/kernel/test-resources/deployment/serviceModule/build/classes
    [mkdir] Created dir: /export/home/illsleyd/continuum/continuum-1.0.3/apps/continuum/working-directory/1/modules/kernel/test-resources/deployment/serviceModule/build/lib
    [copy] Copying 1 file to /export/home/illsleyd/continuum/continuum-1.0.3/apps/continuum/working-directory/1/modules/kernel/test-resources/deployment/serviceModule/build/classes/META-INF
    [mkdir] Created dir: /export/home/illsleyd/continuum/continuum-1.0.3/apps/continuum/working-directory/1/modules/kernel/target/test-resources/InvalidDeployment/modules
    [jar] Building jar: /export/home/illsleyd/continuum/continuum-1.0.3/apps/continuum/working-directory/1/modules/kernel/target/test-resources/InvalidDeployment/modules/serviceModule.jar
    [delete] Deleting directory /export/home/illsleyd/continuum/continuum-1.0.3/apps/continuum/working-directory/1/modules/kernel/test-resources/deployment/serviceModule/build
    [mkdir] Created dir: /export/home/illsleyd/continuum/continuum-1.0.3/apps/continuum/working-directory/1/modules/kernel/target/test-resources/java2sec/more
    [mkdir] Created dir: /export/home/illsleyd/continuum/continuum-1.0.3/apps/continuum/working-directory/1/modules/kernel/target/test-resources/java2sec/less
    [jar] Building jar: /export/home/illsleyd/continuum/continuum-1.0.3/apps/continuum/working-directory/1/modules/kernel/target/test-resources/java2sec/more/MorePermission.jar
    [delete] Deleting directory /export/home/illsleyd/continuum/continuum-1.0.3/apps/continuum/working-directory/1/modules/kernel/target/test-classes/org/apache/axis2/java/security/driver
    [delete] Deleting directory /export/home/illsleyd/continuum/continuum-1.0.3/apps/continuum/working-directory/1/modules/kernel/target/test-classes/org/apache/axis2/java/security/more
    [delete] Deleting directory /export/home/illsleyd/continuum/continuum-1.0.3/apps/continuum/working-directory/1/modules/kernel/target/test-classes/org/apache/axis2/java/security/action
    [delete] Deleting directory /export/home/illsleyd/continuum/continuum-1.0.3/apps/continuum/working-directory/1/modules/kernel/target/test-classes/org/apache/axis2/java/security/interf
    [jar] Building jar: /export/home/illsleyd/continuum/continuum-1.0.3/apps/continuum/working-directory/1/modules/kernel/target/test-resources/java2sec/less/LessPermission.jar
    [delete] Deleting directory /export/home/illsleyd/continuum/continuum-1.0.3/apps/continuum/working-directory/1/modules/kernel/target/test-classes/org/apache/axis2/java/security/less

    [junit] Running org.apache.axis2.addressing.AddressingHelperTest
    [junit] Tests run: 6, Failures: 0, Errors: 0, Time elapsed: 0.416 sec
    [junit] Running org.apache.axis2.addressing.EndpointReferenceHelperTest
    [junit] Tests run: 2, Failures: 0, Errors: 0, Time elapsed: 0.425 sec
    [junit] Running org.apache.axis2.addressing.EndpointReferenceTypeTest
    [junit] Tests run: 4, Failures: 0, Errors: 0, Time elapsed: 0.401 sec
    [junit] Running org.apache.axis2.addressing.miheaders.RelatesToTest
    [junit] Tests run: 3, Failures: 0, Errors: 0, Time elapsed: 0.358 sec
    [junit] Running org.apache.axis2.addressing.wsdl.WSDL11ActionHelperTest
    [junit] Tests run: 8, Failures: 0, Errors: 0, Time elapsed: 0.778 sec
    [junit] Running org.apache.axis2.context.ContextHierarchyTest
    [junit] Tests run: 2, Failures: 0, Errors: 0, Time elapsed: 0.753 sec
    [junit] Running org.apache.axis2.context.OperationContextTest
    [junit] Tests run: 1, Failures: 0, Errors: 0, Time elapsed: 0.742 sec
    [junit] Running org.apache.axis2.deployment.AddingObserverTest
    [junit] Tests run: 1, Failures: 0, Errors: 0, Time elapsed: 0.983 sec
    [junit] Running org.apache.axis2.deployment.AxisMessageTest
    [junit] Tests run: 1, Failures: 0, Errors: 0, Time elapsed: 1.375 sec
    [junit] Running org.apache.axis2.deployment.BadModuleTest
    [junit] Tests run: 1, Failures: 0, Errors: 0, Time elapsed: 0.666 sec
    [junit] Running org.apache.axis2.deployment.BuildERWithDeploymentTest
    [junit] Tests run: 1, Failures: 0, Errors: 0, Time elapsed: 1.265 sec
    [junit] Running org.apache.axis2.deployment.BuilderSelectorDeploymentTest
    [junit] Tests run: 2, Failures: 0, Errors: 0, Time elapsed: 1.228 sec
    [junit] Running org.apache.axis2.deployment.DeploymentTotalTest
    [junit] Tests run: 1, Failures: 0, Errors: 0, Time elapsed: 1.169 sec
    [junit] Running org.apache.axis2.deployment.MessageFormatterDeploymentTest
    [junit] Tests run: 2, Failures: 0, Errors: 0, Time elapsed: 1.297 sec
    [junit] Running org.apache.axis2.deployment.ModifiedConfigFileTest
    [junit] Tests run: 1, Failures: 0, Errors: 0, Time elapsed: 0.726 sec
    [junit] Running org.apache.axis2.deployment.ModuleDisengagementTest
    [junit] Tests run: 7, Failures: 0, Errors: 0, Time elapsed: 1.397 sec
    [junit] Running org.apache.axis2.deployment.ModuleversionTest
    [junit] Tests run: 2, Failures: 0, Errors: 0, Time elapsed: 0.731 sec
    [junit] Running org.apache.axis2.deployment.OperationExcludeTest
    [junit] Tests run: 1, Failures: 0, Errors: 0, Time elapsed: 1.393 sec
    [junit] Running org.apache.axis2.deployment.SameServiceAddingTest
    [junit] Tests run: 1, Failures: 0, Errors: 0, Time elapsed: 0.811 sec
    [junit] Running org.apache.axis2.deployment.ServiceGroupTest
    [junit] Tests run: 1, Failures: 0, Errors: 0, Time elapsed: 1.674 sec
    [junit] Running org.apache.axis2.deployment.SystemPhasesremovedTest
    [junit] Tests run: 1, Failures: 0, Errors: 0, Time elapsed: 0.737 sec
    [junit] Running org.apache.axis2.deployment.TransportDeploymentTest
    [junit] Tests run: 1, Failures: 0, Errors: 0, Time elapsed: 1.133 sec
    [junit] Running org.apache.axis2.description.RegistryTest
    [junit] Tests run: 5, Failures: 0, Errors: 0, Time elapsed: 0.638 sec
    [junit] Running org.apache.axis2.description.WSDLToAllServicesBuilderTest
    [junit] Tests run: 2, Failures: 0, Errors: 0, Time elapsed: 3.98 sec
    [junit] Running org.apache.axis2.dispatchers.ActionBasedOperationDispatchTest
    [junit] Tests run: 1, Failures: 0, Errors: 0, Time elapsed: 0.749 sec
    [junit] Running org.apache.axis2.dispatchers.RelatesToBasedOperationDispatcherTest
    [junit] Tests run: 1, Failures: 0, Errors: 0, Time elapsed: 0.755 sec
    [junit] Running org.apache.axis2.dispatchers.RelatesToBasedServiceDispatcherTest
    [junit] Tests run: 1, Failures: 0, Errors: 0, Time elapsed: 0.756 sec
    [junit] Running org.apache.axis2.dispatchers.RequestURIBasedOperationDispatcherTest
    [junit] Tests run: 1, Failures: 0, Errors: 0, Time elapsed: 0.887 sec
    [junit] Running org.apache.axis2.dispatchers.RequestURIBasedServiceDispatcherTest
    [junit] Tests run: 1, Failures: 0, Errors: 0, Time elapsed: 0.486 sec
    [junit] Running org.apache.axis2.dispatchers.SOAPMessageBodyBasedOperationDispatcherTest
    [junit] Tests run: 1, Failures: 0, Errors: 0, Time elapsed: 0.844 sec
    [junit] Running org.apache.axis2.dispatchers.SOAPMessageBodyBasedServiceDispatcherTest
    [junit] Tests run: 1, Failures: 0, Errors: 0, Time elapsed: 0.581 sec
    [junit] Running org.apache.axis2.engine.EnginePausingTest
    [junit] Tests run: 1, Failures: 0, Errors: 0, Time elapsed: 0.926 sec
    [junit] Running org.apache.axis2.engine.MessageContextChangeTest
    [junit] Tests run: 1, Failures: 0, Errors: 0, Time elapsed: 0.439 sec
    [junit] Running org.apache.axis2.engine.MessageContextSaveATest
    [junit] Tests run: 4, Failures: 0, Errors: 0, Time elapsed: 0.892 sec
    [junit] Running org.apache.axis2.engine.MessageContextSaveBTest
    [junit] Tests run: 1, Failures: 0, Errors: 0, Time elapsed: 0.702 sec
    [junit] Running org.apache.axis2.engine.MessageContextSaveCTest
    [junit] Tests run: 2, Failures: 0, Errors: 0, Time elapsed: 0.841 sec
    [junit] Running org.apache.axis2.engine.MessageContextSelfManagedDataTest
    [junit] Tests run: 10, Failures: 0, Errors: 0, Time elapsed: 2.569 sec
    [junit] Running org.apache.axis2.engine.MessageContextTest
    [junit] Tests run: 1, Failures: 0, Errors: 0, Time elapsed: 0.489 sec
    [junit] Running org.apache.axis2.engine.ModuleConfigTest
    [junit] Tests run: 2, Failures: 0, Errors: 0, Time elapsed: 1.069 sec
    [junit] Running org.apache.axis2.engine.ModuleEngageTest
    [junit] Tests run: 1, Failures: 0, Errors: 0, Time elapsed: 1.189 sec
    [junit] Running org.apache.axis2.engine.ObjectSaveTest
    [junit] Tests run: 5, Failures: 0, Errors: 0, Time elapsed: 0.75 sec
    [junit] Running org.apache.axis2.engine.OperationContextSaveTest
    [junit] Tests run: 1, Failures: 0, Errors: 0, Time elapsed: 0.765 sec
    [junit] Running org.apache.axis2.engine.OptionsSaveTest
    [junit] Tests run: 1, Failures: 0, Errors: 0, Time elapsed: 0.761 sec
    [junit] Running org.apache.axis2.engine.ParameterAddTest
    [junit] Tests run: 4, Failures: 0, Errors: 0, Time elapsed: 0.713 sec
    [junit] Running org.apache.axis2.engine.SOAPActionBasedDispatcherTest
    [junit] Tests run: 4, Failures: 0, Errors: 0, Time elapsed: 0.751 sec
    [junit] Running org.apache.axis2.java.security.driver.Java2SecTest
    [junit] Tests run: 9, Failures: 0, Errors: 0, Time elapsed: 0.401 sec
    [junit] Running org.apache.axis2.misc.MiscTest
    [junit] Tests run: 1, Failures: 0, Errors: 0, Time elapsed: 0.334 sec
    [junit] Running org.apache.axis2.phaserule.AddingHandlerToEachPhaseTest
    [junit] Tests run: 3, Failures: 0, Errors: 0, Time elapsed: 0.396 sec
    [junit] Running org.apache.axis2.phaserule.BeforeAfterTest
    [junit] Tests run: 1, Failures: 0, Errors: 0, Time elapsed: 0.384 sec
    [junit] Running org.apache.axis2.phaserule.BeforeTest
    [junit] Tests run: 1, Failures: 0, Errors: 0, Time elapsed: 0.46 sec
    [junit] Running org.apache.axis2.phaserule.BeforeWithNoFirstHandlerTest
    [junit] Tests run: 1, Failures: 0, Errors: 0, Time elapsed: 0.491 sec
    [junit] Running org.apache.axis2.phaserule.InvalidPhaseFirstRulesTest
    [junit] Tests run: 1, Failures: 0, Errors: 0, Time elapsed: 0.484 sec
    [junit] Running org.apache.axis2.phaserule.InvalidPhaseFirstTest
    [junit] Tests run: 1, Failures: 0, Errors: 0, Time elapsed: 0.447 sec
    [junit] Running org.apache.axis2.phaserule.InvalidPhaseLastRuleTest
    [junit] Tests run: 1, Failures: 0, Errors: 0, Time elapsed: 0.422 sec
    [junit] Running org.apache.axis2.phaserule.InvalidPhaseRuleTest
    [junit] Tests run: 2, Failures: 0, Errors: 0, Time elapsed: 0.413 sec
    [junit] Running org.apache.axis2.phaserule.InvalidPhaselastTest
    [junit] Tests run: 1, Failures: 0, Errors: 0, Time elapsed: 0.431 sec
    [junit] Running org.apache.axis2.phaserule.PhaseFirstTest
    [junit] Tests run: 1, Failures: 0, Errors: 0, Time elapsed: 0.385 sec
    [junit] Running org.apache.axis2.phaserule.PhaseLastTest
    [junit] Tests run: 1, Failures: 0, Errors: 0, Time elapsed: 0.396 sec
    [junit] Running org.apache.axis2.phaserule.PhaseRuleTest
    [junit] Tests run: 1, Failures: 0, Errors: 0, Time elapsed: 0.389 sec
    [junit] Running org.apache.axis2.phaserule.PreDispatchPhaseRuleTest
    [junit] Tests run: 1, Failures: 0, Errors: 0, Time elapsed: 0.398 sec
    [junit] Running org.apache.axis2.phaserule.SingleHandlerPhaseTest
    [junit] Tests run: 1, Failures: 0, Errors: 0, Time elapsed: 0.432 sec
    [junit] Running org.apache.axis2.transport.tcp.TCPTransportTest
    [junit] Tests run: 1, Failures: 0, Errors: 0, Time elapsed: 0.339 sec
    [junit] Running org.apache.axis2.util.ThreadContextMigratorTest
    [junit] Tests run: 2, Failures: 0, Errors: 0, Time elapsed: 0.417 sec

jar:jar:
    [copy] Copying 1 file to /export/home/illsleyd/continuum/continuum-1.0.3/apps/continuum/working-directory/1/modules/kernel/target/classes/org/apache/axis2/i18n
    [jar] Building jar: /export/home/illsleyd/continuum/continuum-1.0.3/apps/continuum/working-directory/1/modules/kernel/target/axis2-kernel-SNAPSHOT.jar

jar:install:
    [echo] Installing...
Uploading to org.apache.axis2/jars/axis2-kernel-SNAPSHOT.jar: 
.................... (831K)
Uploading to org.apache.axis2/poms/axis2-kernel-SNAPSHOT.pom: 
.................... (15K)

+----------------------------------------
| Executing multiproject:install-callback Apache Axis 2.0 - Data Binding
| Memory: 11M/39M
+----------------------------------------
DEPRECATED: the default goal should be specified in the <build> section of project.xml instead of maven.xml
DEPRECATED: the default goal should be specified in the <build> section of project.xml instead of maven.xml

build:end:

Trying to get missing/snapshot dependencies required by Apache Axis 2.0 - Data Binding:
Attempting to download axiom-dom-SNAPSHOT.jar.
4/130K
8/130K
12/130K
16/130K
20/130K
24/130K
28/130K
32/130K
36/130K
40/130K
44/130K
48/130K
49/130K
51/130K
55/130K
58/130K
62/130K
65/130K
69/130K
72/130K
76/130K
79/130K
83/130K
86/130K
90/130K
93/130K
97/130K
100/130K
104/130K
108/130K
112/130K
115/130K
119/130K
122/130K
126/130K
130/130K
130/130K
130K downloaded
Error retrieving artifact from [http://people.apache.org/repo/m1-snapshot-repository/]: org.apache.maven.verifier.ChecksumVerificationException: Error retrieving checksum file for /org.apache.ws.commons.axiom/jars/axiom-dom-SNAPSHOT.jar
Skipping download as local copy is up to date!
Attempting to download axis2-kernel-SNAPSHOT.jar.
Skipping download as local copy is up to date!
build:start:

multiproject:install-callback:
    [echo] Running jar:install for Apache Axis 2.0 - Data Binding
java:prepare-filesystem:
    [mkdir] Created dir: /export/home/illsleyd/continuum/continuum-1.0.3/apps/continuum/working-directory/1/modules/adb/target/classes
Running post goal: java:prepare-filesystem

java:compile:
    [echo] Compiling to /export/home/illsleyd/continuum/continuum-1.0.3/apps/continuum/working-directory/1/modules/adb/target/classes
    [javac] Compiling 62 source files to /export/home/illsleyd/continuum/continuum-1.0.3/apps/continuum/working-directory/1/modules/adb/target/classes

java:jar-resources:
Copying 1 file to /export/home/illsleyd/continuum/continuum-1.0.3/apps/continuum/working-directory/1/modules/adb/target/classes
Copying 2 files to /export/home/illsleyd/continuum/continuum-1.0.3/apps/continuum/working-directory/1/modules/adb/target/classes/META-INF

test:test:
java:prepare-filesystem:
Running post goal: java:prepare-filesystem

java:compile:
    [echo] Compiling to /export/home/illsleyd/continuum/continuum-1.0.3/apps/continuum/working-directory/1/modules/adb/target/classes

java:jar-resources:

test:prepare-filesystem:
    [mkdir] Created dir: /export/home/illsleyd/continuum/continuum-1.0.3/apps/continuum/working-directory/1/modules/adb/target/test-classes
    [mkdir] Created dir: /export/home/illsleyd/continuum/continuum-1.0.3/apps/continuum/working-directory/1/modules/adb/target/test-reports

test:test-resources:
Copying 1 file to /export/home/illsleyd/continuum/continuum-1.0.3/apps/continuum/working-directory/1/modules/adb/target/test-classes
Copying 1 file to /export/home/illsleyd/continuum/continuum-1.0.3/apps/continuum/working-directory/1/modules/adb/target/test-classes

test:compile:
    [javac] Compiling 9 source files to /export/home/illsleyd/continuum/continuum-1.0.3/apps/continuum/working-directory/1/modules/adb/target/test-classes

    [junit] Running org.apache.axis2.databinding.ADBSOAPModelBuilderTest
    [junit] Tests run: 5, Failures: 0, Errors: 0, Time elapsed: 0.943 sec
    [junit] Running org.apache.axis2.databinding.utils.NamedStaxOMBuilderTest
    [junit] Tests run: 2, Failures: 0, Errors: 0, Time elapsed: 0.758 sec
    [junit] Running org.apache.axis2.databinding.utils.SimpleArrayReaderStateMachineTest
    [junit] Tests run: 4, Failures: 0, Errors: 0, Time elapsed: 0.549 sec
    [junit] Running org.apache.axis2.databinding.utils.SimpleElementReaderStateMachineTest
    [junit] Tests run: 3, Failures: 0, Errors: 0, Time elapsed: 0.614 sec
    [junit] Running org.apache.axis2.databinding.utils.reader.ADBXMLStreamReaderTest
    [junit] Tests run: 15, Failures: 0, Errors: 0, Time elapsed: 0.754 sec

jar:jar:
    [jar] Building jar: /export/home/illsleyd/continuum/continuum-1.0.3/apps/continuum/working-directory/1/modules/adb/target/axis2-adb-SNAPSHOT.jar

jar:install:
    [echo] Installing...
Uploading to org.apache.axis2/jars/axis2-adb-SNAPSHOT.jar: 
.................... (137K)
Uploading to org.apache.axis2/poms/axis2-adb-SNAPSHOT.pom: 
.................... (14K)

+----------------------------------------
| Executing multiproject:install-callback Apache Axis 2.0 - Code Generation
| Memory: 17M/40M
+----------------------------------------
DEPRECATED: the default goal should be specified in the <build> section of project.xml instead of maven.xml
DEPRECATED: the default goal should be specified in the <build> section of project.xml instead of maven.xml

build:end:

Trying to get missing/snapshot dependencies required by Apache Axis 2.0 - Code Generation:
Attempting to download axis2-adb-SNAPSHOT.jar.
Skipping download as local copy is up to date!
build:start:

multiproject:install-callback:
    [echo] Running jar:install for Apache Axis 2.0 - Code Generation
java:prepare-filesystem:
    [mkdir] Created dir: /export/home/illsleyd/continuum/continuum-1.0.3/apps/continuum/working-directory/1/modules/codegen/target/classes
Running post goal: java:prepare-filesystem

java:compile:
    [echo] Compiling to /export/home/illsleyd/continuum/continuum-1.0.3/apps/continuum/working-directory/1/modules/codegen/target/classes
    [javac] Compiling 69 source files to /export/home/illsleyd/continuum/continuum-1.0.3/apps/continuum/working-directory/1/modules/codegen/target/classes

java:jar-resources:
Copying 33 files to /export/home/illsleyd/continuum/continuum-1.0.3/apps/continuum/working-directory/1/modules/codegen/target/classes
Copying 2 files to /export/home/illsleyd/continuum/continuum-1.0.3/apps/continuum/working-directory/1/modules/codegen/target/classes/META-INF
Running post goal: java:jar-resources

test:test:
java:prepare-filesystem:
Running post goal: java:prepare-filesystem

java:compile:
    [echo] Compiling to /export/home/illsleyd/continuum/continuum-1.0.3/apps/continuum/working-directory/1/modules/codegen/target/classes

java:jar-resources:
Running post goal: java:jar-resources

test:prepare-filesystem:
    [mkdir] Created dir: /export/home/illsleyd/continuum/continuum-1.0.3/apps/continuum/working-directory/1/modules/codegen/target/test-classes
    [mkdir] Created dir: /export/home/illsleyd/continuum/continuum-1.0.3/apps/continuum/working-directory/1/modules/codegen/target/test-reports

test:test-resources:
Copying 6 files to /export/home/illsleyd/continuum/continuum-1.0.3/apps/continuum/working-directory/1/modules/codegen/target/test-classes
Copying 31 files to /export/home/illsleyd/continuum/continuum-1.0.3/apps/continuum/working-directory/1/modules/codegen/target/test-classes

test:compile:
    [javac] Compiling 2 source files to /export/home/illsleyd/continuum/continuum-1.0.3/apps/continuum/working-directory/1/modules/codegen/target/test-classes

    [junit] Running org.apache.axis2.wsdl.WSDLServiceBuilderTest
    [junit] Tests run: 1, Failures: 0, Errors: 0, Time elapsed: 4.632 sec
    [junit] Running org.apache.axis2.wsdl.codegen.extension.SchemaUnwrapperExtensionTest
    [junit] Tests run: 4, Failures: 0, Errors: 0, Time elapsed: 0.772 sec

jar:jar:
    [jar] Building jar: /export/home/illsleyd/continuum/continuum-1.0.3/apps/continuum/working-directory/1/modules/codegen/target/axis2-codegen-SNAPSHOT.jar

jar:install:
    [echo] Installing...
Uploading to org.apache.axis2/jars/axis2-codegen-SNAPSHOT.jar: 
.................... (178K)
Uploading to org.apache.axis2/poms/axis2-codegen-SNAPSHOT.pom: 
.................... (17K)

+----------------------------------------
| Executing multiproject:install-callback Apache Axis 2.0 - ADB Codegen
| Memory: 30M/40M
+----------------------------------------
DEPRECATED: the default goal should be specified in the <build> section of project.xml instead of maven.xml
DEPRECATED: the default goal should be specified in the <build> section of project.xml instead of maven.xml

build:end:

Trying to get missing/snapshot dependencies required by Apache Axis 2.0 - ADB Codegen:
Attempting to download axis2-codegen-SNAPSHOT.jar.
Skipping download as local copy is up to date!
build:start:

multiproject:install-callback:
    [echo] Running jar:install for Apache Axis 2.0 - ADB Codegen
java:prepare-filesystem:
    [mkdir] Created dir: /export/home/illsleyd/continuum/continuum-1.0.3/apps/continuum/working-directory/1/modules/adb-codegen/target/classes
Running post goal: java:prepare-filesystem

java:compile:
    [echo] Compiling to /export/home/illsleyd/continuum/continuum-1.0.3/apps/continuum/working-directory/1/modules/adb-codegen/target/classes
    [javac] Compiling 17 source files to /export/home/illsleyd/continuum/continuum-1.0.3/apps/continuum/working-directory/1/modules/adb-codegen/target/classes

java:jar-resources:
Copying 8 files to /export/home/illsleyd/continuum/continuum-1.0.3/apps/continuum/working-directory/1/modules/adb-codegen/target/classes
Copying 2 files to /export/home/illsleyd/continuum/continuum-1.0.3/apps/continuum/working-directory/1/modules/adb-codegen/target/classes/META-INF

test:test:
java:prepare-filesystem:
Running post goal: java:prepare-filesystem

java:compile:
    [echo] Compiling to /export/home/illsleyd/continuum/continuum-1.0.3/apps/continuum/working-directory/1/modules/adb-codegen/target/classes

java:jar-resources:

test:prepare-filesystem:
    [mkdir] Created dir: /export/home/illsleyd/continuum/continuum-1.0.3/apps/continuum/working-directory/1/modules/adb-codegen/target/test-classes
    [mkdir] Created dir: /export/home/illsleyd/continuum/continuum-1.0.3/apps/continuum/working-directory/1/modules/adb-codegen/target/test-reports

test:test-resources:
Copying 35 files to /export/home/illsleyd/continuum/continuum-1.0.3/apps/continuum/working-directory/1/modules/adb-codegen/target/test-classes
Copying 8 files to /export/home/illsleyd/continuum/continuum-1.0.3/apps/continuum/working-directory/1/modules/adb-codegen/target/test-classes

test:compile:
    [mkdir] Created dir: /export/home/illsleyd/continuum/continuum-1.0.3/apps/continuum/working-directory/1/modules/adb-codegen/target/schema
    [mkdir] Created dir: /export/home/illsleyd/continuum/continuum-1.0.3/apps/continuum/working-directory/1/modules/adb-codegen/target/schema/src
    [mkdir] Created dir: /export/home/illsleyd/continuum/continuum-1.0.3/apps/continuum/working-directory/1/modules/adb-codegen/target/schema/classes
    [echo] Compiling simple_maxOccurs2.xsd
    [echo] Compiling anonymous_complexType.xsd
    [echo] Compiling simple_choice.xsd
    [echo] Compiling simple_particle_all.xsd
    [echo] Compiling simple_maxOccurs.xsd
    [echo] Compiling simple_anytype.xsd
    [echo] Compiling simple-minoccurs0.xsd
    [echo] Compiling complex-minoccurs0.xsd
    [echo] Compiling simple-recursive-datatypes.xsd
    [echo] Compiling mixed_minoccus0.xsd
    [echo] Compiling complete.xsd
    [echo] Compiling simpleExtension.xsd
    [echo] Compiling union.xsd
    [echo] Compiling all.xsd
    [echo] Compiling enumeration.xsd
    [echo] Compiling restrictions.xsd
    [echo] Compiling choice.xsd
    [echo] Compiling list.xsd
    [javac] Compiling 178 source files to /export/home/illsleyd/continuum/continuum-1.0.3/apps/continuum/working-directory/1/modules/adb-codegen/target/schema/classes
    [javac] Note: Some input files use unchecked or unsafe operations.
    [javac] Note: Recompile with -Xlint:unchecked for details.
    [javac] Compiling 79 source files to /export/home/illsleyd/continuum/continuum-1.0.3/apps/continuum/working-directory/1/modules/adb-codegen/target/test-classes

    [junit] Running org.apache.axis2.schema.all.AllTest
    [junit] Tests run: 1, Failures: 0, Errors: 0, Time elapsed: 0.715 sec
    [junit] Running org.apache.axis2.schema.choice.ChiceTest
    [junit] Tests run: 1, Failures: 0, Errors: 0, Time elapsed: 0.953 sec
    [junit] Running org.apache.axis2.schema.compile.AnonymousComplexTypeTest
    [junit] Tests run: 1, Failures: 0, Errors: 0, Time elapsed: 3.336 sec
    [junit] Running org.apache.axis2.schema.compile.ComplexAllTest
    [junit] Tests run: 1, Failures: 0, Errors: 0, Time elapsed: 3.707 sec
    [junit] Running org.apache.axis2.schema.compile.ComplexExtensionTest
    [junit] Tests run: 1, Failures: 0, Errors: 0, Time elapsed: 3.13 sec
    [junit] Running org.apache.axis2.schema.compile.ImportTest
    [junit] Tests run: 1, Failures: 0, Errors: 0, Time elapsed: 3.976 sec
    [junit] Running org.apache.axis2.schema.compile.RecursiveCompileTest
    [junit] Tests run: 1, Failures: 0, Errors: 0, Time elapsed: 3.211 sec
    [junit] Running org.apache.axis2.schema.compile.SimpleAnyAttribTest
    [junit] Tests run: 1, Failures: 0, Errors: 0, Time elapsed: 3.081 sec
    [junit] Running org.apache.axis2.schema.compile.SimpleAnyTest
    [junit] Tests run: 1, Failures: 0, Errors: 0, Time elapsed: 3.42 sec
    [junit] Running org.apache.axis2.schema.compile.SimpleAnyTypeTest
    [junit] Tests run: 1, Failures: 0, Errors: 0, Time elapsed: 3.252 sec
    [junit] Running org.apache.axis2.schema.compile.SimpleAttributeTest
    [junit] Tests run: 1, Failures: 0, Errors: 0, Time elapsed: 3.924 sec
    [junit] Running org.apache.axis2.schema.compile.SimpleChoiceTest
    [junit] Tests run: 1, Failures: 0, Errors: 0, Time elapsed: 3.154 sec
    [junit] Running org.apache.axis2.schema.compile.SimpleContentExtensionTest
    [junit] Tests run: 1, Failures: 0, Errors: 0, Time elapsed: 3.508 sec
    [junit] Running org.apache.axis2.schema.compile.SimpleElementReferenceTest
    [junit] Tests run: 1, Failures: 0, Errors: 0, Time elapsed: 4.19 sec
    [junit] Running org.apache.axis2.schema.compile.SimpleElementTest
    [junit] Tests run: 1, Failures: 0, Errors: 0, Time elapsed: 3.225 sec
    [junit] Running org.apache.axis2.schema.compile.SimpleParticleAllTest
    [junit] Tests run: 1, Failures: 0, Errors: 0, Time elapsed: 3.631 sec
    [junit] Running org.apache.axis2.schema.compile.SimpleRestrictionTest
    [junit] Tests run: 1, Failures: 0, Errors: 0, Time elapsed: 3.097 sec
    [junit] Running org.apache.axis2.schema.compile.SimpleSequence2Test
    [junit] Tests run: 1, Failures: 0, Errors: 0, Time elapsed: 3.554 sec
    [junit] Running org.apache.axis2.schema.compile.SimpleSequenceTest
    [junit] Tests run: 1, Failures: 0, Errors: 0, Time elapsed: 3.116 sec
    [junit] Running org.apache.axis2.schema.compile.XmlMaxOccurs2Test
    [junit] Tests run: 1, Failures: 0, Errors: 0, Time elapsed: 3.13 sec
    [junit] Running org.apache.axis2.schema.compile.XmlmaxOccursTest
    [junit] Tests run: 1, Failures: 0, Errors: 0, Time elapsed: 4.491 sec
    [junit] Running org.apache.axis2.schema.compile.simple.SimpleTypeAllCompileTest
    [junit] Tests run: 1, Failures: 0, Errors: 0, Time elapsed: 3.166 sec
    [junit] Running org.apache.axis2.schema.enumeration.EnumerationTest
    [junit] Tests run: 1, Failures: 0, Errors: 0, Time elapsed: 0.573 sec
    [junit] Running org.apache.axis2.schema.extension.ComplexExtenstionTest
    [junit] Tests run: 1, Failures: 0, Errors: 0, Time elapsed: 0.601 sec
    [junit] Running org.apache.axis2.schema.extension.SimpleExtensionTest
    [junit] Tests run: 1, Failures: 0, Errors: 0, Time elapsed: 0.67 sec
    [junit] Running org.apache.axis2.schema.list.ListTest
    [junit] Tests run: 4, Failures: 0, Errors: 0, Time elapsed: 0.673 sec
    [junit] Running org.apache.axis2.schema.populate.derived.DerivedTypeBytePopulateTest
    [junit] Tests run: 1, Failures: 0, Errors: 0, Time elapsed: 0.699 sec
    [junit] Running org.apache.axis2.schema.populate.derived.DerivedTypeIntPopulateTest
    [junit] Tests run: 1, Failures: 0, Errors: 0, Time elapsed: 0.836 sec
    [junit] Running org.apache.axis2.schema.populate.derived.DerivedTypeIntegerPopulateTest
    [junit] Tests run: 1, Failures: 0, Errors: 0, Time elapsed: 0.682 sec
    [junit] Running org.apache.axis2.schema.populate.derived.DerivedTypeLongPopulateTest
    [junit] Tests run: 1, Failures: 0, Errors: 0, Time elapsed: 0.713 sec
    [junit] Running org.apache.axis2.schema.populate.derived.DerivedTypeNegativeIntegerPopulateTest
    [junit] Tests run: 1, Failures: 0, Errors: 0, Time elapsed: 0.737 sec
    [junit] Running org.apache.axis2.schema.populate.derived.DerivedTypeNonNegativeIntegerPopulateTest
    [junit] Tests run: 1, Failures: 0, Errors: 0, Time elapsed: 0.867 sec
    [junit] Running org.apache.axis2.schema.populate.derived.DerivedTypeNonPositiveIntegerPopulateTest
    [junit] Tests run: 1, Failures: 0, Errors: 0, Time elapsed: 0.94 sec
    [junit] Running org.apache.axis2.schema.populate.derived.DerivedTypePositveIntegerPopulateTest
    [junit] Tests run: 1, Failures: 0, Errors: 0, Time elapsed: 0.743 sec
    [junit] Running org.apache.axis2.schema.populate.derived.DerivedTypeShortPopulateTest
    [junit] Tests run: 1, Failures: 0, Errors: 0, Time elapsed: 0.858 sec
    [junit] Running org.apache.axis2.schema.populate.derived.DerivedTypeUnsignedBytePopulateTest
    [junit] Tests run: 1, Failures: 0, Errors: 0, Time elapsed: 0.807 sec
    [junit] Running org.apache.axis2.schema.populate.derived.DerivedTypeUnsignedIntPopulateTest
    [junit] Tests run: 1, Failures: 0, Errors: 0, Time elapsed: 0.721 sec
    [junit] Running org.apache.axis2.schema.populate.derived.DerivedTypeUnsignedLongPopulateTest
    [junit] Tests run: 1, Failures: 0, Errors: 0, Time elapsed: 0.775 sec
    [junit] Running org.apache.axis2.schema.populate.derived.DerivedTypeUnsignedShortPopulateTest
    [junit] Tests run: 1, Failures: 0, Errors: 0, Time elapsed: 0.834 sec
    [junit] Running org.apache.axis2.schema.populate.other.ADBInOutTest
    [junit] Tests run: 2, Failures: 0, Errors: 0, Time elapsed: 0.591 sec
    [junit] Running org.apache.axis2.schema.populate.other.PopulateAnonComplexTypeTest
    [junit] Tests run: 1, Failures: 0, Errors: 0, Time elapsed: 0.925 sec
    [junit] Running org.apache.axis2.schema.populate.other.PopulateAnyTypeTest
    [junit] Tests run: 1, Failures: 0, Errors: 0, Time elapsed: 0.783 sec
    [junit] Running org.apache.axis2.schema.populate.other.PopulateArrayInArrayTest
    [junit] Tests run: 1, Failures: 0, Errors: 0, Time elapsed: 0.583 sec
    [junit] Running org.apache.axis2.schema.populate.other.PopulateArrayTest
    [junit] Tests run: 1, Failures: 0, Errors: 0, Time elapsed: 0.537 sec
    [junit] Running org.apache.axis2.schema.populate.other.PopulateChoiceTest
    [junit] Tests run: 1, Failures: 0, Errors: 0, Time elapsed: 0.527 sec
    [junit] Running org.apache.axis2.schema.populate.other.PopulateComplexMinOccurs0Test
    [junit] Tests run: 4, Failures: 0, Errors: 0, Time elapsed: 0.796 sec
    [junit] Running org.apache.axis2.schema.populate.other.PopulateMinOccurs0Test
    [junit] Tests run: 3, Failures: 0, Errors: 0, Time elapsed: 0.528 sec
    [junit] Running org.apache.axis2.schema.populate.other.PopulateMixedMinoccurs0Test
    [junit] Tests run: 2, Failures: 0, Errors: 0, Time elapsed: 1.103 sec
    [junit] Running org.apache.axis2.schema.populate.other.PopulateParticleAllTest
    [junit] Tests run: 1, Failures: 0, Errors: 0, Time elapsed: 0.555 sec
    [junit] Running org.apache.axis2.schema.populate.other.PopulateRecursiveTest
    [junit] Tests run: 1, Failures: 0, Errors: 0, Time elapsed: 0.524 sec
    [junit] Running org.apache.axis2.schema.populate.simple.SimpleTypeAnyURIPopulateTest
    [junit] Tests run: 1, Failures: 0, Errors: 0, Time elapsed: 0.551 sec
    [junit] Running org.apache.axis2.schema.populate.simple.SimpleTypeBase64BinPopulateTest
    [junit] Tests run: 1, Failures: 0, Errors: 0, Time elapsed: 0.522 sec
    [junit] Running org.apache.axis2.schema.populate.simple.SimpleTypeBooleanPopulateTest
    [junit] Tests run: 1, Failures: 0, Errors: 0, Time elapsed: 0.534 sec
    [junit] Running org.apache.axis2.schema.populate.simple.SimpleTypeDatePopulateTest
    [junit] Tests run: 1, Failures: 0, Errors: 0, Time elapsed: 0.538 sec
    [junit] Running org.apache.axis2.schema.populate.simple.SimpleTypeDateTimePopulateTest
    [junit] Tests run: 1, Failures: 0, Errors: 0, Time elapsed: 0.563 sec
    [junit] Running org.apache.axis2.schema.populate.simple.SimpleTypeDayPopulateTest
    [junit] Tests run: 1, Failures: 0, Errors: 0, Time elapsed: 0.571 sec
    [junit] Running org.apache.axis2.schema.populate.simple.SimpleTypeDoublePopulateTest
    [junit] Tests run: 1, Failures: 0, Errors: 0, Time elapsed: 0.538 sec
    [junit] Running org.apache.axis2.schema.populate.simple.SimpleTypeDurationPopulateTest
    [junit] Tests run: 1, Failures: 0, Errors: 0, Time elapsed: 0.573 sec
    [junit] Running org.apache.axis2.schema.populate.simple.SimpleTypeFloatPopulateTest
    [junit] Tests run: 1, Failures: 0, Errors: 0, Time elapsed: 0.52 sec
    [junit] Running org.apache.axis2.schema.populate.simple.SimpleTypeHexBinaryPopulateTest
    [junit] Tests run: 1, Failures: 0, Errors: 0, Time elapsed: 0.535 sec
    [junit] Running org.apache.axis2.schema.populate.simple.SimpleTypeMonthDayPopulateTest
    [junit] Tests run: 1, Failures: 0, Errors: 0, Time elapsed: 0.52 sec
    [junit] Running org.apache.axis2.schema.populate.simple.SimpleTypeQNamePopulateTest
    [junit] Tests run: 1, Failures: 0, Errors: 0, Time elapsed: 0.503 sec
    [junit] Running org.apache.axis2.schema.populate.simple.SimpleTypeTimePopulateTest
    [junit] Tests run: 1, Failures: 0, Errors: 0, Time elapsed: 0.558 sec
    [junit] Running org.apache.axis2.schema.populate.simple.SimpleTypegMonthPopulateTest
    [junit] Tests run: 1, Failures: 0, Errors: 0, Time elapsed: 0.524 sec
    [junit] Running org.apache.axis2.schema.populate.simple.SimpleTypegYearMonthPopulateTest
    [junit] Tests run: 1, Failures: 0, Errors: 0, Time elapsed: 0.668 sec
    [junit] Running org.apache.axis2.schema.populate.simple.SimpleTypegYearPopulateTest
    [junit] Tests run: 1, Failures: 0, Errors: 0, Time elapsed: 0.78 sec
    [junit] Running org.apache.axis2.schema.restriction.ComplexRestrictionTest
    [junit] Tests run: 1, Failures: 0, Errors: 0, Time elapsed: 0.298 sec
    [junit] Running org.apache.axis2.schema.restriction.SimpleRestrictionTest
    [junit] Tests run: 4, Failures: 0, Errors: 0, Time elapsed: 0.728 sec
    [junit] Running org.apache.axis2.schema.testsuite.AnyElementsTest
    [junit] Tests run: 3, Failures: 0, Errors: 0, Time elapsed: 0.622 sec
    [junit] Running org.apache.axis2.schema.testsuite.CustomElementsTest
    [junit] Tests run: 3, Failures: 0, Errors: 0, Time elapsed: 0.612 sec
    [junit] Running org.apache.axis2.schema.testsuite.IntElementsTest
    [junit] Tests run: 3, Failures: 0, Errors: 0, Time elapsed: 0.634 sec
    [junit] Running org.apache.axis2.schema.testsuite.OuterElementsTest
    [junit] Tests run: 5, Failures: 0, Errors: 0, Time elapsed: 0.677 sec
    [junit] Running org.apache.axis2.schema.testsuite.StringElementsTest
    [junit] Tests run: 3, Failures: 0, Errors: 0, Time elapsed: 0.618 sec
    [junit] Running org.apache.axis2.schema.testsuite.XsdAnyElementsTest
    [junit] Tests run: 3, Failures: 0, Errors: 0, Time elapsed: 0.942 sec
    [junit] Running org.apache.axis2.schema.union.UnionTest
    [junit] Tests run: 4, Failures: 0, Errors: 0, Time elapsed: 0.615 sec

jar:jar:
    [jar] Building jar: /export/home/illsleyd/continuum/continuum-1.0.3/apps/continuum/working-directory/1/modules/adb-codegen/target/axis2-adb-codegen-SNAPSHOT.jar

jar:install:
    [echo] Installing...
Uploading to org.apache.axis2/jars/axis2-adb-codegen-SNAPSHOT.jar: 
.................... (118K)
Uploading to org.apache.axis2/poms/axis2-adb-codegen-SNAPSHOT.pom: 
.................... (15K)

+----------------------------------------
| Executing multiproject:install-callback Apache Axis 2.0 - Addressing
| Memory: 22M/46M
+----------------------------------------
DEPRECATED: the default goal should be specified in the <build> section of project.xml instead of maven.xml
DEPRECATED: the default goal should be specified in the <build> section of project.xml instead of maven.xml

build:end:

build:start:

multiproject:install-callback:
    [echo] Running jar:install for Apache Axis 2.0 - Addressing
java:prepare-filesystem:
    [mkdir] Created dir: /export/home/illsleyd/continuum/continuum-1.0.3/apps/continuum/working-directory/1/modules/addressing/target/classes
Running post goal: java:prepare-filesystem

java:compile:
    [echo] Compiling to /export/home/illsleyd/continuum/continuum-1.0.3/apps/continuum/working-directory/1/modules/addressing/target/classes
    [javac] Compiling 9 source files to /export/home/illsleyd/continuum/continuum-1.0.3/apps/continuum/working-directory/1/modules/addressing/target/classes
Running post goal: java:compile
    [mkdir] Created dir: /export/home/illsleyd/continuum/continuum-1.0.3/apps/continuum/working-directory/1/modules/addressing/target/classes/META-INF
    [copy] Copying 1 file to /export/home/illsleyd/continuum/continuum-1.0.3/apps/continuum/working-directory/1/modules/addressing/target/classes/META-INF
    [copy] Copying 1 file to /export/home/illsleyd/continuum/continuum-1.0.3/apps/continuum/working-directory/1/modules/addressing/target/classes/META-INF
    [copy] Copying 1 file to /export/home/illsleyd/continuum/continuum-1.0.3/apps/continuum/working-directory/1/modules/addressing/target/classes/META-INF
    [copy] Copying 1 file to /export/home/illsleyd/continuum/continuum-1.0.3/apps/continuum/working-directory/1/modules/addressing/target
    [mkdir] Created dir: /export/home/illsleyd/continuum/continuum-1.0.3/apps/continuum/working-directory/1/modules/addressing/target/modules
    [jar] Building jar: /export/home/illsleyd/continuum/continuum-1.0.3/apps/continuum/working-directory/1/modules/addressing/target/addressing-SNAPSHOT.mar
    [copy] Copying 1 file to /export/home/illsleyd/continuum/continuum-1.0.3/apps/continuum/working-directory/1/modules/addressing/target/modules
    [copy] Copying 1 file to /export/home/illsleyd/.maven/repository/org.apache.axis2/mars

java:jar-resources:
Copying 1 file to /export/home/illsleyd/continuum/continuum-1.0.3/apps/continuum/working-directory/1/modules/addressing/target/classes

test:test:
java:prepare-filesystem:
Running post goal: java:prepare-filesystem

java:compile:
    [echo] Compiling to /export/home/illsleyd/continuum/continuum-1.0.3/apps/continuum/working-directory/1/modules/addressing/target/classes
Running post goal: java:compile
    [copy] Copying 1 file to /export/home/illsleyd/continuum/continuum-1.0.3/apps/continuum/working-directory/1/modules/addressing/target/classes/META-INF
    [copy] Copying 1 file to /export/home/illsleyd/continuum/continuum-1.0.3/apps/continuum/working-directory/1/modules/addressing/target/classes/META-INF
    [jar] Building jar: /export/home/illsleyd/continuum/continuum-1.0.3/apps/continuum/working-directory/1/modules/addressing/target/addressing-SNAPSHOT.mar

java:jar-resources:

test:prepare-filesystem:
    [mkdir] Created dir: /export/home/illsleyd/continuum/continuum-1.0.3/apps/continuum/working-directory/1/modules/addressing/target/test-classes
    [mkdir] Created dir: /export/home/illsleyd/continuum/continuum-1.0.3/apps/continuum/working-directory/1/modules/addressing/target/test-reports

test:test-resources:
Copying 35 files to /export/home/illsleyd/continuum/continuum-1.0.3/apps/continuum/working-directory/1/modules/addressing/target/test-classes
Copying 2 files to /export/home/illsleyd/continuum/continuum-1.0.3/apps/continuum/working-directory/1/modules/addressing/target/test-classes

test:compile:
    [javac] Compiling 8 source files to /export/home/illsleyd/continuum/continuum-1.0.3/apps/continuum/working-directory/1/modules/addressing/target/test-classes
    [javac] Note: /export/home/illsleyd/continuum/continuum-1.0.3/apps/continuum/working-directory/1/modules/addressing/test/org/apache/axis2/handlers/addressing/AddressingOutHandlerTest.java uses or overrides a deprecated API.
    [javac] Note: Recompile with -Xlint:deprecation for details.

    [junit] Running org.apache.axis2.addressing.AddressingFaultsTest
    [junit] Tests run: 6, Failures: 0, Errors: 0, Time elapsed: 0.42 sec
    [junit] Running org.apache.axis2.handlers.addressing.AddressingFinalInHandlerTest
    [junit] Tests run: 17, Failures: 0, Errors: 0, Time elapsed: 0.763 sec
    [junit] Running org.apache.axis2.handlers.addressing.AddressingInFaultHandlerTest
    [junit] Tests run: 4, Failures: 0, Errors: 0, Time elapsed: 1.085 sec
    [junit] Running org.apache.axis2.handlers.addressing.AddressingOutHandlerTest
    [junit] Tests run: 6, Failures: 0, Errors: 0, Time elapsed: 1.979 sec
    [junit] Running org.apache.axis2.handlers.addressing.AddressingSubmissionInHandlerTest
    [junit] Tests run: 14, Failures: 0, Errors: 0, Time elapsed: 0.657 sec
    [junit] Running org.apache.axis2.handlers.addressing.AddressingValidationHandlerTest
    [junit] Tests run: 4, Failures: 0, Errors: 0, Time elapsed: 1.124 sec

jar:jar:
    [jar] Building jar: /export/home/illsleyd/continuum/continuum-1.0.3/apps/continuum/working-directory/1/modules/addressing/target/axis2-addressing-SNAPSHOT.jar

jar:install:
    [echo] Installing...
Uploading to org.apache.axis2/jars/axis2-addressing-SNAPSHOT.jar: 
.................... (36K)
Uploading to org.apache.axis2/poms/axis2-addressing-SNAPSHOT.pom: 
.................... (15K)

+----------------------------------------
| Executing multiproject:install-callback Apache Axis 2.0 - Samples
| Memory: 25M/47M
+----------------------------------------
DEPRECATED: the default goal should be specified in the <build> section of project.xml instead of maven.xml
DEPRECATED: the default goal should be specified in the <build> section of project.xml instead of maven.xml

build:end:

Trying to get missing/snapshot dependencies required by Apache Axis 2.0 - Samples:
Attempting to download axis2-addressing-SNAPSHOT.jar.
Skipping download as local copy is up to date!
build:start:

multiproject:install-callback:
    [echo] Running jar:install for Apache Axis 2.0 - Samples
java:prepare-filesystem:
    [mkdir] Created dir: /export/home/illsleyd/continuum/continuum-1.0.3/apps/continuum/working-directory/1/modules/samples/target/classes
Running post goal: java:prepare-filesystem

java:compile:
    [echo] Compiling to /export/home/illsleyd/continuum/continuum-1.0.3/apps/continuum/working-directory/1/modules/samples/target/classes
    [javac] Compiling 5 source files to /export/home/illsleyd/continuum/continuum-1.0.3/apps/continuum/working-directory/1/modules/samples/target/classes

java:jar-resources:
Copying 2 files to /export/home/illsleyd/continuum/continuum-1.0.3/apps/continuum/working-directory/1/modules/samples/target/classes/META-INF

test:test:
java:prepare-filesystem:
Running post goal: java:prepare-filesystem

java:compile:
Overriding previous definition of reference to samples.src.path
    [echo] Compiling to /export/home/illsleyd/continuum/continuum-1.0.3/apps/continuum/working-directory/1/modules/samples/target/classes

java:jar-resources:

test:prepare-filesystem:
    [mkdir] Created dir: /export/home/illsleyd/continuum/continuum-1.0.3/apps/continuum/working-directory/1/modules/samples/target/test-classes
    [mkdir] Created dir: /export/home/illsleyd/continuum/continuum-1.0.3/apps/continuum/working-directory/1/modules/samples/target/test-reports

test:test-resources:

test:compile:

Running post goal: test:test
create-samples:
    [mkdir] Created dir: /export/home/illsleyd/continuum/continuum-1.0.3/apps/continuum/working-directory/1/modules/samples/target/samples/userguide
    [mkdir] Created dir: /export/home/illsleyd/continuum/continuum-1.0.3/apps/continuum/working-directory/1/modules/samples/target/samples/wsdl
    [copy] Copying 2 files to /export/home/illsleyd/continuum/continuum-1.0.3/apps/continuum/working-directory/1/modules/samples/target/samples/wsdl
userguide:
    [mkdir] Created dir: /export/home/illsleyd/continuum/continuum-1.0.3/apps/continuum/working-directory/1/modules/samples/target/samples/userguide/src
    [copy] Copying 22 files to /export/home/illsleyd/continuum/continuum-1.0.3/apps/continuum/working-directory/1/modules/samples/target/samples/userguide/src
    [jar] Building MANIFEST-only jar: /export/home/illsleyd/continuum/continuum-1.0.3/apps/continuum/working-directory/1/modules/samples/target/samples/userguide/sample.jar

googleSpellcheck:
    [mkdir] Created dir: /export/home/illsleyd/continuum/continuum-1.0.3/apps/continuum/working-directory/1/modules/samples/target/googlespellcheck
    [jar] Building MANIFEST-only jar: /export/home/illsleyd/continuum/continuum-1.0.3/apps/continuum/working-directory/1/modules/samples/target/googlespellcheck/googleSpellcheck.jar

yahooRESTSearch:
    [mkdir] Created dir: /export/home/illsleyd/continuum/continuum-1.0.3/apps/continuum/working-directory/1/modules/samples/target/yahoorestsearch
    [jar] Building jar: /export/home/illsleyd/continuum/continuum-1.0.3/apps/continuum/working-directory/1/modules/samples/target/yahoorestsearch/yahooRESTSearch.jar

version:
    [mkdir] Created dir: /export/home/illsleyd/continuum/continuum-1.0.3/apps/continuum/working-directory/1/modules/samples/target/version
    [jar] Building jar: /export/home/illsleyd/continuum/continuum-1.0.3/apps/continuum/working-directory/1/modules/samples/target/version/version.jar
    [copy] Copying 1 file to /export/home/illsleyd/continuum/continuum-1.0.3/apps/continuum/working-directory/1/modules/samples/target/toWar/services

groovy:
    [mkdir] Created dir: /export/home/illsleyd/continuum/continuum-1.0.3/apps/continuum/working-directory/1/modules/samples/target/groovy
    [copy] Copying 1 file to /export/home/illsleyd/continuum/continuum-1.0.3/apps/continuum/working-directory/1/modules/samples/target/classes/sample/groovy
    [mkdir] Created dir: /export/home/illsleyd/continuum/continuum-1.0.3/apps/continuum/working-directory/1/modules/samples/target/classes/sample/groovy/lib
    [mkdir] Created dir: /export/home/illsleyd/continuum/continuum-1.0.3/apps/continuum/working-directory/1/modules/samples/target/classes/sample/groovy/META-INF
    [mkdir] Created dir: /export/home/illsleyd/continuum/continuum-1.0.3/apps/continuum/working-directory/1/modules/samples/target/classes/sample/groovy/sample
    [mkdir] Created dir: /export/home/illsleyd/continuum/continuum-1.0.3/apps/continuum/working-directory/1/modules/samples/target/classes/sample/groovy/sample/groovy
    [copy] Copying 1 file to /export/home/illsleyd/continuum/continuum-1.0.3/apps/continuum/working-directory/1/modules/samples/target/classes/sample/groovy/sample/groovy
    [copy] Copying 1 file to /export/home/illsleyd/continuum/continuum-1.0.3/apps/continuum/working-directory/1/modules/samples/target/classes/sample/groovy/META-INF
    [delete] Deleting: /export/home/illsleyd/continuum/continuum-1.0.3/apps/continuum/working-directory/1/modules/samples/target/classes/sample/groovy/GroovyReceiver.class
    [copy] Copying 1 file to /export/home/illsleyd/continuum/continuum-1.0.3/apps/continuum/working-directory/1/modules/samples/target/classes/sample/groovy/lib
    [jar] Building jar: /export/home/illsleyd/continuum/continuum-1.0.3/apps/continuum/working-directory/1/modules/samples/target/groovy/groovyService.aar



jar:jar:
    [jar] Building jar: /export/home/illsleyd/continuum/continuum-1.0.3/apps/continuum/working-directory/1/modules/samples/target/axis2-samples-SNAPSHOT.jar

jar:install:
    [echo] Installing...
Uploading to org.apache.axis2/jars/axis2-samples-SNAPSHOT.jar: 
.................... (1623K)
Uploading to org.apache.axis2/poms/axis2-samples-SNAPSHOT.pom: 
.................... (16K)

+----------------------------------------
| Executing multiproject:install-callback Apache Axis 2.0 - spring
| Memory: 28M/48M
+----------------------------------------
DEPRECATED: the default goal should be specified in the <build> section of project.xml instead of maven.xml
DEPRECATED: the default goal should be specified in the <build> section of project.xml instead of maven.xml

build:end:

build:start:

multiproject:install-callback:
    [echo] Running jar:install for Apache Axis 2.0 - spring
java:prepare-filesystem:
    [mkdir] Created dir: /export/home/illsleyd/continuum/continuum-1.0.3/apps/continuum/working-directory/1/modules/spring/target/classes
Running post goal: java:prepare-filesystem

java:compile:
    [echo] Compiling to /export/home/illsleyd/continuum/continuum-1.0.3/apps/continuum/working-directory/1/modules/spring/target/classes
    [javac] Compiling 3 source files to /export/home/illsleyd/continuum/continuum-1.0.3/apps/continuum/working-directory/1/modules/spring/target/classes

java:jar-resources:
Copying 2 files to /export/home/illsleyd/continuum/continuum-1.0.3/apps/continuum/working-directory/1/modules/spring/target/classes/META-INF

test:test:
    [echo] No tests to run.

jar:jar:
    [jar] Building jar: /export/home/illsleyd/continuum/continuum-1.0.3/apps/continuum/working-directory/1/modules/spring/target/axis2-spring-SNAPSHOT.jar

jar:install:
    [echo] Installing...
Uploading to org.apache.axis2/jars/axis2-spring-SNAPSHOT.jar: 
.................... (9K)
Uploading to org.apache.axis2/poms/axis2-spring-SNAPSHOT.pom: 
.................... (14K)

+----------------------------------------
| Executing multiproject:install-callback Apache Axis 2.0 - XMLBeans Data Binding
| Memory: 24M/48M
+----------------------------------------
DEPRECATED: the default goal should be specified in the <build> section of project.xml instead of maven.xml
DEPRECATED: the default goal should be specified in the <build> section of project.xml instead of maven.xml

build:end:

build:start:

multiproject:install-callback:
    [echo] Running jar:install for Apache Axis 2.0 - XMLBeans Data Binding
java:prepare-filesystem:
    [mkdir] Created dir: /export/home/illsleyd/continuum/continuum-1.0.3/apps/continuum/working-directory/1/modules/xmlbeans/target/classes
Running post goal: java:prepare-filesystem

java:compile:
    [echo] Compiling to /export/home/illsleyd/continuum/continuum-1.0.3/apps/continuum/working-directory/1/modules/xmlbeans/target/classes
    [javac] Compiling 2 source files to /export/home/illsleyd/continuum/continuum-1.0.3/apps/continuum/working-directory/1/modules/xmlbeans/target/classes

java:jar-resources:
Copying 1 file to /export/home/illsleyd/continuum/continuum-1.0.3/apps/continuum/working-directory/1/modules/xmlbeans/target/classes
Copying 2 files to /export/home/illsleyd/continuum/continuum-1.0.3/apps/continuum/working-directory/1/modules/xmlbeans/target/classes/META-INF

test:test:
java:prepare-filesystem:
Running post goal: java:prepare-filesystem

java:compile:
    [echo] Compiling to /export/home/illsleyd/continuum/continuum-1.0.3/apps/continuum/working-directory/1/modules/xmlbeans/target/classes

java:jar-resources:

test:prepare-filesystem:
    [mkdir] Created dir: /export/home/illsleyd/continuum/continuum-1.0.3/apps/continuum/working-directory/1/modules/xmlbeans/target/test-classes
    [mkdir] Created dir: /export/home/illsleyd/continuum/continuum-1.0.3/apps/continuum/working-directory/1/modules/xmlbeans/target/test-reports

test:test-resources:
Copying 23 files to /export/home/illsleyd/continuum/continuum-1.0.3/apps/continuum/working-directory/1/modules/xmlbeans/target/test-classes
Copying 1 file to /export/home/illsleyd/continuum/continuum-1.0.3/apps/continuum/working-directory/1/modules/xmlbeans/target/test-classes

test:compile:
    [javac] Compiling 16 source files to /export/home/illsleyd/continuum/continuum-1.0.3/apps/continuum/working-directory/1/modules/xmlbeans/target/test-classes

    [junit] Running org.apache.axis2.xmlbeans.WSDL2Java10Test
    [junit] Tests run: 1, Failures: 0, Errors: 0, Time elapsed: 17.368 sec
    [junit] Running org.apache.axis2.xmlbeans.WSDL2Java11Test
    [junit] Tests run: 1, Failures: 0, Errors: 0, Time elapsed: 18.452 sec
    [junit] Running org.apache.axis2.xmlbeans.WSDL2Java12Test
    [junit] Tests run: 1, Failures: 0, Errors: 0, Time elapsed: 4.047 sec
    [junit] Running org.apache.axis2.xmlbeans.WSDL2Java13Test
    [junit] Tests run: 1, Failures: 0, Errors: 0, Time elapsed: 0.822 sec
    [junit] Running org.apache.axis2.xmlbeans.WSDL2Java1Test
    [junit] Tests run: 1, Failures: 0, Errors: 0, Time elapsed: 18.28 sec
    [junit] Running org.apache.axis2.xmlbeans.WSDL2Java2Test
    [junit] Tests run: 1, Failures: 0, Errors: 0, Time elapsed: 0.781 sec
    [junit] Running org.apache.axis2.xmlbeans.WSDL2Java3Test
    [junit] Tests run: 1, Failures: 0, Errors: 0, Time elapsed: 20.374 sec
    [junit] Running org.apache.axis2.xmlbeans.WSDL2Java4Test
    [junit] Tests run: 1, Failures: 0, Errors: 0, Time elapsed: 16.298 sec
    [junit] Running org.apache.axis2.xmlbeans.WSDL2Java5Test
    [junit] Tests run: 1, Failures: 0, Errors: 0, Time elapsed: 24.541 sec
    [junit] Running org.apache.axis2.xmlbeans.WSDL2Java6Test
    [junit] Tests run: 1, Failures: 0, Errors: 0, Time elapsed: 18.265 sec
    [junit] Running org.apache.axis2.xmlbeans.WSDL2Java7Test
    [junit] Tests run: 1, Failures: 0, Errors: 0, Time elapsed: 22.149 sec
    [junit] Running org.apache.axis2.xmlbeans.WSDL2Java8Test
    [junit] Tests run: 1, Failures: 0, Errors: 0, Time elapsed: 22.941 sec
    [junit] Running org.apache.axis2.xmlbeans.WSDL2Java9Test
    [junit] Tests run: 1, Failures: 0, Errors: 0, Time elapsed: 23.17 sec

jar:jar:
    [jar] Building jar: /export/home/illsleyd/continuum/continuum-1.0.3/apps/continuum/working-directory/1/modules/xmlbeans/target/axis2-xmlbeans-SNAPSHOT.jar

jar:install:
    [echo] Installing...
Uploading to org.apache.axis2/jars/axis2-xmlbeans-SNAPSHOT.jar: 
.................... (22K)
Uploading to org.apache.axis2/poms/axis2-xmlbeans-SNAPSHOT.pom: 
.................... (15K)

+----------------------------------------
| Executing multiproject:install-callback Apache Axis 2.0 - Tools
| Memory: 29M/48M
+----------------------------------------
DEPRECATED: the default goal should be specified in the <build> section of project.xml instead of maven.xml
DEPRECATED: the default goal should be specified in the <build> section of project.xml instead of maven.xml

build:end:

build:start:

multiproject:install-callback:
    [echo] Running jar:install for Apache Axis 2.0 - Tools
java:prepare-filesystem:
    [mkdir] Created dir: /export/home/illsleyd/continuum/continuum-1.0.3/apps/continuum/working-directory/1/modules/tool/target/classes
Running post goal: java:prepare-filesystem

java:compile:
    [echo] Compiling to /export/home/illsleyd/continuum/continuum-1.0.3/apps/continuum/working-directory/1/modules/tool/target/classes
    [javac] Compiling 1 source file to /export/home/illsleyd/continuum/continuum-1.0.3/apps/continuum/working-directory/1/modules/tool/target/classes

java:jar-resources:
Copying 2 files to /export/home/illsleyd/continuum/continuum-1.0.3/apps/continuum/working-directory/1/modules/tool/target/classes
Copying 2 files to /export/home/illsleyd/continuum/continuum-1.0.3/apps/continuum/working-directory/1/modules/tool/target/classes/META-INF

test:test:
    [echo] No tests to run.

jar:jar:
    [jar] Building jar: /export/home/illsleyd/continuum/continuum-1.0.3/apps/continuum/working-directory/1/modules/tool/target/axis2-tools-SNAPSHOT.jar

jar:install:
    [echo] Installing...
Uploading to org.apache.axis2/jars/axis2-tools-SNAPSHOT.jar: 
.................... (9K)
Uploading to org.apache.axis2/poms/axis2-tools-SNAPSHOT.pom: 
.................... (13K)

+----------------------------------------
| Executing multiproject:install-callback Apache Axis 2.0 - Integration
| Memory: 26M/48M
+----------------------------------------
DEPRECATED: the default goal should be specified in the <build> section of project.xml instead of maven.xml
DEPRECATED: the default goal should be specified in the <build> section of project.xml instead of maven.xml

build:end:

Trying to get missing/snapshot dependencies required by Apache Axis 2.0 - Integration:
Attempting to download axis2-adb-codegen-SNAPSHOT.jar.
Skipping download as local copy is up to date!
Attempting to download axis2-samples-SNAPSHOT.jar.
Skipping download as local copy is up to date!
Attempting to download axis2-spring-SNAPSHOT.jar.
Skipping download as local copy is up to date!
Attempting to download axis2-xmlbeans-SNAPSHOT.jar.
Skipping download as local copy is up to date!
Attempting to download axis2-tools-SNAPSHOT.jar.
Skipping download as local copy is up to date!
build:start:

multiproject:install-callback:
    [echo] Running jar:install for Apache Axis 2.0 - Integration
java:prepare-filesystem:
    [mkdir] Created dir: /export/home/illsleyd/continuum/continuum-1.0.3/apps/continuum/working-directory/1/modules/integration/target/classes
Running post goal: java:prepare-filesystem

java:compile:
    [echo] Compiling to /export/home/illsleyd/continuum/continuum-1.0.3/apps/continuum/working-directory/1/modules/integration/target/classes
    [javac] Compiling 136 source files to /export/home/illsleyd/continuum/continuum-1.0.3/apps/continuum/working-directory/1/modules/integration/target/classes
    [javac] Note: /export/home/illsleyd/continuum/continuum-1.0.3/apps/continuum/working-directory/1/modules/integration/src/test/soap12testing/client/SOAPComparator.java uses or overrides a deprecated API.
    [javac] Note: Recompile with -Xlint:deprecation for details.

java:jar-resources:
Copying 1 file to /export/home/illsleyd/continuum/continuum-1.0.3/apps/continuum/working-directory/1/modules/integration/target/classes

test:test:
java:prepare-filesystem:
Running post goal: java:prepare-filesystem

java:compile:
    [echo] Compiling to /export/home/illsleyd/continuum/continuum-1.0.3/apps/continuum/working-directory/1/modules/integration/target/classes
    [javac] Compiling 10 source files to /export/home/illsleyd/continuum/continuum-1.0.3/apps/continuum/working-directory/1/modules/integration/target/classes

java:jar-resources:

test:prepare-filesystem:
    [mkdir] Created dir: /export/home/illsleyd/continuum/continuum-1.0.3/apps/continuum/working-directory/1/modules/integration/target/test-classes
    [mkdir] Created dir: /export/home/illsleyd/continuum/continuum-1.0.3/apps/continuum/working-directory/1/modules/integration/target/test-reports

test:test-resources:
Copying 147 files to /export/home/illsleyd/continuum/continuum-1.0.3/apps/continuum/working-directory/1/modules/integration/target/test-classes

test:compile:
    [copy] Copying 1 file to /export/home/illsleyd/continuum/continuum-1.0.3/apps/continuum/working-directory/1/modules/integration/target/test-classes/modules
    [java] log4j:WARN No appenders could be found for logger (org.apache.axis2.description.AxisService).
    [java] log4j:WARN Please initialize the log4j system properly.
    [copy] Copying 1 file to /export/home/illsleyd/continuum/continuum-1.0.3/apps/continuum/working-directory/1/modules/integration/target/perf/src/samples/wsdl/perf
    [mkdir] Created dir: /export/home/illsleyd/continuum/continuum-1.0.3/apps/continuum/working-directory/1/modules/integration/target/perf/build
    [mkdir] Created dir: /export/home/illsleyd/continuum/continuum-1.0.3/apps/continuum/working-directory/1/modules/integration/target/perf/build/classes
    [mkdir] Created dir: /export/home/illsleyd/continuum/continuum-1.0.3/apps/continuum/working-directory/1/modules/integration/target/perf/build/lib
    [jar] Building jar: /export/home/illsleyd/continuum/continuum-1.0.3/apps/continuum/working-directory/1/modules/integration/target/perf/build/lib/XBeans-packaged.jar
    [echo] XmlBeans Availability = true
    [echo] Stax Availability= true
    [echo] Axis2 Availability= true
    [javac] Compiling 211 source files to /export/home/illsleyd/continuum/continuum-1.0.3/apps/continuum/working-directory/1/modules/integration/target/perf/build/classes
    [javac] Note: Some input files use or override a deprecated API.
    [javac] Note: Recompile with -Xlint:deprecation for details.
    [javac] Note: Some input files use unchecked or unsafe operations.
    [javac] Note: Recompile with -Xlint:unchecked for details.
    [copy] Copying 2 files to /export/home/illsleyd/continuum/continuum-1.0.3/apps/continuum/working-directory/1/modules/integration/target/perf/build/classes/META-INF
    [copy] Copying 1 file to /export/home/illsleyd/continuum/continuum-1.0.3/apps/continuum/working-directory/1/modules/integration/target/perf/build/classes/lib
    [jar] Building jar: /export/home/illsleyd/continuum/continuum-1.0.3/apps/continuum/working-directory/1/modules/integration/target/perf/build/lib/PerfPortType.aar
    [mkdir] Created dir: /export/home/illsleyd/continuum/continuum-1.0.3/apps/continuum/working-directory/1/modules/integration/target/perf/build/repo
    [mkdir] Created dir: /export/home/illsleyd/continuum/continuum-1.0.3/apps/continuum/working-directory/1/modules/integration/target/perf/build/repo/services
    [copy] Copying 1 file to /export/home/illsleyd/continuum/continuum-1.0.3/apps/continuum/working-directory/1/modules/integration/target/perf/build/repo/services
    [echo] XmlBeans Availability = true
    [echo] Stax Availability= true
    [echo] Axis2 Availability= true
    [javac] Compiling 1 source file to /export/home/illsleyd/continuum/continuum-1.0.3/apps/continuum/working-directory/1/modules/integration/target/perf/build/classes
    [javac] /export/home/illsleyd/continuum/continuum-1.0.3/apps/continuum/working-directory/1/modules/integration/target/perf/test/samples/wsdl/perf/PerfPortTypeTest.java:46: warning: non-varargs call of varargs method with inexact argument type for last parameter;
    [javac] cast to java.lang.Class for a varargs call
    [javac] cast to java.lang.Class[] for a non-varargs call and to suppress this warning
    [javac]                             creatorMethod = declaredClass.getMethod("newInstance",null);
    [javac]                                                                                   ^
    [javac] /export/home/illsleyd/continuum/continuum-1.0.3/apps/continuum/working-directory/1/modules/integration/target/perf/test/samples/wsdl/perf/PerfPortTypeTest.java:53: warning: non-varargs call of varargs method with inexact argument type for last parameter;
    [javac] cast to java.lang.Object for a varargs call
    [javac] cast to java.lang.Object[] for a non-varargs call and to suppress this warning
    [javac]                     return  (org.apache.xmlbeans.XmlObject)creatorMethod.invoke(null,null);
    [javac]                                                                                      ^
    [javac] 2 warnings
    [jar] Building jar: /export/home/illsleyd/continuum/continuum-1.0.3/apps/continuum/working-directory/1/modules/integration/target/perf/build/lib/PerfPortType-test-client.jar
    [move] Moving 1 file to /export/home/illsleyd/continuum/continuum-1.0.3/apps/continuum/working-directory/1/modules/integration/target/perf/build/lib
    [move] Moving 1 file to /export/home/illsleyd/continuum/continuum-1.0.3/apps/continuum/working-directory/1/modules/integration/target/perf/build/lib
    [java] log4j:WARN No appenders could be found for logger (org.apache.axis2.description.AxisService).
    [java] log4j:WARN Please initialize the log4j system properly.
    [copy] Copying 1 file to /export/home/illsleyd/continuum/continuum-1.0.3/apps/continuum/working-directory/1/modules/integration/target/perf2/src/samples/wsdl/perf2
    [mkdir] Created dir: /export/home/illsleyd/continuum/continuum-1.0.3/apps/continuum/working-directory/1/modules/integration/target/perf2/build
    [mkdir] Created dir: /export/home/illsleyd/continuum/continuum-1.0.3/apps/continuum/working-directory/1/modules/integration/target/perf2/build/classes
    [mkdir] Created dir: /export/home/illsleyd/continuum/continuum-1.0.3/apps/continuum/working-directory/1/modules/integration/target/perf2/build/lib
    [echo] Stax Availability= true
    [echo] Axis2 Availability= true
    [javac] Compiling 6 source files to /export/home/illsleyd/continuum/continuum-1.0.3/apps/continuum/working-directory/1/modules/integration/target/perf2/build/classes
    [javac] Note: Some input files use unchecked or unsafe operations.
    [javac] Note: Recompile with -Xlint:unchecked for details.
    [copy] Copying 2 files to /export/home/illsleyd/continuum/continuum-1.0.3/apps/continuum/working-directory/1/modules/integration/target/perf2/build/classes/META-INF
    [jar] Building jar: /export/home/illsleyd/continuum/continuum-1.0.3/apps/continuum/working-directory/1/modules/integration/target/perf2/build/lib/PerfPortType.aar
    [mkdir] Created dir: /export/home/illsleyd/continuum/continuum-1.0.3/apps/continuum/working-directory/1/modules/integration/target/perf2/build/repo
    [mkdir] Created dir: /export/home/illsleyd/continuum/continuum-1.0.3/apps/continuum/working-directory/1/modules/integration/target/perf2/build/repo/services
    [copy] Copying 1 file to /export/home/illsleyd/continuum/continuum-1.0.3/apps/continuum/working-directory/1/modules/integration/target/perf2/build/repo/services
    [echo] Stax Availability= true
    [echo] Axis2 Availability= true
    [javac] Compiling 1 source file to /export/home/illsleyd/continuum/continuum-1.0.3/apps/continuum/working-directory/1/modules/integration/target/perf2/build/classes
    [jar] Building jar: /export/home/illsleyd/continuum/continuum-1.0.3/apps/continuum/working-directory/1/modules/integration/target/perf2/build/lib/PerfPortType-test-client.jar
    [move] Moving 1 file to /export/home/illsleyd/continuum/continuum-1.0.3/apps/continuum/working-directory/1/modules/integration/target/perf2/build/lib
    [java] Time to build schema type system: 1.7 seconds
    [java] Time to generate code: 1.168 seconds
    [java] Time to compile code: 8.182 seconds
    [echo] Running codegen RPC WSDLs - take 1
    [java] log4j:WARN No appenders could be found for logger (org.apache.axis2.description.AxisService).
    [java] log4j:WARN Please initialize the log4j system properly.
    [mkdir] Created dir: /export/home/illsleyd/continuum/continuum-1.0.3/apps/continuum/working-directory/1/modules/integration/target/rpc-test1/build
    [mkdir] Created dir: /export/home/illsleyd/continuum/continuum-1.0.3/apps/continuum/working-directory/1/modules/integration/target/rpc-test1/build/classes
    [mkdir] Created dir: /export/home/illsleyd/continuum/continuum-1.0.3/apps/continuum/working-directory/1/modules/integration/target/rpc-test1/build/lib
    [mkdir] Created dir: /export/home/illsleyd/continuum/continuum-1.0.3/apps/continuum/working-directory/1/modules/integration/target/rpc-test1/test
    [echo] Stax Availability= true
    [echo] Axis2 Availability= true
    [javac] Compiling 2 source files to /export/home/illsleyd/continuum/continuum-1.0.3/apps/continuum/working-directory/1/modules/integration/target/rpc-test1/build/classes
    [javac] Note: /export/home/illsleyd/continuum/continuum-1.0.3/apps/continuum/working-directory/1/modules/integration/target/rpc-test1/src/com/example/www/ServiceNameStub.java uses unchecked or unsafe operations.
    [javac] Note: Recompile with -Xlint:unchecked for details.
    [jar] Building jar: /export/home/illsleyd/continuum/continuum-1.0.3/apps/continuum/working-directory/1/modules/integration/target/rpc-test1/build/lib/ServiceName-test-client.jar
    [echo] Running codegen RPC WSDLs - take 2
    [java] log4j:WARN No appenders could be found for logger (org.apache.axis2.description.AxisService).
    [java] log4j:WARN Please initialize the log4j system properly.
    [mkdir] Created dir: /export/home/illsleyd/continuum/continuum-1.0.3/apps/continuum/working-directory/1/modules/integration/target/rpc-test2/build
    [mkdir] Created dir: /export/home/illsleyd/continuum/continuum-1.0.3/apps/continuum/working-directory/1/modules/integration/target/rpc-test2/build/classes
    [mkdir] Created dir: /export/home/illsleyd/continuum/continuum-1.0.3/apps/continuum/working-directory/1/modules/integration/target/rpc-test2/build/lib
    [mkdir] Created dir: /export/home/illsleyd/continuum/continuum-1.0.3/apps/continuum/working-directory/1/modules/integration/target/rpc-test2/test
    [echo] Stax Availability= true
    [echo] Axis2 Availability= true
    [javac] Compiling 2 source files to /export/home/illsleyd/continuum/continuum-1.0.3/apps/continuum/working-directory/1/modules/integration/target/rpc-test2/build/classes
    [javac] Note: /export/home/illsleyd/continuum/continuum-1.0.3/apps/continuum/working-directory/1/modules/integration/target/rpc-test2/src/com/example/www/ServiceNameStub.java uses unchecked or unsafe operations.
    [javac] Note: Recompile with -Xlint:unchecked for details.
    [jar] Building jar: /export/home/illsleyd/continuum/continuum-1.0.3/apps/continuum/working-directory/1/modules/integration/target/rpc-test2/build/lib/ServiceName-test-client.jar
    [echo] Running codegen RPC WSDLs - take 3
    [java] log4j:WARN No appenders could be found for logger (org.apache.axis2.description.AxisService).
    [java] log4j:WARN Please initialize the log4j system properly.
    [mkdir] Created dir: /export/home/illsleyd/continuum/continuum-1.0.3/apps/continuum/working-directory/1/modules/integration/target/rpc-test3/build
    [mkdir] Created dir: /export/home/illsleyd/continuum/continuum-1.0.3/apps/continuum/working-directory/1/modules/integration/target/rpc-test3/build/classes
    [mkdir] Created dir: /export/home/illsleyd/continuum/continuum-1.0.3/apps/continuum/working-directory/1/modules/integration/target/rpc-test3/build/lib
    [mkdir] Created dir: /export/home/illsleyd/continuum/continuum-1.0.3/apps/continuum/working-directory/1/modules/integration/target/rpc-test3/test
    [jar] Building jar: /export/home/illsleyd/continuum/continuum-1.0.3/apps/continuum/working-directory/1/modules/integration/target/rpc-test3/build/lib/XBeans-packaged.jar
    [echo] XmlBeans Availability = true
    [echo] Stax Availability= true
    [echo] Axis2 Availability= true
    [javac] Compiling 210 source files to /export/home/illsleyd/continuum/continuum-1.0.3/apps/continuum/working-directory/1/modules/integration/target/rpc-test3/build/classes
    [javac] Note: Some input files use or override a deprecated API.
    [javac] Note: Recompile with -Xlint:deprecation for details.
    [javac] Note: /export/home/illsleyd/continuum/continuum-1.0.3/apps/continuum/working-directory/1/modules/integration/target/rpc-test3/src/com/example/www/ServiceNameStub.java uses unchecked or unsafe operations.
    [javac] Note: Recompile with -Xlint:unchecked for details.
    [jar] Building jar: /export/home/illsleyd/continuum/continuum-1.0.3/apps/continuum/working-directory/1/modules/integration/target/rpc-test3/build/lib/ServiceName-test-client.jar
    [echo] Running codegen RPC WSDLs - take 4
    [java] log4j:WARN No appenders could be found for logger (org.apache.axis2.description.AxisService).
    [java] log4j:WARN Please initialize the log4j system properly.
    [mkdir] Created dir: /export/home/illsleyd/continuum/continuum-1.0.3/apps/continuum/working-directory/1/modules/integration/target/rpc-test4/build
    [mkdir] Created dir: /export/home/illsleyd/continuum/continuum-1.0.3/apps/continuum/working-directory/1/modules/integration/target/rpc-test4/build/classes
    [mkdir] Created dir: /export/home/illsleyd/continuum/continuum-1.0.3/apps/continuum/working-directory/1/modules/integration/target/rpc-test4/build/lib
    [mkdir] Created dir: /export/home/illsleyd/continuum/continuum-1.0.3/apps/continuum/working-directory/1/modules/integration/target/rpc-test4/test
    [jar] Building jar: /export/home/illsleyd/continuum/continuum-1.0.3/apps/continuum/working-directory/1/modules/integration/target/rpc-test4/build/lib/XBeans-packaged.jar
    [echo] XmlBeans Availability = true
    [echo] Stax Availability= true
    [echo] Axis2 Availability= true
    [javac] Compiling 210 source files to /export/home/illsleyd/continuum/continuum-1.0.3/apps/continuum/working-directory/1/modules/integration/target/rpc-test4/build/classes
    [javac] Note: Some input files use or override a deprecated API.
    [javac] Note: Recompile with -Xlint:deprecation for details.
    [javac] Note: /export/home/illsleyd/continuum/continuum-1.0.3/apps/continuum/working-directory/1/modules/integration/target/rpc-test4/src/com/example/www/ServiceNameMessageReceiverInOut.java uses unchecked or unsafe operations.
    [javac] Note: Recompile with -Xlint:unchecked for details.
    [copy] Copying 2 files to /export/home/illsleyd/continuum/continuum-1.0.3/apps/continuum/working-directory/1/modules/integration/target/rpc-test4/build/classes/META-INF
    [copy] Copying 1 file to /export/home/illsleyd/continuum/continuum-1.0.3/apps/continuum/working-directory/1/modules/integration/target/rpc-test4/build/classes/lib
    [jar] Building jar: /export/home/illsleyd/continuum/continuum-1.0.3/apps/continuum/working-directory/1/modules/integration/target/rpc-test4/build/lib/ServiceName.aar
    [echo] Running codegen RPC WSDLs with helper mode -  take 1
    [java] log4j:WARN No appenders could be found for logger (org.apache.axis2.description.AxisService).
    [java] log4j:WARN Please initialize the log4j system properly.
    [mkdir] Created dir: /export/home/illsleyd/continuum/continuum-1.0.3/apps/continuum/working-directory/1/modules/integration/target/helper-test1/build
    [mkdir] Created dir: /export/home/illsleyd/continuum/continuum-1.0.3/apps/continuum/working-directory/1/modules/integration/target/helper-test1/build/classes
    [mkdir] Created dir: /export/home/illsleyd/continuum/continuum-1.0.3/apps/continuum/working-directory/1/modules/integration/target/helper-test1/build/lib
    [mkdir] Created dir: /export/home/illsleyd/continuum/continuum-1.0.3/apps/continuum/working-directory/1/modules/integration/target/helper-test1/test
    [echo] Stax Availability= true
    [echo] Axis2 Availability= true
    [javac] Compiling 8 source files to /export/home/illsleyd/continuum/continuum-1.0.3/apps/continuum/working-directory/1/modules/integration/target/helper-test1/build/classes
    [javac] Note: Some input files use unchecked or unsafe operations.
    [javac] Note: Recompile with -Xlint:unchecked for details.
    [jar] Building jar: /export/home/illsleyd/continuum/continuum-1.0.3/apps/continuum/working-directory/1/modules/integration/target/helper-test1/build/lib/ServiceName-test-client.jar
    [echo] Running codegen RPC WSDLs with helper mode -  take 2
    [java] log4j:WARN No appenders could be found for logger (org.apache.axis2.description.AxisService).
    [java] log4j:WARN Please initialize the log4j system properly.
    [mkdir] Created dir: /export/home/illsleyd/continuum/continuum-1.0.3/apps/continuum/working-directory/1/modules/integration/target/helper-test2/build
    [mkdir] Created dir: /export/home/illsleyd/continuum/continuum-1.0.3/apps/continuum/working-directory/1/modules/integration/target/helper-test2/build/classes
    [mkdir] Created dir: /export/home/illsleyd/continuum/continuum-1.0.3/apps/continuum/working-directory/1/modules/integration/target/helper-test2/build/lib
    [mkdir] Created dir: /export/home/illsleyd/continuum/continuum-1.0.3/apps/continuum/working-directory/1/modules/integration/target/helper-test2/test
    [echo] Stax Availability= true
    [echo] Axis2 Availability= true
    [javac] Compiling 8 source files to /export/home/illsleyd/continuum/continuum-1.0.3/apps/continuum/working-directory/1/modules/integration/target/helper-test2/build/classes
    [javac] Note: Some input files use unchecked or unsafe operations.
    [javac] Note: Recompile with -Xlint:unchecked for details.
    [jar] Building jar: /export/home/illsleyd/continuum/continuum-1.0.3/apps/continuum/working-directory/1/modules/integration/target/helper-test2/build/lib/ServiceName-test-client.jar
    [echo] Running codegen for Enterprise WSDL - take 1
    [java] log4j:WARN No appenders could be found for logger (org.apache.axis2.description.AxisService).
    [java] log4j:WARN Please initialize the log4j system properly.
    [mkdir] Created dir: /export/home/illsleyd/continuum/continuum-1.0.3/apps/continuum/working-directory/1/modules/integration/target/enterprise-test1/build
    [mkdir] Created dir: /export/home/illsleyd/continuum/continuum-1.0.3/apps/continuum/working-directory/1/modules/integration/target/enterprise-test1/build/classes
    [mkdir] Created dir: /export/home/illsleyd/continuum/continuum-1.0.3/apps/continuum/working-directory/1/modules/integration/target/enterprise-test1/build/lib
    [mkdir] Created dir: /export/home/illsleyd/continuum/continuum-1.0.3/apps/continuum/working-directory/1/modules/integration/target/enterprise-test1/test
    [jar] Building jar: /export/home/illsleyd/continuum/continuum-1.0.3/apps/continuum/working-directory/1/modules/integration/target/enterprise-test1/build/lib/XBeans-packaged.jar
    [echo] XmlBeans Availability = true
    [echo] Stax Availability= true
    [echo] Axis2 Availability= true
    [javac] Compiling 740 source files to /export/home/illsleyd/continuum/continuum-1.0.3/apps/continuum/working-directory/1/modules/integration/target/enterprise-test1/build/classes
    [javac] Note: Some input files use or override a deprecated API.
    [javac] Note: Recompile with -Xlint:deprecation for details.
    [javac] Note: Some input files use unchecked or unsafe operations.
    [javac] Note: Recompile with -Xlint:unchecked for details.
    [jar] Building jar: /export/home/illsleyd/continuum/continuum-1.0.3/apps/continuum/working-directory/1/modules/integration/target/enterprise-test1/build/lib/SforceService-test-client.jar
    [echo] Running codegen for Enterprise WSDL - take 2
    [java] log4j:WARN No appenders could be found for logger (org.apache.axis2.description.AxisService).
    [java] log4j:WARN Please initialize the log4j system properly.
    [mkdir] Created dir: /export/home/illsleyd/continuum/continuum-1.0.3/apps/continuum/working-directory/1/modules/integration/target/enterprise-test2/build
    [mkdir] Created dir: /export/home/illsleyd/continuum/continuum-1.0.3/apps/continuum/working-directory/1/modules/integration/target/enterprise-test2/build/classes
    [mkdir] Created dir: /export/home/illsleyd/continuum/continuum-1.0.3/apps/continuum/working-directory/1/modules/integration/target/enterprise-test2/build/lib
    [mkdir] Created dir: /export/home/illsleyd/continuum/continuum-1.0.3/apps/continuum/working-directory/1/modules/integration/target/enterprise-test2/test
    [echo] Stax Availability= true
    [echo] Axis2 Availability= true
    [javac] Compiling 10 source files to /export/home/illsleyd/continuum/continuum-1.0.3/apps/continuum/working-directory/1/modules/integration/target/enterprise-test2/build/classes
    [javac] Note: /export/home/illsleyd/continuum/continuum-1.0.3/apps/continuum/working-directory/1/modules/integration/target/enterprise-test2/src/com/sforce/soap/enterprise/SforceServiceStub.java uses unchecked or unsafe operations.
    [javac] Note: Recompile with -Xlint:unchecked for details.
    [jar] Building jar: /export/home/illsleyd/continuum/continuum-1.0.3/apps/continuum/working-directory/1/modules/integration/target/enterprise-test2/build/lib/SforceService-test-client.jar
    [echo] Running codegen for Enterprise WSDL - take 3
    [java] log4j:WARN No appenders could be found for logger (org.apache.axis2.description.AxisService).
    [java] log4j:WARN Please initialize the log4j system properly.
    [mkdir] Created dir: /export/home/illsleyd/continuum/continuum-1.0.3/apps/continuum/working-directory/1/modules/integration/target/enterprise-test3/build
    [mkdir] Created dir: /export/home/illsleyd/continuum/continuum-1.0.3/apps/continuum/working-directory/1/modules/integration/target/enterprise-test3/build/classes
    [mkdir] Created dir: /export/home/illsleyd/continuum/continuum-1.0.3/apps/continuum/working-directory/1/modules/integration/target/enterprise-test3/build/lib
    [mkdir] Created dir: /export/home/illsleyd/continuum/continuum-1.0.3/apps/continuum/working-directory/1/modules/integration/target/enterprise-test3/test
    [jar] Building jar: /export/home/illsleyd/continuum/continuum-1.0.3/apps/continuum/working-directory/1/modules/integration/target/enterprise-test3/build/lib/XBeans-packaged.jar
    [echo] XmlBeans Availability = true
    [echo] Stax Availability= true
    [echo] Axis2 Availability= true
    [javac] Compiling 742 source files to /export/home/illsleyd/continuum/continuum-1.0.3/apps/continuum/working-directory/1/modules/integration/target/enterprise-test3/build/classes
    [javac] Note: Some input files use or override a deprecated API.
    [javac] Note: Recompile with -Xlint:deprecation for details.
    [javac] Note: Some input files use unchecked or unsafe operations.
    [javac] Note: Recompile with -Xlint:unchecked for details.
    [copy] Copying 2 files to /export/home/illsleyd/continuum/continuum-1.0.3/apps/continuum/working-directory/1/modules/integration/target/enterprise-test3/build/classes/META-INF
    [copy] Copying 1 file to /export/home/illsleyd/continuum/continuum-1.0.3/apps/continuum/working-directory/1/modules/integration/target/enterprise-test3/build/classes/lib
    [jar] Building jar: /export/home/illsleyd/continuum/continuum-1.0.3/apps/continuum/working-directory/1/modules/integration/target/enterprise-test3/build/lib/SforceService.aar
    [echo] Running codegen for Enterprise WSDL - take 4
    [java] log4j:WARN No appenders could be found for logger (org.apache.axis2.description.AxisService).
    [java] log4j:WARN Please initialize the log4j system properly.
    [mkdir] Created dir: /export/home/illsleyd/continuum/continuum-1.0.3/apps/continuum/working-directory/1/modules/integration/target/enterprise-test4/build
    [mkdir] Created dir: /export/home/illsleyd/continuum/continuum-1.0.3/apps/continuum/working-directory/1/modules/integration/target/enterprise-test4/build/classes
    [mkdir] Created dir: /export/home/illsleyd/continuum/continuum-1.0.3/apps/continuum/working-directory/1/modules/integration/target/enterprise-test4/build/lib
    [mkdir] Created dir: /export/home/illsleyd/continuum/continuum-1.0.3/apps/continuum/working-directory/1/modules/integration/target/enterprise-test4/test
    [jar] Building jar: /export/home/illsleyd/continuum/continuum-1.0.3/apps/continuum/working-directory/1/modules/integration/target/enterprise-test4/build/lib/XBeans-packaged.jar
    [echo] XmlBeans Availability = true
    [echo] Stax Availability= true
    [echo] Axis2 Availability= true
    [javac] Compiling 742 source files to /export/home/illsleyd/continuum/continuum-1.0.3/apps/continuum/working-directory/1/modules/integration/target/enterprise-test4/build/classes
    [javac] Note: Some input files use or override a deprecated API.
    [javac] Note: Recompile with -Xlint:deprecation for details.
    [javac] Note: Some input files use unchecked or unsafe operations.
    [javac] Note: Recompile with -Xlint:unchecked for details.
    [copy] Copying 2 files to /export/home/illsleyd/continuum/continuum-1.0.3/apps/continuum/working-directory/1/modules/integration/target/enterprise-test4/build/classes/META-INF
    [copy] Copying 1 file to /export/home/illsleyd/continuum/continuum-1.0.3/apps/continuum/working-directory/1/modules/integration/target/enterprise-test4/build/classes/lib
    [jar] Building jar: /export/home/illsleyd/continuum/continuum-1.0.3/apps/continuum/working-directory/1/modules/integration/target/enterprise-test4/build/lib/SforceService.aar
    [echo] Running codegen for eBaySvc WSDL
    [java] log4j:WARN No appenders could be found for logger (org.apache.axis2.description.AxisService).
    [java] log4j:WARN Please initialize the log4j system properly.
    [mkdir] Created dir: /export/home/illsleyd/continuum/continuum-1.0.3/apps/continuum/working-directory/1/modules/integration/target/eBaySvc/build
    [mkdir] Created dir: /export/home/illsleyd/continuum/continuum-1.0.3/apps/continuum/working-directory/1/modules/integration/target/eBaySvc/build/classes
    [mkdir] Created dir: /export/home/illsleyd/continuum/continuum-1.0.3/apps/continuum/working-directory/1/modules/integration/target/eBaySvc/build/lib
    [echo] Stax Availability= true
    [echo] Axis2 Availability= true
    [javac] Compiling 1016 source files to /export/home/illsleyd/continuum/continuum-1.0.3/apps/continuum/working-directory/1/modules/integration/target/eBaySvc/build/classes
    [javac] Note: Some input files use unchecked or unsafe operations.
    [javac] Note: Recompile with -Xlint:unchecked for details.
    [copy] Copying 2 files to /export/home/illsleyd/continuum/continuum-1.0.3/apps/continuum/working-directory/1/modules/integration/target/eBaySvc/build/classes/META-INF
    [jar] Building jar: /export/home/illsleyd/continuum/continuum-1.0.3/apps/continuum/working-directory/1/modules/integration/target/eBaySvc/build/lib/EBayAPIInterfaceService.aar
    [echo] Running codegen for eBaySvc WSDL Back word compatibiliy
    [java] log4j:WARN No appenders could be found for logger (org.apache.axis2.description.AxisService).
    [java] log4j:WARN Please initialize the log4j system properly.
    [mkdir] Created dir: /export/home/illsleyd/continuum/continuum-1.0.3/apps/continuum/working-directory/1/modules/integration/target/eBaySvcB/build
    [mkdir] Created dir: /export/home/illsleyd/continuum/continuum-1.0.3/apps/continuum/working-directory/1/modules/integration/target/eBaySvcB/build/classes
    [mkdir] Created dir: /export/home/illsleyd/continuum/continuum-1.0.3/apps/continuum/working-directory/1/modules/integration/target/eBaySvcB/build/lib
    [echo] Stax Availability= true
    [echo] Axis2 Availability= true
    [javac] Compiling 1015 source files to /export/home/illsleyd/continuum/continuum-1.0.3/apps/continuum/working-directory/1/modules/integration/target/eBaySvcB/build/classes
    [javac] Note: Some input files use unchecked or unsafe operations.
    [javac] Note: Recompile with -Xlint:unchecked for details.
    [copy] Copying 2 files to /export/home/illsleyd/continuum/continuum-1.0.3/apps/continuum/working-directory/1/modules/integration/target/eBaySvcB/build/classes/META-INF
    [jar] Building jar: /export/home/illsleyd/continuum/continuum-1.0.3/apps/continuum/working-directory/1/modules/integration/target/eBaySvcB/build/lib/EBayAPIInterfaceService.aar
    [echo] Running codegen for eBaySvc WSDL with un wrapping 
    [java] log4j:WARN No appenders could be found for logger (org.apache.axis2.description.AxisService).
    [java] log4j:WARN Please initialize the log4j system properly.
    [mkdir] Created dir: /export/home/illsleyd/continuum/continuum-1.0.3/apps/continuum/working-directory/1/modules/integration/target/eBaySvcUW/build
    [mkdir] Created dir: /export/home/illsleyd/continuum/continuum-1.0.3/apps/continuum/working-directory/1/modules/integration/target/eBaySvcUW/build/classes
    [mkdir] Created dir: /export/home/illsleyd/continuum/continuum-1.0.3/apps/continuum/working-directory/1/modules/integration/target/eBaySvcUW/build/lib
    [echo] Stax Availability= true
    [echo] Axis2 Availability= true
    [javac] Compiling 1016 source files to /export/home/illsleyd/continuum/continuum-1.0.3/apps/continuum/working-directory/1/modules/integration/target/eBaySvcUW/build/classes
    [javac] Note: Some input files use unchecked or unsafe operations.
    [javac] Note: Recompile with -Xlint:unchecked for details.
    [copy] Copying 2 files to /export/home/illsleyd/continuum/continuum-1.0.3/apps/continuum/working-directory/1/modules/integration/target/eBaySvcUW/build/classes/META-INF
    [jar] Building jar: /export/home/illsleyd/continuum/continuum-1.0.3/apps/continuum/working-directory/1/modules/integration/target/eBaySvcUW/build/lib/EBayAPIInterfaceService.aar
    [javac] Compiling 105 source files to /export/home/illsleyd/continuum/continuum-1.0.3/apps/continuum/working-directory/1/modules/integration/target/test-classes
    [javac] Note: /export/home/illsleyd/continuum/continuum-1.0.3/apps/continuum/working-directory/1/modules/integration/test/org/apache/axis2/engine/MessageContextInjectionTest.java uses or overrides a deprecated API.
    [javac] Note: Recompile with -Xlint:deprecation for details.
Running post goal: test:compile
    [mkdir] Created dir: /export/home/illsleyd/continuum/continuum-1.0.3/apps/continuum/working-directory/1/modules/integration/target/test-resources/samples/modules
    [mkdir] Created dir: /export/home/illsleyd/continuum/continuum-1.0.3/apps/continuum/working-directory/1/modules/integration/target/test-resources/samples/conf
    [mkdir] Created dir: /export/home/illsleyd/continuum/continuum-1.0.3/apps/continuum/working-directory/1/modules/integration/target/test-resources/repository-client/modules
    [mkdir] Created dir: /export/home/illsleyd/continuum/continuum-1.0.3/apps/continuum/working-directory/1/modules/integration/target/test-resources/repository-client/conf
    [copy] Copying 1 file to /export/home/illsleyd/continuum/continuum-1.0.3/apps/continuum/working-directory/1/modules/integration/target/test-resources/samples/modules
    [copy] Copying 1 file to /export/home/illsleyd/continuum/continuum-1.0.3/apps/continuum/working-directory/1/modules/integration/target/test-resources/samples/conf
    [copy] Copying 1 file to /export/home/illsleyd/continuum/continuum-1.0.3/apps/continuum/working-directory/1/modules/integration/target/test-resources/repository-client/modules
    [copy] Copying 1 file to /export/home/illsleyd/continuum/continuum-1.0.3/apps/continuum/working-directory/1/modules/integration/target/test-resources/repository-client/conf
    [mkdir] Created dir: /export/home/illsleyd/continuum/continuum-1.0.3/apps/continuum/working-directory/1/modules/integration/target/toWar/services
    [mkdir] Created dir: /export/home/illsleyd/continuum/continuum-1.0.3/apps/continuum/working-directory/1/modules/integration/target/test-resources/chunking-enabledRepository
    [mkdir] Created dir: /export/home/illsleyd/continuum/continuum-1.0.3/apps/continuum/working-directory/1/modules/integration/target/test-resources/chunking-enabledRepository/conf
    [copy] Copying 1 file to /export/home/illsleyd/continuum/continuum-1.0.3/apps/continuum/working-directory/1/modules/integration/target/test-resources/chunking-enabledRepository/conf
    [mkdir] Created dir: /export/home/illsleyd/continuum/continuum-1.0.3/apps/continuum/working-directory/1/modules/integration/target/test-resources/chunking-disabledRepository
    [mkdir] Created dir: /export/home/illsleyd/continuum/continuum-1.0.3/apps/continuum/working-directory/1/modules/integration/target/test-resources/chunking-disabledRepository/conf
    [copy] Copying 1 file to /export/home/illsleyd/continuum/continuum-1.0.3/apps/continuum/working-directory/1/modules/integration/target/test-resources/chunking-disabledRepository/conf
    [mkdir] Created dir: /export/home/illsleyd/continuum/continuum-1.0.3/apps/continuum/working-directory/1/modules/integration/target/test-resources/jms-enabled-server-repository
    [mkdir] Created dir: /export/home/illsleyd/continuum/continuum-1.0.3/apps/continuum/working-directory/1/modules/integration/target/test-resources/jms-enabled-server-repository/conf
    [mkdir] Created dir: /export/home/illsleyd/continuum/continuum-1.0.3/apps/continuum/working-directory/1/modules/integration/target/test-resources/jms-enabled-server-repository/modules
    [copy] Copying 1 file to /export/home/illsleyd/continuum/continuum-1.0.3/apps/continuum/working-directory/1/modules/integration/target/test-resources/jms-enabled-server-repository/conf
    [copy] Copying 1 file to /export/home/illsleyd/continuum/continuum-1.0.3/apps/continuum/working-directory/1/modules/integration/target/test-resources/jms-enabled-server-repository/modules
    [mkdir] Created dir: /export/home/illsleyd/continuum/continuum-1.0.3/apps/continuum/working-directory/1/modules/integration/target/test-resources/jms-enabled-client-repository
    [mkdir] Created dir: /export/home/illsleyd/continuum/continuum-1.0.3/apps/continuum/working-directory/1/modules/integration/target/test-resources/jms-enabled-client-repository/conf
    [mkdir] Created dir: /export/home/illsleyd/continuum/continuum-1.0.3/apps/continuum/working-directory/1/modules/integration/target/test-resources/jms-enabled-client-repository/modules
    [copy] Copying 1 file to /export/home/illsleyd/continuum/continuum-1.0.3/apps/continuum/working-directory/1/modules/integration/target/test-resources/jms-enabled-client-repository/conf
    [copy] Copying 1 file to /export/home/illsleyd/continuum/continuum-1.0.3/apps/continuum/working-directory/1/modules/integration/target/test-resources/jms-enabled-client-repository/modules
    [mkdir] Created dir: /export/home/illsleyd/continuum/continuum-1.0.3/apps/continuum/working-directory/1/modules/integration/target/test-resources/mail-transport-client-enabledRepository
    [mkdir] Created dir: /export/home/illsleyd/continuum/continuum-1.0.3/apps/continuum/working-directory/1/modules/integration/target/test-resources/mail-transport-client-enabledRepository/conf
    [mkdir] Created dir: /export/home/illsleyd/continuum/continuum-1.0.3/apps/continuum/working-directory/1/modules/integration/target/test-resources/mail-transport-client-enabledRepository/modules
    [copy] Copying 1 file to /export/home/illsleyd/continuum/continuum-1.0.3/apps/continuum/working-directory/1/modules/integration/target/test-resources/mail-transport-client-enabledRepository/conf
    [copy] Copying 1 file to /export/home/illsleyd/continuum/continuum-1.0.3/apps/continuum/working-directory/1/modules/integration/target/test-resources/mail-transport-client-enabledRepository/modules
    [mkdir] Created dir: /export/home/illsleyd/continuum/continuum-1.0.3/apps/continuum/working-directory/1/modules/integration/target/test-resources/mail-transport-server-enabledRepository
    [mkdir] Created dir: /export/home/illsleyd/continuum/continuum-1.0.3/apps/continuum/working-directory/1/modules/integration/target/test-resources/mail-transport-server-enabledRepository/conf
    [mkdir] Created dir: /export/home/illsleyd/continuum/continuum-1.0.3/apps/continuum/working-directory/1/modules/integration/target/test-resources/mail-transport-server-enabledRepository/modules
    [copy] Copying 1 file to /export/home/illsleyd/continuum/continuum-1.0.3/apps/continuum/working-directory/1/modules/integration/target/test-resources/mail-transport-server-enabledRepository/conf
    [copy] Copying 1 file to /export/home/illsleyd/continuum/continuum-1.0.3/apps/continuum/working-directory/1/modules/integration/target/test-resources/mail-transport-server-enabledRepository/modules
    [mkdir] Created dir: /export/home/illsleyd/continuum/continuum-1.0.3/apps/continuum/working-directory/1/modules/integration/target/test-resources/MessageContextInjectionRepo
    [mkdir] Created dir: /export/home/illsleyd/continuum/continuum-1.0.3/apps/continuum/working-directory/1/modules/integration/target/test-resources/integrationRepo/modules
    [mkdir] Created dir: /export/home/illsleyd/continuum/continuum-1.0.3/apps/continuum/working-directory/1/modules/integration/target/test-resources/integrationRepo/conf
    [copy] Copying 1 file to /export/home/illsleyd/continuum/continuum-1.0.3/apps/continuum/working-directory/1/modules/integration/target/test-resources/integrationRepo/modules
    [copy] Copying 1 file to /export/home/illsleyd/continuum/continuum-1.0.3/apps/continuum/working-directory/1/modules/integration/target/test-resources/integrationRepo/conf
    [mkdir] Created dir: /export/home/illsleyd/continuum/continuum-1.0.3/apps/continuum/working-directory/1/modules/integration/target/test-resources/commons-http-enabledRepository
    [mkdir] Created dir: /export/home/illsleyd/continuum/continuum-1.0.3/apps/continuum/working-directory/1/modules/integration/target/test-resources/commons-http-enabledRepository/conf
    [copy] Copying 1 file to /export/home/illsleyd/continuum/continuum-1.0.3/apps/continuum/working-directory/1/modules/integration/target/test-resources/commons-http-enabledRepository/conf
    [mkdir] Created dir: /export/home/illsleyd/continuum/continuum-1.0.3/apps/continuum/working-directory/1/modules/integration/target/test-resources/MTOM-enabledRepository
    [mkdir] Created dir: /export/home/illsleyd/continuum/continuum-1.0.3/apps/continuum/working-directory/1/modules/integration/target/test-resources/MTOM-enabledRepository/conf
    [mkdir] Created dir: /export/home/illsleyd/continuum/continuum-1.0.3/apps/continuum/working-directory/1/modules/integration/target/test-resources/MTOM-enabledRepository/modules
    [copy] Copying 1 file to /export/home/illsleyd/continuum/continuum-1.0.3/apps/continuum/working-directory/1/modules/integration/target/test-resources/MTOM-enabledRepository/conf
    [copy] Copying 1 file to /export/home/illsleyd/continuum/continuum-1.0.3/apps/continuum/working-directory/1/modules/integration/target/test-resources/MTOM-enabledRepository/modules
    [mkdir] Created dir: /export/home/illsleyd/continuum/continuum-1.0.3/apps/continuum/working-directory/1/modules/integration/target/test-resources/MTOM-fileCache-enabledRepository
    [mkdir] Created dir: /export/home/illsleyd/continuum/continuum-1.0.3/apps/continuum/working-directory/1/modules/integration/target/test-resources/MTOM-fileCache-enabledRepository/conf
    [copy] Copying 1 file to /export/home/illsleyd/continuum/continuum-1.0.3/apps/continuum/working-directory/1/modules/integration/target/test-resources/MTOM-fileCache-enabledRepository/conf
    [copy] Copying 1 file to /export/home/illsleyd/continuum/continuum-1.0.3/apps/continuum/working-directory/1/modules/integration/target/test-resources/MTOM-fileCache-enabledRepository/modules
    [mkdir] Created dir: /export/home/illsleyd/continuum/continuum-1.0.3/apps/continuum/working-directory/1/modules/integration/target/test-resources/SwA-enabledRepository
    [mkdir] Created dir: /export/home/illsleyd/continuum/continuum-1.0.3/apps/continuum/working-directory/1/modules/integration/target/test-resources/SwA-enabledRepository/conf
    [copy] Copying 1 file to /export/home/illsleyd/continuum/continuum-1.0.3/apps/continuum/working-directory/1/modules/integration/target/test-resources/SwA-enabledRepository/conf
    [copy] Copying 1 file to /export/home/illsleyd/continuum/continuum-1.0.3/apps/continuum/working-directory/1/modules/integration/target/test-resources/SwA-enabledRepository/modules
    [mkdir] Created dir: /export/home/illsleyd/continuum/continuum-1.0.3/apps/continuum/working-directory/1/modules/integration/target/test-resources/SwA-fileCache-enabledRepository
    [mkdir] Created dir: /export/home/illsleyd/continuum/continuum-1.0.3/apps/continuum/working-directory/1/modules/integration/target/test-resources/SwA-fileCache-enabledRepository/conf
    [copy] Copying 1 file to /export/home/illsleyd/continuum/continuum-1.0.3/apps/continuum/working-directory/1/modules/integration/target/test-resources/SwA-fileCache-enabledRepository/conf
    [copy] Copying 1 file to /export/home/illsleyd/continuum/continuum-1.0.3/apps/continuum/working-directory/1/modules/integration/target/test-resources/SwA-fileCache-enabledRepository/modules
    [mkdir] Created dir: /export/home/illsleyd/continuum/continuum-1.0.3/apps/continuum/working-directory/1/modules/integration/target/groovyRepo
    [mkdir] Created dir: /export/home/illsleyd/continuum/continuum-1.0.3/apps/continuum/working-directory/1/modules/integration/target/groovyRepo/conf
    [mkdir] Created dir: /export/home/illsleyd/continuum/continuum-1.0.3/apps/continuum/working-directory/1/modules/integration/target/groovyRepo/services
    [mkdir] Created dir: /export/home/illsleyd/continuum/continuum-1.0.3/apps/continuum/working-directory/1/modules/integration/target/groovyRepo/modules
    [copy] Copying 1 file to /export/home/illsleyd/continuum/continuum-1.0.3/apps/continuum/working-directory/1/modules/integration/target/groovyRepo/services
    [copy] Copying 1 file to /export/home/illsleyd/continuum/continuum-1.0.3/apps/continuum/working-directory/1/modules/integration/target/groovyRepo/modules
    [copy] Copying 1 file to /export/home/illsleyd/continuum/continuum-1.0.3/apps/continuum/working-directory/1/modules/integration/target/groovyRepo/conf
    [mkdir] Created dir: /export/home/illsleyd/continuum/continuum-1.0.3/apps/continuum/working-directory/1/modules/integration/target/test-resources/spring
    [copy] Copying 1 file to /export/home/illsleyd/continuum/continuum-1.0.3/apps/continuum/working-directory/1/modules/integration/target/test-classes/spring
    [mkdir] Created dir: /export/home/illsleyd/continuum/continuum-1.0.3/apps/continuum/working-directory/1/modules/integration/target/test-resources/deployment_repo
    [mkdir] Created dir: /export/home/illsleyd/continuum/continuum-1.0.3/apps/continuum/working-directory/1/modules/integration/target/test-resources/deployment_repo/conf
    [mkdir] Created dir: /export/home/illsleyd/continuum/continuum-1.0.3/apps/continuum/working-directory/1/modules/integration/target/test-resources/deployment_repo/services
    [mkdir] Created dir: /export/home/illsleyd/continuum/continuum-1.0.3/apps/continuum/working-directory/1/modules/integration/target/test-resources/deployment_repo/modules
    [copy] Copying 1 file to /export/home/illsleyd/continuum/continuum-1.0.3/apps/continuum/working-directory/1/modules/integration/target/test-resources/deployment_repo/conf
    [copy] Copying 1 file to /export/home/illsleyd/continuum/continuum-1.0.3/apps/continuum/working-directory/1/modules/integration/target/test-resources/deployment_repo/modules
    [mkdir] Created dir: /export/home/illsleyd/continuum/continuum-1.0.3/apps/continuum/working-directory/1/modules/integration/target/Repository
    [mkdir] Created dir: /export/home/illsleyd/continuum/continuum-1.0.3/apps/continuum/working-directory/1/modules/integration/target/Repository/conf
    [mkdir] Created dir: /export/home/illsleyd/continuum/continuum-1.0.3/apps/continuum/working-directory/1/modules/integration/target/Repository/services
    [mkdir] Created dir: /export/home/illsleyd/continuum/continuum-1.0.3/apps/continuum/working-directory/1/modules/integration/target/Repository/modules
    [copy] Copying 1 file to /export/home/illsleyd/continuum/continuum-1.0.3/apps/continuum/working-directory/1/modules/integration/target/Repository/modules
    [copy] Copying 1 file to /export/home/illsleyd/continuum/continuum-1.0.3/apps/continuum/working-directory/1/modules/integration/target/Repository/conf
    [mkdir] Created dir: /export/home/illsleyd/continuum/continuum-1.0.3/apps/continuum/working-directory/1/modules/integration/target/perf2/build/repo/conf
    [mkdir] Created dir: /export/home/illsleyd/continuum/continuum-1.0.3/apps/continuum/working-directory/1/modules/integration/target/perf/build/repo/conf
    [copy] Copying 1 file to /export/home/illsleyd/continuum/continuum-1.0.3/apps/continuum/working-directory/1/modules/integration/target/perf2/build/repo/conf
    [copy] Copying 1 file to /export/home/illsleyd/continuum/continuum-1.0.3/apps/continuum/working-directory/1/modules/integration/target/perf/build/repo/conf
    [mkdir] Created dir: /export/home/illsleyd/continuum/continuum-1.0.3/apps/continuum/working-directory/1/modules/integration/target/perf2/build/repo/modules
    [copy] Copying 1 file to /export/home/illsleyd/continuum/continuum-1.0.3/apps/continuum/working-directory/1/modules/integration/target/perf2/build/repo/modules
    [mkdir] Created dir: /export/home/illsleyd/continuum/continuum-1.0.3/apps/continuum/working-directory/1/modules/integration/target/perf/build/repo/modules
    [copy] Copying 1 file to /export/home/illsleyd/continuum/continuum-1.0.3/apps/continuum/working-directory/1/modules/integration/target/perf/build/repo/modules
    [echo] the files are up to date = ${jars.uptodate}
    [mkdir] Created dir: /export/home/illsleyd/continuum/continuum-1.0.3/apps/continuum/working-directory/1/modules/integration/test-resources/SOAP12Testing/SOAP12TestModuleB/build/classes
    [mkdir] Created dir: /export/home/illsleyd/continuum/continuum-1.0.3/apps/continuum/working-directory/1/modules/integration/test-resources/SOAP12Testing/SOAP12TestModuleB/build/lib
    [javac] Compiling 4 source files to /export/home/illsleyd/continuum/continuum-1.0.3/apps/continuum/working-directory/1/modules/integration/test-resources/SOAP12Testing/SOAP12TestModuleB/build/classes
    [javac] Note: /export/home/illsleyd/continuum/continuum-1.0.3/apps/continuum/working-directory/1/modules/integration/test-resources/SOAP12Testing/SOAP12TestModuleB/org/apache/axis2/soap12testing/handlers/SOAP12InFlowHandlerDefaultB.java uses or overrides a deprecated API.
    [javac] Note: Recompile with -Xlint:deprecation for details.
    [copy] Copying 1 file to /export/home/illsleyd/continuum/continuum-1.0.3/apps/continuum/working-directory/1/modules/integration/test-resources/SOAP12Testing/SOAP12TestModuleB/build/classes/META-INF
    [jar] Building jar: /export/home/illsleyd/continuum/continuum-1.0.3/apps/continuum/working-directory/1/modules/integration/target/Repository/modules/SOAP12TestModuleB.jar
    [delete] Deleting directory /export/home/illsleyd/continuum/continuum-1.0.3/apps/continuum/working-directory/1/modules/integration/test-resources/SOAP12Testing/SOAP12TestModuleB/build
    [echo] the files are up to date = ${jars.uptodate}
    [mkdir] Created dir: /export/home/illsleyd/continuum/continuum-1.0.3/apps/continuum/working-directory/1/modules/integration/test-resources/SOAP12Testing/SOAP12TestModuleC/build/classes
    [mkdir] Created dir: /export/home/illsleyd/continuum/continuum-1.0.3/apps/continuum/working-directory/1/modules/integration/test-resources/SOAP12Testing/SOAP12TestModuleC/build/lib
    [javac] Compiling 4 source files to /export/home/illsleyd/continuum/continuum-1.0.3/apps/continuum/working-directory/1/modules/integration/test-resources/SOAP12Testing/SOAP12TestModuleC/build/classes
    [javac] Note: /export/home/illsleyd/continuum/continuum-1.0.3/apps/continuum/working-directory/1/modules/integration/test-resources/SOAP12Testing/SOAP12TestModuleC/org/apache/axis2/soap12testing/handlers/SOAP12InFlowHandlerDefaultC.java uses or overrides a deprecated API.
    [javac] Note: Recompile with -Xlint:deprecation for details.
    [copy] Copying 1 file to /export/home/illsleyd/continuum/continuum-1.0.3/apps/continuum/working-directory/1/modules/integration/test-resources/SOAP12Testing/SOAP12TestModuleC/build/classes/META-INF
    [jar] Building jar: /export/home/illsleyd/continuum/continuum-1.0.3/apps/continuum/working-directory/1/modules/integration/target/Repository/modules/SOAP12TestModuleC.jar
    [delete] Deleting directory /export/home/illsleyd/continuum/continuum-1.0.3/apps/continuum/working-directory/1/modules/integration/test-resources/SOAP12Testing/SOAP12TestModuleC/build
    [echo] the files are up to date = ${jars.uptodate}
    [mkdir] Created dir: /export/home/illsleyd/continuum/continuum-1.0.3/apps/continuum/working-directory/1/modules/integration/test-resources/SOAP12Testing/SOAP12TestServiceB/build/classes
    [mkdir] Created dir: /export/home/illsleyd/continuum/continuum-1.0.3/apps/continuum/working-directory/1/modules/integration/test-resources/SOAP12Testing/SOAP12TestServiceB/build/lib
    [javac] Compiling 1 source file to /export/home/illsleyd/continuum/continuum-1.0.3/apps/continuum/working-directory/1/modules/integration/test-resources/SOAP12Testing/SOAP12TestServiceB/build/classes
    [copy] Copying 1 file to /export/home/illsleyd/continuum/continuum-1.0.3/apps/continuum/working-directory/1/modules/integration/test-resources/SOAP12Testing/SOAP12TestServiceB/build/classes/META-INF
    [jar] Building jar: /export/home/illsleyd/continuum/continuum-1.0.3/apps/continuum/working-directory/1/modules/integration/target/Repository/services/SOAP12TestServiceB.jar
    [delete] Deleting directory /export/home/illsleyd/continuum/continuum-1.0.3/apps/continuum/working-directory/1/modules/integration/test-resources/SOAP12Testing/SOAP12TestServiceB/build
    [echo] the files are up to date = ${jars.uptodate}
    [mkdir] Created dir: /export/home/illsleyd/continuum/continuum-1.0.3/apps/continuum/working-directory/1/modules/integration/test-resources/SOAP12Testing/SOAP12TestServiceC/build/classes
    [mkdir] Created dir: /export/home/illsleyd/continuum/continuum-1.0.3/apps/continuum/working-directory/1/modules/integration/test-resources/SOAP12Testing/SOAP12TestServiceC/build/lib
    [javac] Compiling 1 source file to /export/home/illsleyd/continuum/continuum-1.0.3/apps/continuum/working-directory/1/modules/integration/test-resources/SOAP12Testing/SOAP12TestServiceC/build/classes
    [copy] Copying 1 file to /export/home/illsleyd/continuum/continuum-1.0.3/apps/continuum/working-directory/1/modules/integration/test-resources/SOAP12Testing/SOAP12TestServiceC/build/classes/META-INF
    [jar] Building jar: /export/home/illsleyd/continuum/continuum-1.0.3/apps/continuum/working-directory/1/modules/integration/target/Repository/services/SOAP12TestServiceC.jar
    [delete] Deleting directory /export/home/illsleyd/continuum/continuum-1.0.3/apps/continuum/working-directory/1/modules/integration/test-resources/SOAP12Testing/SOAP12TestServiceC/build

    [junit] Running org.apache.axis2.addressing.AddressingServiceTest
    [junit] Tests run: 3, Failures: 0, Errors: 0, Time elapsed: 4.67 sec
    [junit] Running org.apache.axis2.addressing.MultiHopRedirectServiceTest
    [junit] Tests run: 1, Failures: 0, Errors: 0, Time elapsed: 7.267 sec
    [junit] Running org.apache.axis2.async.AsyncServiceTest
    [junit] Tests run: 1, Failures: 0, Errors: 0, Time elapsed: 4.912 sec
    [junit] Running org.apache.axis2.async.AsyncServiceWithTransportFailureTest
    [junit] Tests run: 1, Failures: 0, Errors: 0, Time elapsed: 7.8 sec
    [junit] Running org.apache.axis2.codegen.InvalidFaultWsdlTest
    [junit] Tests run: 1, Failures: 0, Errors: 0, Time elapsed: 1.322 sec
    [junit] Running org.apache.axis2.deployment.TargetResolverServiceTest
    [junit] Tests run: 1, Failures: 0, Errors: 0, Time elapsed: 6.884 sec
    [junit] Running org.apache.axis2.engine.CallUnregisteredServiceTest
    [junit] Tests run: 1, Failures: 0, Errors: 0, Time elapsed: 7.445 sec
    [junit] Running org.apache.axis2.engine.CharactersetEncodingTest
    [junit] Tests run: 11, Failures: 0, Errors: 0, Time elapsed: 4.286 sec
    [junit] Running org.apache.axis2.engine.CommonsHTTPEchoRawXMLTest
    [junit] Tests run: 2, Failures: 0, Errors: 0, Time elapsed: 5.251 sec
    [junit] Running org.apache.axis2.engine.EchoRawRuntimeProxyTest
    [junit] Tests run: 1, Failures: 0, Errors: 0, Time elapsed: 6.982 sec
    [junit] Running org.apache.axis2.engine.EchoRawXMLChunkedTest
    [junit] Tests run: 1, Failures: 0, Errors: 0, Time elapsed: 7.219 sec
    [junit] Running org.apache.axis2.engine.EchoRawXMLLoadTest
    [junit] Tests run: 1, Failures: 0, Errors: 0, Time elapsed: 7.187 sec
    [junit] Running org.apache.axis2.engine.EchoRawXMLMultipleASyncTest
    [junit] Tests run: 2, Failures: 0, Errors: 0, Time elapsed: 5.852 sec
    [junit] Running org.apache.axis2.engine.EchoRawXMLMultipleSyncTest
    [junit] Tests run: 2, Failures: 0, Errors: 1, Time elapsed: 38.664 sec

BUILD FAILED
File...... file:/export/home/illsleyd/.maven/cache/maven-multiproject-plugin-1.5-SNAPSHOT/plugin.jelly
Element... maven:reactor
Line...... 227
Column.... 64
Unable to obtain goal [multiproject:install-callback] -- file:/export/home/illsleyd/.maven/cache/maven-test-plugin-1.8.1-SNAPSHOT/plugin.jelly:155:49: <junit> Test org.apache.axis2.engine.EchoRawXMLMultipleSyncTest failed
Total time   : 23 minutes 18 seconds 
Finished at  : Sunday, February 18, 2007 5:25:18 PM GMT+00:00


****************************************************************************



---------------------------------------------------------------------
To unsubscribe, e-mail: axis-dev-unsubscribe@ws.apache.org
For additional commands, e-mail: axis-dev-help@ws.apache.org


Mime
View raw message