axis-java-dev mailing list archives

Site index · List index
Message view « Date » · « Thread »
Top « Date » · « Thread »
From "Davanum Srinivas" <dava...@gmail.com>
Subject Re: [continuum] BUILD FAILURE: Axis2
Date Mon, 05 Feb 2007 18:44:38 GMT
Fixed.

thanks,
dims

PS: Please switch your email client to send plain text. thanks.

On 2/5/07, Nicholas L Gallardo <nlgallar@us.ibm.com> wrote:
>
> It looks like this one is related to the saaj tests.
>
>     [junit] Tests run: 8, Failures: 0, Errors: 0, Time elapsed: 1.042 sec
>      [junit] Running org.apache.axis2.saaj.SOAPMessageTest
>      [junit] Tests run: 3, Failures: 1, Errors: 0, Time elapsed: 0.981 sec
>
>  BUILD FAILED
>  File...... file:/export/home/illsleyd/.maven/cache/maven-multiproject-plugin-1.5-SNAPSHOT/plugin.jelly
>  Element... maven:reactor
>  Line...... 227
>  Column.... 64
>  Unable to obtain goal [multiproject:install-callback] -- file:/export/home/illsleyd/.maven/cache/maven-test-plugin-1.8.1-SNAPSHOT/plugin.jelly:155:49: <junit> Test org.apache.axis2.saaj.SOAPMessageTest failed
>  Total time   : 41 minutes 2 seconds
>  Finished at  : Monday, February 5, 2007 4:55:19 PM GMT+00:00
>
>
> The SOAPMessageTest is looking for attach.xml under "target/test-resources", but it only exists under "test-resources".  I'm not sure what needs to get done to copy that file to the appropriate place.
>
> Nicholas Gallardo
>  WebSphere  -  WebServices Development
>  nlgallar@us.ibm.com
>  Phone: 512-838-1182
>  Building: 901 / 5G-016
>
>
>
>  "David Illsley" <davidillsley@gmail.com>
>
> 02/05/2007 10:59 AM
>
> Please respond to
>  axis-dev@ws.apache.org
>
>
> To axis-dev@ws.apache.org
>
> cc
>
>
> Subject Re: [continuum] BUILD FAILURE: Axis2
>
>
>
>
>
>
>
>
> JAX-WS modules from this run zipped at:
>  http://ws.zones.apache.org/~illsleyd/jaxws2.zip
>  David
>
>  On 05/02/07, davidillsley (Continuum) <davidillsley@apache.org> wrote:
>  > Online report : http://localhost:8080/continuum/servlet/continuum/target/ProjectBuild.vm/view/ProjectBuild/id/1/buildId/681
>  > Build statistics:
>  >   State: Failed
>  >   Previous State: Failed
>  >   Started at: Mon, 5 Feb 2007 16:14:14 +0000
>  >   Finished at: Mon, 5 Feb 2007 16:55:20 +0000
>  >   Total time: 41m 5s
>  >   Build Trigger: Schedule
>  >   Exit code: 70
>  >   Building machine hostname: ws.zones.apache.org
>  >   Operating system : SunOS(unknown)
>  >   Java version : 1.5.0_09(Sun Microsystems Inc.)
>  >
>  > Changes
>  >          dims          create the correlation id, only when required
>  >              /webservices/axis2/trunk/java/modules/kernel/src/org/apache/axis2/client/Options.java
>  >            dims          don't create the correlation stuff unless it's needed
>  >              /webservices/axis2/trunk/java/modules/kernel/src/org/apache/axis2/context/MessageContext.java
>  >
>  > ****************************************************************************
>  > Output:
>  > ****************************************************************************
>  >  __  __
>  > |  \/  |__ _Apache__ ___
>  > | |\/| / _` \ V / -_) ' \  ~ intelligent projects ~
>  > |_|  |_\__,_|\_/\___|_||_|  v. 1.1-beta-3
>  >
>  > DEPRECATED: the default goal should be specified in the <build> section of project.xml instead of maven.xml
>  > DEPRECATED: the default goal should be specified in the <build> section of project.xml instead of maven.xml
>  > Trying to get missing/snapshot dependencies required by Apache Axis2:
>  > Attempting to download maven-test-plugin-1.8.1-SNAPSHOT.jar.
>  > Skipping download as local copy is up to date!
>  > Attempting to download maven-multiproject-plugin-1.5-SNAPSHOT.jar.
>  > Skipping download as local copy is up to date!
>  > Attempting to download maven-jar-plugin-1.8-SNAPSHOT.jar.
>  > Skipping download as local copy is up to date!
>  > Attempting to download maven-plugin-plugin-1.8-SNAPSHOT.jar.
>  > Skipping download as local copy is up to date!
>  >     [echo] 1.5
>  >     [echo]
>  >             JDK 1.5 detected, including the following modules:
>  >             modules/metadata/project.xml,modules/saaj-api/project.xml,modules/saaj/project.xml,modules/jaxbri/project.xml,modules/jaxws/project.xml,modules/jaxws-api/project.xml,modules/json/project.xml
>  >
>  > build:start:
>  >
>  > clean:
>  > modules:clean:
>  > modules:reactor:init:
>  > plugin:download-artifact:
>  >
>  >     [echo] Adding to modules.reactor.includes: modules/adb-codegen/project.xml
>  >     [echo] Adding to modules.reactor.includes: modules/adb/project.xml
>  >     [echo] Adding to modules.reactor.includes: modules/addressing/project.xml
>  >     [echo] Adding to modules.reactor.includes: modules/codegen/project.xml
>  >     [echo] Adding to modules.reactor.includes: modules/integration/project.xml
>  >     [echo] Adding to modules.reactor.includes: modules/java2wsdl/project.xml
>  >     [echo] Adding to modules.reactor.includes: modules/jaxbri/project.xml
>  >     [echo] Adding to modules.reactor.includes: modules/jaxws-api/project.xml
>  >     [echo] Adding to modules.reactor.includes: modules/jaxws/project.xml
>  >     [echo] Adding to modules.reactor.includes: modules/jibx/project.xml
>  >     [echo] Adding to modules.reactor.includes: modules/json/project.xml
>  >     [echo] Adding to modules.reactor.includes: modules/kernel/project.xml
>  >     [echo] Adding to modules.reactor.includes: modules/metadata/project.xml
>  >     [echo] Adding to modules.reactor.includes: modules/mtompolicy/project.xml
>  >     [echo] Adding to modules.reactor.includes: modules/rahas/project.xml
>  >     [echo] Adding to modules.reactor.includes: modules/saaj-api/project.xml
>  >     [echo] Adding to modules.reactor.includes: modules/saaj/project.xml
>  >     [echo] Adding to modules.reactor.includes: modules/samples/project.xml
>  >     [echo] Adding to modules.reactor.includes: modules/savan/project.xml
>  >     [echo] Adding to modules.reactor.includes: modules/secpolicy/project.xml
>  >     [echo] Adding to modules.reactor.includes: modules/security/project.xml
>  >     [echo] Adding to modules.reactor.includes: modules/soapmonitor/project.xml
>  >     [echo] Adding to modules.reactor.includes: modules/spring/project.xml
>  >     [echo] Adding to modules.reactor.includes: modules/tool/project.xml
>  >     [echo] Adding to modules.reactor.includes: modules/webapp/project.xml
>  >     [echo] Adding to modules.reactor.includes: modules/xmlbeans/project.xml
>  >
>  >     [echo] +----------------------------------------
>  >     [echo] | Cleaning: modules/adb-codegen
>  >     [echo] +----------------------------------------
>  >     [delete] Deleting directory /export/home/illsleyd/continuum/continuum-1.0.3/apps/continuum/working-directory/1/modules/adb-codegen/target
>  >     [echo]
>  >     [echo] +----------------------------------------
>  >     [echo] | Cleaning: modules/adb
>  >     [echo] +----------------------------------------
>  >     [delete] Deleting directory /export/home/illsleyd/continuum/continuum-1.0.3/apps/continuum/working-directory/1/modules/adb/target
>  >     [echo]
>  >     [echo] +----------------------------------------
>  >     [echo] | Cleaning: modules/addressing
>  >     [echo] +----------------------------------------
>  >     [delete] Deleting directory /export/home/illsleyd/continuum/continuum-1.0.3/apps/continuum/working-directory/1/modules/addressing/target
>  >     [echo]
>  >     [echo] +----------------------------------------
>  >     [echo] | Cleaning: modules/codegen
>  >     [echo] +----------------------------------------
>  >     [delete] Deleting directory /export/home/illsleyd/continuum/continuum-1.0.3/apps/continuum/working-directory/1/modules/codegen/target
>  >     [echo]
>  >     [echo] +----------------------------------------
>  >     [echo] | Cleaning: modules/integration
>  >     [echo] +----------------------------------------
>  >     [delete] Deleting directory /export/home/illsleyd/continuum/continuum-1.0.3/apps/continuum/working-directory/1/modules/integration/target
>  >     [echo]
>  >     [echo] +----------------------------------------
>  >     [echo] | Cleaning: modules/java2wsdl
>  >     [echo] +----------------------------------------
>  >     [delete] Deleting directory /export/home/illsleyd/continuum/continuum-1.0.3/apps/continuum/working-directory/1/modules/java2wsdl/target
>  >     [echo]
>  >     [echo] +----------------------------------------
>  >     [echo] | Cleaning: modules/jaxbri
>  >     [echo] +----------------------------------------
>  >     [delete] Deleting directory /export/home/illsleyd/continuum/continuum-1.0.3/apps/continuum/working-directory/1/modules/jaxbri/target
>  >     [echo]
>  >     [echo] +----------------------------------------
>  >     [echo] | Cleaning: modules/jaxws-api
>  >     [echo] +----------------------------------------
>  >     [delete] Deleting directory /export/home/illsleyd/continuum/continuum-1.0.3/apps/continuum/working-directory/1/modules/jaxws-api/target
>  >     [echo]
>  >     [echo] +----------------------------------------
>  >     [echo] | Cleaning: modules/jaxws
>  >     [echo] +----------------------------------------
>  >     [echo]
>  >     [echo] +----------------------------------------
>  >     [echo] | Cleaning: modules/jibx
>  >     [echo] +----------------------------------------
>  >     [delete] Deleting directory /export/home/illsleyd/continuum/continuum-1.0.3/apps/continuum/working-directory/1/modules/jibx/target
>  >     [echo]
>  >     [echo] +----------------------------------------
>  >     [echo] | Cleaning: modules/json
>  >     [echo] +----------------------------------------
>  >     [echo]
>  >     [echo] +----------------------------------------
>  >     [echo] | Cleaning: modules/kernel
>  >     [echo] +----------------------------------------
>  >     [delete] Deleting directory /export/home/illsleyd/continuum/continuum-1.0.3/apps/continuum/working-directory/1/modules/kernel/target
>  >     [echo]
>  >     [echo] +----------------------------------------
>  >     [echo] | Cleaning: modules/metadata
>  >     [echo] +----------------------------------------
>  >     [echo]
>  >     [echo] +----------------------------------------
>  >     [echo] | Cleaning: modules/mtompolicy
>  >     [echo] +----------------------------------------
>  >     [echo]
>  >     [echo] +----------------------------------------
>  >     [echo] | Cleaning: modules/rahas
>  >     [echo] +----------------------------------------
>  >     [delete] Deleting directory /export/home/illsleyd/continuum/continuum-1.0.3/apps/continuum/working-directory/1/modules/rahas/target
>  >     [echo]
>  >     [echo] +----------------------------------------
>  >     [echo] | Cleaning: modules/saaj-api
>  >     [echo] +----------------------------------------
>  >     [delete] Deleting directory /export/home/illsleyd/continuum/continuum-1.0.3/apps/continuum/working-directory/1/modules/saaj-api/target
>  >     [echo]
>  >     [echo] +----------------------------------------
>  >     [echo] | Cleaning: modules/saaj
>  >     [echo] +----------------------------------------
>  >     [delete] Deleting directory /export/home/illsleyd/continuum/continuum-1.0.3/apps/continuum/working-directory/1/modules/saaj/target
>  >     [echo]
>  >     [echo] +----------------------------------------
>  >     [echo] | Cleaning: modules/samples
>  >     [echo] +----------------------------------------
>  >     [delete] Deleting directory /export/home/illsleyd/continuum/continuum-1.0.3/apps/continuum/working-directory/1/modules/samples/target
>  >     [echo]
>  >     [echo] +----------------------------------------
>  >     [echo] | Cleaning: modules/savan
>  >     [echo] +----------------------------------------
>  >     [echo]
>  >     [echo] +----------------------------------------
>  >     [echo] | Cleaning: modules/secpolicy
>  >     [echo] +----------------------------------------
>  >     [delete] Deleting directory /export/home/illsleyd/continuum/continuum-1.0.3/apps/continuum/working-directory/1/modules/secpolicy/target
>  >     [echo]
>  >     [echo] +----------------------------------------
>  >     [echo] | Cleaning: modules/security
>  >     [echo] +----------------------------------------
>  >     [delete] Deleting directory /export/home/illsleyd/continuum/continuum-1.0.3/apps/continuum/working-directory/1/modules/security/target
>  >     [echo]
>  >     [echo] +----------------------------------------
>  >     [echo] | Cleaning: modules/soapmonitor
>  >     [echo] +----------------------------------------
>  >     [echo]
>  >     [echo] +----------------------------------------
>  >     [echo] | Cleaning: modules/spring
>  >     [echo] +----------------------------------------
>  >     [delete] Deleting directory /export/home/illsleyd/continuum/continuum-1.0.3/apps/continuum/working-directory/1/modules/spring/target
>  >     [echo]
>  >     [echo] +----------------------------------------
>  >     [echo] | Cleaning: modules/tool
>  >     [echo] +----------------------------------------
>  >     [delete] Deleting directory /export/home/illsleyd/continuum/continuum-1.0.3/apps/continuum/working-directory/1/modules/tool/target
>  >     [echo]
>  >     [echo] +----------------------------------------
>  >     [echo] | Cleaning: modules/webapp
>  >     [echo] +----------------------------------------
>  >     [echo]
>  >     [echo] +----------------------------------------
>  >     [echo] | Cleaning: modules/xmlbeans
>  >     [echo] +----------------------------------------
>  >     [delete] Deleting directory /export/home/illsleyd/continuum/continuum-1.0.3/apps/continuum/working-directory/1/modules/xmlbeans/target
>  >     [echo]
>  >     [echo] +----------------------------------------
>  >     [echo] | Cleaning: target and etc/target
>  >     [echo] +----------------------------------------
>  >
>  >
>  > jar:
>  > multiproject:install:
>  > multiproject:projects-init:
>  >     [echo] Gathering project list
>  > Starting the reactor...
>  > Our processing order:
>  > Apache Axis 2.0 - Java2WSDL
>  > Apache Axis 2.0 - Kernel
>  > Apache Axis 2.0 - Data Binding
>  > Apache Axis 2.0 - Code Generation
>  > Apache Axis 2.0 - ADB Codegen
>  > Apache Axis 2.0 - Addressing
>  > Apache Axis 2.0 - JiBX Data Binding
>  > Apache Axis 2.0 - Security Policy
>  > Apache Axis 2.0 - XMLBeans Data Binding
>  > Apache Axis 2.0 - Rahas
>  > Apache Axis 2.0 - Security
>  > Apache Axis 2.0 - Samples
>  > Apache Axis 2.0 - spring
>  > Apache Axis 2.0 - Tools
>  > Apache Axis 2.0 - Integration
>  > Apache Axis 2.0 - JAXB-RI Data Binding
>  > Apache Axis 2.0 - SAAJ API
>  > Apache Axis 2.0 - JAXWS API
>  > Apache Axis 2.0 - SAAJ
>  > Apache Axis 2.0 - Metadata
>  > Apache Axis 2.0 - JAX-WS
>  > Apache Axis 2.0 - JSON
>  > Apache Axis 2.0 - MTOM Policy
>  > Apache Axis 2.0 - Savan
>  > Apache Axis 2.0 - soapmonitor
>  > +----------------------------------------
>  > | Gathering project list Apache Axis 2.0 - Java2WSDL
>  > | Memory: 31M/38M
>  > +----------------------------------------
>  > +----------------------------------------
>  > | Gathering project list Apache Axis 2.0 - Kernel
>  > | Memory: 31M/38M
>  > +----------------------------------------
>  > +----------------------------------------
>  > | Gathering project list Apache Axis 2.0 - Data Binding
>  > | Memory: 31M/38M
>  > +----------------------------------------
>  > +----------------------------------------
>  > | Gathering project list Apache Axis 2.0 - Code Generation
>  > | Memory: 31M/38M
>  > +----------------------------------------
>  > +----------------------------------------
>  > | Gathering project list Apache Axis 2.0 - ADB Codegen
>  > | Memory: 31M/38M
>  > +----------------------------------------
>  > +----------------------------------------
>  > | Gathering project list Apache Axis 2.0 - Addressing
>  > | Memory: 31M/38M
>  > +----------------------------------------
>  > +----------------------------------------
>  > | Gathering project list Apache Axis 2.0 - JiBX Data Binding
>  > | Memory: 31M/38M
>  > +----------------------------------------
>  > +----------------------------------------
>  > | Gathering project list Apache Axis 2.0 - Security Policy
>  > | Memory: 31M/38M
>  > +----------------------------------------
>  > +----------------------------------------
>  > | Gathering project list Apache Axis 2.0 - XMLBeans Data Binding
>  > | Memory: 31M/38M
>  > +----------------------------------------
>  > +----------------------------------------
>  > | Gathering project list Apache Axis 2.0 - Rahas
>  > | Memory: 31M/38M
>  > +----------------------------------------
>  > +----------------------------------------
>  > | Gathering project list Apache Axis 2.0 - Security
>  > | Memory: 31M/38M
>  > +----------------------------------------
>  > +----------------------------------------
>  > | Gathering project list Apache Axis 2.0 - Samples
>  > | Memory: 31M/38M
>  > +----------------------------------------
>  > +----------------------------------------
>  > | Gathering project list Apache Axis 2.0 - spring
>  > | Memory: 31M/38M
>  > +----------------------------------------
>  > +----------------------------------------
>  > | Gathering project list Apache Axis 2.0 - Tools
>  > | Memory: 31M/38M
>  > +----------------------------------------
>  > +----------------------------------------
>  > | Gathering project list Apache Axis 2.0 - Integration
>  > | Memory: 31M/38M
>  > +----------------------------------------
>  > +----------------------------------------
>  > | Gathering project list Apache Axis 2.0 - JAXB-RI Data Binding
>  > | Memory: 31M/38M
>  > +----------------------------------------
>  > +----------------------------------------
>  > | Gathering project list Apache Axis 2.0 - SAAJ API
>  > | Memory: 31M/38M
>  > +----------------------------------------
>  > +----------------------------------------
>  > | Gathering project list Apache Axis 2.0 - JAXWS API
>  > | Memory: 31M/38M
>  > +----------------------------------------
>  > +----------------------------------------
>  > | Gathering project list Apache Axis 2.0 - SAAJ
>  > | Memory: 31M/38M
>  > +----------------------------------------
>  > +----------------------------------------
>  > | Gathering project list Apache Axis 2.0 - Metadata
>  > | Memory: 31M/38M
>  > +----------------------------------------
>  > +----------------------------------------
>  > | Gathering project list Apache Axis 2.0 - JAX-WS
>  > | Memory: 31M/38M
>  > +----------------------------------------
>  > +----------------------------------------
>  > | Gathering project list Apache Axis 2.0 - JSON
>  > | Memory: 31M/38M
>  > +----------------------------------------
>  > +----------------------------------------
>  > | Gathering project list Apache Axis 2.0 - MTOM Policy
>  > | Memory: 31M/38M
>  > +----------------------------------------
>  > +----------------------------------------
>  > | Gathering project list Apache Axis 2.0 - Savan
>  > | Memory: 31M/38M
>  > +----------------------------------------
>  > +----------------------------------------
>  > | Gathering project list Apache Axis 2.0 - soapmonitor
>  > | Memory: 31M/38M
>  > +----------------------------------------
>  >
>  > multiproject:goal:
>  > Starting the reactor...
>  > Our processing order:
>  > Apache Axis 2.0 - Java2WSDL
>  > Apache Axis 2.0 - Kernel
>  > Apache Axis 2.0 - Data Binding
>  > Apache Axis 2.0 - Code Generation
>  > Apache Axis 2.0 - ADB Codegen
>  > Apache Axis 2.0 - Addressing
>  > Apache Axis 2.0 - JiBX Data Binding
>  > Apache Axis 2.0 - Security Policy
>  > Apache Axis 2.0 - XMLBeans Data Binding
>  > Apache Axis 2.0 - Rahas
>  > Apache Axis 2.0 - Security
>  > Apache Axis 2.0 - Samples
>  > Apache Axis 2.0 - spring
>  > Apache Axis 2.0 - Tools
>  > Apache Axis 2.0 - Integration
>  > Apache Axis 2.0 - JAXB-RI Data Binding
>  > Apache Axis 2.0 - SAAJ API
>  > Apache Axis 2.0 - JAXWS API
>  > Apache Axis 2.0 - SAAJ
>  > Apache Axis 2.0 - Metadata
>  > Apache Axis 2.0 - JAX-WS
>  > Apache Axis 2.0 - JSON
>  > Apache Axis 2.0 - MTOM Policy
>  > Apache Axis 2.0 - Savan
>  > Apache Axis 2.0 - soapmonitor
>  > +----------------------------------------
>  > | Executing multiproject:install-callback Apache Axis 2.0 - Java2WSDL
>  > | Memory: 31M/38M
>  > +----------------------------------------
>  > DEPRECATED: the default goal should be specified in the <build> section of project.xml instead of maven.xml
>  > DEPRECATED: the default goal should be specified in the <build> section of project.xml instead of maven.xml
>  > Trying to get missing/snapshot dependencies required by Apache Axis 2.0 - Java2WSDL:
>  > Attempting to download axiom-api-SNAPSHOT.jar.
>  > 4/124K
>  > 8/124K
>  > 12/124K
>  > 16/124K
>  > 20/124K
>  > 24/124K
>  > 28/124K
>  > 32/124K
>  > 36/124K
>  > 40/124K
>  > 44/124K
>  > 48/124K
>  > 52/124K
>  > 56/124K
>  > 60/124K
>  > 64/124K
>  > 68/124K
>  > 72/124K
>  > 76/124K
>  > 80/124K
>  > 84/124K
>  > 88/124K
>  > 92/124K
>  > 96/124K
>  > 100/124K
>  > 104/124K
>  > 108/124K
>  > 112/124K
>  > 116/124K
>  > 120/124K
>  > 124/124K
>  > 124/124K
>  > 124K downloaded
>  > Error retrieving artifact from [http://people.apache.org/repo/m1-snapshot-repository/]: org.apache.maven.verifier.ChecksumVerificationException: Error retrieving checksum file for /org.apache.ws.commons.axiom/jars/axiom-api-SNAPSHOT.jar
>  > Skipping download as local copy is up to date!
>  > Attempting to download axiom-impl-SNAPSHOT.jar.
>  > 4/108K
>  > 8/108K
>  > 12/108K
>  > 16/108K
>  > 20/108K
>  > 24/108K
>  > 28/108K
>  > 28/108K
>  > 32/108K
>  > 36/108K
>  > 40/108K
>  > 44/108K
>  > 48/108K
>  > 52/108K
>  > 56/108K
>  > 60/108K
>  > 64/108K
>  > 68/108K
>  > 72/108K
>  > 76/108K
>  > 80/108K
>  > 84/108K
>  > 88/108K
>  > 92/108K
>  > 96/108K
>  > 100/108K
>  > 104/108K
>  > 108/108K
>  > 108/108K
>  > 108K downloaded
>  > Error retrieving artifact from [http://people.apache.org/repo/m1-snapshot-repository/]: org.apache.maven.verifier.ChecksumVerificationException: Error retrieving checksum file for /org.apache.ws.commons.axiom/jars/axiom-impl-SNAPSHOT.jar
>  > Skipping download as local copy is up to date!
>  > build:start:
>  >
>  > multiproject:install-callback:
>  >     [echo] Running jar:install for Apache Axis 2.0 - Java2WSDL
>  > java:prepare-filesystem:
>  >     [mkdir] Created dir: /export/home/illsleyd/continuum/continuum-1.0.3/apps/continuum/working-directory/1/modules/java2wsdl/target/classes
>  > Running post goal: java:prepare-filesystem
>  >
>  > java:compile:
>  >     [echo] Compiling to /export/home/illsleyd/continuum/continuum-1.0.3/apps/continuum/working-directory/1/modules/java2wsdl/target/classes
>  >     [javac] Compiling 22 source files to /export/home/illsleyd/continuum/continuum-1.0.3/apps/continuum/working-directory/1/modules/java2wsdl/target/classes
>  >
>  > java:jar-resources:
>  > Copying 2 files to /export/home/illsleyd/continuum/continuum-1.0.3/apps/continuum/working-directory/1/modules/java2wsdl/target/classes/META-INF
>  >
>  > test:test:
>  >     [echo] No tests to run.
>  >
>  > jar:jar:
>  >     [jar] Building jar: /export/home/illsleyd/continuum/continuum-1.0.3/apps/continuum/working-directory/1/modules/java2wsdl/target/axis2-java2wsdl-SNAPSHOT.jar
>  >
>  > jar:install:
>  >     [echo] Installing...
>  > Uploading to org.apache.axis2/jars/axis2-java2wsdl-SNAPSHOT.jar:
>  > .................... (55K)
>  > Uploading to org.apache.axis2/poms/axis2-java2wsdl-SNAPSHOT.pom:
>  > .................... (14K)
>  >
>  > +----------------------------------------
>  > | Executing multiproject:install-callback Apache Axis 2.0 - Kernel
>  > | Memory: 31M/38M
>  > +----------------------------------------
>  > DEPRECATED: the default goal should be specified in the <build> section of project.xml instead of maven.xml
>  > DEPRECATED: the default goal should be specified in the <build> section of project.xml instead of maven.xml
>  >
>  > build:end:
>  >
>  > Trying to get missing/snapshot dependencies required by Apache Axis 2.0 - Kernel:
>  > Attempting to download axis2-java2wsdl-SNAPSHOT.jar.
>  > Skipping download as local copy is up to date!
>  > Attempting to download neethi-SNAPSHOT.jar.
>  > 4/28K
>  > 8/28K
>  > 12/28K
>  > 16/28K
>  > 20/28K
>  > 24/28K
>  > 28/28K
>  > 28/28K
>  > 28K downloaded
>  > Error retrieving artifact from [http://people.apache.org/repo/m1-snapshot-repository/]: org.apache.maven.verifier.ChecksumVerificationException: Error retrieving checksum file for /org.apache.neethi/jars/neethi-SNAPSHOT.jar
>  > Skipping download as local copy is up to date!
>  > Attempting to download woden-1.0-incubating-SNAPSHOT.jar.
>  > 4/302K
>  > 8/302K
>  > 12/302K
>  > 16/302K
>  > 20/302K
>  > 24/302K
>  > 28/302K
>  > 28/302K
>  > 29/302K
>  > 33/302K
>  > 36/302K
>  > 40/302K
>  > 43/302K
>  > 47/302K
>  > 51/302K
>  > 55/302K
>  > 58/302K
>  > 62/302K
>  > 65/302K
>  > 69/302K
>  > 73/302K
>  > 77/302K
>  > 81/302K
>  > 85/302K
>  > 89/302K
>  > 93/302K
>  > 97/302K
>  > 101/302K
>  > 105/302K
>  > 109/302K
>  > 113/302K
>  > 117/302K
>  > 121/302K
>  > 125/302K
>  > 129/302K
>  > 133/302K
>  > 137/302K
>  > 141/302K
>  > 145/302K
>  > 149/302K
>  > 152/302K
>  > 156/302K
>  > 159/302K
>  > 163/302K
>  > 166/302K
>  > 170/302K
>  > 173/302K
>  > 177/302K
>  > 180/302K
>  > 184/302K
>  > 187/302K
>  > 191/302K
>  > 195/302K
>  > 199/302K
>  > 202/302K
>  > 206/302K
>  > 209/302K
>  > 213/302K
>  > 216/302K
>  > 220/302K
>  > 223/302K
>  > 227/302K
>  > 230/302K
>  > 234/302K
>  > 237/302K
>  > 241/302K
>  > 244/302K
>  > 248/302K
>  > 252/302K
>  > 256/302K
>  > 259/302K
>  > 263/302K
>  > 266/302K
>  > 270/302K
>  > 273/302K
>  > 277/302K
>  > 280/302K
>  > 284/302K
>  > 287/302K
>  > 291/302K
>  > 294/302K
>  > 298/302K
>  > 302/302K
>  > 302/302K
>  > 302K downloaded
>  > *** CHECKSUM FAILED - Checksum failed on download: local = '24cbd4d5fe5091fd1505adefb6cb015e'; remote = '658553e073272393cb170d04ea1ad0d8' - RETRYING
>  > 4/302K
>  > 8/302K
>  > 12/302K
>  > 16/302K
>  > 20/302K
>  > 24/302K
>  > 28/302K
>  > 32/302K
>  > 36/302K
>  > 40/302K
>  > 44/302K
>  > 48/302K
>  > 52/302K
>  > 56/302K
>  > 60/302K
> > 64/302K
>  > 68/302K
>  > 72/302K
>  > 76/302K
>  > 80/302K
>  > 84/302K
>  > 88/302K
>  > 92/302K
>  > 96/302K
>  > 100/302K
>  > 104/302K
>  > 104/302K
>  > 108/302K
>  > 111/302K
>  > 115/302K
>  > 118/302K
>  > 122/302K
>  > 126/302K
>  > 130/302K
>  > 133/302K
>  > 137/302K
>  > 141/302K
>  > 145/302K
>  > 149/302K
>  > 153/302K
>  > 157/302K
>  > 161/302K
>  > 165/302K
>  > 169/302K
>  > 173/302K
>  > 177/302K
>  > 181/302K
>  > 185/302K
>  > 189/302K
>  > 193/302K
>  > 197/302K
>  > 201/302K
>  > 204/302K
>  > 208/302K
>  > 211/302K
>  > 215/302K
>  > 218/302K
>  > 222/302K
>  > 225/302K
>  > 229/302K
>  > 232/302K
>  > 236/302K
>  > 240/302K
>  > 244/302K
>  > 247/302K
>  > 251/302K
>  > 254/302K
>  > 258/302K
>  > 261/302K
>  > 265/302K
>  > 268/302K
>  > 272/302K
>  > 275/302K
>  > 279/302K
>  > 282/302K
>  > 286/302K
>  > 290/302K
>  > 294/302K
>  > 298/302K
>  > 302/302K
>  > 302/302K
>  > 302K downloaded
>  > Error retrieving artifact from [http://people.apache.org/repo/m1-snapshot-repository/]: org.apache.maven.verifier.ChecksumVerificationException: Checksum failed on download: local = '24cbd4d5fe5091fd1505adefb6cb015e'; remote = '658553e073272393cb170d04ea1ad0d8'
>  > build:start:
>  >
>  > multiproject:install-callback:
>  >     [echo] Running jar:install for Apache Axis 2.0 - Kernel
>  > java:prepare-filesystem:
>  >     [mkdir] Created dir: /export/home/illsleyd/continuum/continuum-1.0.3/apps/continuum/working-directory/1/modules/kernel/target/classes
>  > Running post goal: java:prepare-filesystem
>  >
>  > java:compile:
>  >     [echo] Compiling to /export/home/illsleyd/continuum/continuum-1.0.3/apps/continuum/working-directory/1/modules/kernel/target/classes
>  >     [javac] Compiling 284 source files to /export/home/illsleyd/continuum/continuum-1.0.3/apps/continuum/working-directory/1/modules/kernel/target/classes
>  >     [javac] Note: Some input files use or override a deprecated API.
>  >     [javac] Note: Recompile with -Xlint:deprecation for details.
>  >
>  > java:jar-resources:
>  > Copying 1 file to /export/home/illsleyd/continuum/continuum-1.0.3/apps/continuum/working-directory/1/modules/kernel/target/classes
>  > Copying 2 files to /export/home/illsleyd/continuum/continuum-1.0.3/apps/continuum/working-directory/1/modules/kernel/target/classes
>  > Copying 2 files to /export/home/illsleyd/continuum/continuum-1.0.3/apps/continuum/working-directory/1/modules/kernel/target/classes/META-INF
>  >
>  > test:test:
>  > java:prepare-filesystem:
>  > Running post goal: java:prepare-filesystem
>  >
>  > java:compile:
>  >     [echo] Compiling to /export/home/illsleyd/continuum/continuum-1.0.3/apps/continuum/working-directory/1/modules/kernel/target/classes
>  >     [javac] Compiling 1 source file to /export/home/illsleyd/continuum/continuum-1.0.3/apps/continuum/working-directory/1/modules/kernel/target/classes
>  >
>  > java:jar-resources:
>  >
>  > test:prepare-filesystem:
>  >     [mkdir] Created dir: /export/home/illsleyd/continuum/continuum-1.0.3/apps/continuum/working-directory/1/modules/kernel/target/test-classes
>  >     [mkdir] Created dir: /export/home/illsleyd/continuum/continuum-1.0.3/apps/continuum/working-directory/1/modules/kernel/target/test-reports
>  >
>  > test:test-resources:
>  > Copying 61 files to /export/home/illsleyd/continuum/continuum-1.0.3/apps/continuum/working-directory/1/modules/kernel/target/test-classes/../test-resources
>  >
>  > test:compile:
>  >     [javac] Compiling 93 source files to /export/home/illsleyd/continuum/continuum-1.0.3/apps/continuum/working-directory/1/modules/kernel/target/test-classes
>  >     [javac] Note: Some input files use or override a deprecated API.
>  >     [javac] Note: Recompile with -Xlint:deprecation for details.
>  > Running post goal: test:compile
>  >     [echo] the files are up to date = ${jars.uptodate}
>  >     [mkdir] Created dir: /export/home/illsleyd/continuum/continuum-1.0.3/apps/continuum/working-directory/1/modules/kernel/test-resources/deployment/service2/build/classes
>  >     [mkdir] Created dir: /export/home/illsleyd/continuum/continuum-1.0.3/apps/continuum/working-directory/1/modules/kernel/test-resources/deployment/service2/build/lib
>  >     [copy] Copying 1 file to /export/home/illsleyd/continuum/continuum-1.0.3/apps/continuum/working-directory/1/modules/kernel/test-resources/deployment/service2/build/classes/META-INF
>  >     [mkdir] Created dir: /export/home/illsleyd/continuum/continuum-1.0.3/apps/continuum/working-directory/1/modules/kernel/target/test-resources/deployment/services
>  >     [jar] Building jar: /export/home/illsleyd/continuum/continuum-1.0.3/apps/continuum/working-directory/1/modules/kernel/target/test-resources/deployment/services/service2.jar
>  >     [delete] Deleting directory /export/home/illsleyd/continuum/continuum-1.0.3/apps/continuum/working-directory/1/modules/kernel/test-resources/deployment/service2/build
>  >     [echo] the files are up to date = ${jars.uptodate}
>  >     [mkdir] Created dir: /export/home/illsleyd/continuum/continuum-1.0.3/apps/continuum/working-directory/1/modules/kernel/test-resources/deployment/echo/build/classes
>  >     [mkdir] Created dir: /export/home/illsleyd/continuum/continuum-1.0.3/apps/continuum/working-directory/1/modules/kernel/test-resources/deployment/echo/build/lib
>  >     [copy] Copying 1 file to /export/home/illsleyd/continuum/continuum-1.0.3/apps/continuum/working-directory/1/modules/kernel/test-resources/deployment/echo/build/classes/META-INF
>  >     [mkdir] Created dir: /export/home/illsleyd/continuum/continuum-1.0.3/apps/continuum/working-directory/1/modules/kernel/target/echo
>  >     [jar] Building jar: /export/home/illsleyd/continuum/continuum-1.0.3/apps/continuum/working-directory/1/modules/kernel/target/echo/echo.aar
>  >     [delete] Deleting directory /export/home/illsleyd/continuum/continuum-1.0.3/apps/continuum/working-directory/1/modules/kernel/test-resources/deployment/echo/build
>  >     [echo] the files are up to date = ${jars.uptodate}
>  >     [mkdir] Created dir: /export/home/illsleyd/continuum/continuum-1.0.3/apps/continuum/working-directory/1/modules/kernel/test-resources/deployment/invalidservice/build/classes
>  >     [mkdir] Created dir: /export/home/illsleyd/continuum/continuum-1.0.3/apps/continuum/working-directory/1/modules/kernel/test-resources/deployment/invalidservice/build/lib
>  >     [copy] Copying 1 file to /export/home/illsleyd/continuum/continuum-1.0.3/apps/continuum/working-directory/1/modules/kernel/test-resources/deployment/invalidservice/build/classes/META-INF
>  >     [mkdir] Created dir: /export/home/illsleyd/continuum/continuum-1.0.3/apps/continuum/working-directory/1/modules/kernel/target/test-resources/InvalidDeployment/services
>  >     [jar] Building jar: /export/home/illsleyd/continuum/continuum-1.0.3/apps/continuum/working-directory/1/modules/kernel/target/test-resources/InvalidDeployment/services/invalidService.jar
>  >     [delete] Deleting directory /export/home/illsleyd/continuum/continuum-1.0.3/apps/continuum/working-directory/1/modules/kernel/test-resources/deployment/invalidservice/build
>  >     [echo] the files are up to date = ${jars.uptodate}
>  >     [mkdir] Created dir: /export/home/illsleyd/continuum/continuum-1.0.3/apps/continuum/working-directory/1/modules/kernel/test-resources/deployment/outservice/build/classes
>  >     [mkdir] Created dir: /export/home/illsleyd/continuum/continuum-1.0.3/apps/continuum/working-directory/1/modules/kernel/test-resources/deployment/outservice/build/lib
>  >     [copy] Copying 1 file to /export/home/illsleyd/continuum/continuum-1.0.3/apps/continuum/working-directory/1/modules/kernel/test-resources/deployment/outservice/build/classes/META-INF
>  >     [jar] Building jar: /export/home/illsleyd/continuum/continuum-1.0.3/apps/continuum/working-directory/1/modules/kernel/target/test-resources/deployment/services/OutService.jar
>  >     [delete] Deleting directory /export/home/illsleyd/continuum/continuum-1.0.3/apps/continuum/working-directory/1/modules/kernel/test-resources/deployment/outservice/build
>  >     [echo] the files are up to date = ${jars.uptodate}
>  >     [mkdir] Created dir: /export/home/illsleyd/continuum/continuum-1.0.3/apps/continuum/working-directory/1/modules/kernel/test-resources/deployment/module1/build/classes
>  >     [mkdir] Created dir: /export/home/illsleyd/continuum/continuum-1.0.3/apps/continuum/working-directory/1/modules/kernel/test-resources/deployment/module1/build/lib
>  >     [copy] Copying 1 file to /export/home/illsleyd/continuum/continuum-1.0.3/apps/continuum/working-directory/1/modules/kernel/test-resources/deployment/module1/build/classes/META-INF
>  >     [mkdir] Created dir: /export/home/illsleyd/continuum/continuum-1.0.3/apps/continuum/working-directory/1/modules/kernel/target/test-resources/deployment/modules
>  >     [jar] Building jar: /export/home/illsleyd/continuum/continuum-1.0.3/apps/continuum/working-directory/1/modules/kernel/target/test-resources/deployment/modules/module1.mar
>  >     [delete] Deleting directory /export/home/illsleyd/continuum/continuum-1.0.3/apps/continuum/working-directory/1/modules/kernel/test-resources/deployment/module1/build
>  >     [echo] the files are up to date = ${jars.uptodate}
>  >     [mkdir] Created dir: /export/home/illsleyd/continuum/continuum-1.0.3/apps/continuum/working-directory/1/modules/kernel/test-resources/deployment/serviceModule/build/classes
>  >     [mkdir] Created dir: /export/home/illsleyd/continuum/continuum-1.0.3/apps/continuum/working-directory/1/modules/kernel/test-resources/deployment/serviceModule/build/lib
>  >     [copy] Copying 1 file to /export/home/illsleyd/continuum/continuum-1.0.3/apps/continuum/working-directory/1/modules/kernel/test-resources/deployment/serviceModule/build/classes/META-INF
>  >     [mkdir] Created dir: /export/home/illsleyd/continuum/continuum-1.0.3/apps/continuum/working-directory/1/modules/kernel/target/test-resources/InvalidDeployment/modules
>  >     [jar] Building jar: /export/home/illsleyd/continuum/continuum-1.0.3/apps/continuum/working-directory/1/modules/kernel/target/test-resources/InvalidDeployment/modules/serviceModule.jar
>  >     [delete] Deleting directory /export/home/illsleyd/continuum/continuum-1.0.3/apps/continuum/working-directory/1/modules/kernel/test-resources/deployment/serviceModule/build
>  >     [mkdir] Created dir: /export/home/illsleyd/continuum/continuum-1.0.3/apps/continuum/working-directory/1/modules/kernel/target/test-resources/java2sec/more
>  >     [mkdir] Created dir: /export/home/illsleyd/continuum/continuum-1.0.3/apps/continuum/working-directory/1/modules/kernel/target/test-resources/java2sec/less
>  >     [jar] Building jar: /export/home/illsleyd/continuum/continuum-1.0.3/apps/continuum/working-directory/1/modules/kernel/target/test-resources/java2sec/more/MorePermission.jar
>  >     [delete] Deleting directory /export/home/illsleyd/continuum/continuum-1.0.3/apps/continuum/working-directory/1/modules/kernel/target/test-classes/org/apache/axis2/java/security/driver
>  >     [delete] Deleting directory /export/home/illsleyd/continuum/continuum-1.0.3/apps/continuum/working-directory/1/modules/kernel/target/test-classes/org/apache/axis2/java/security/more
>  >     [delete] Deleting directory /export/home/illsleyd/continuum/continuum-1.0.3/apps/continuum/working-directory/1/modules/kernel/target/test-classes/org/apache/axis2/java/security/action
>  >     [delete] Deleting directory /export/home/illsleyd/continuum/continuum-1.0.3/apps/continuum/working-directory/1/modules/kernel/target/test-classes/org/apache/axis2/java/security/interf
>  >     [jar] Building jar: /export/home/illsleyd/continuum/continuum-1.0.3/apps/continuum/working-directory/1/modules/kernel/target/test-resources/java2sec/less/LessPermission.jar
>  >     [delete] Deleting directory /export/home/illsleyd/continuum/continuum-1.0.3/apps/continuum/working-directory/1/modules/kernel/target/test-classes/org/apache/axis2/java/security/less
>  >
>  >
>  > jar:jar:
>  >     [copy] Copying 1 file to /export/home/illsleyd/continuum/continuum-1.0.3/apps/continuum/working-directory/1/modules/kernel/target/classes/org/apache/axis2/i18n
>  >     [jar] Building jar: /export/home/illsleyd/continuum/continuum-1.0.3/apps/continuum/working-directory/1/modules/kernel/target/axis2-kernel-SNAPSHOT.jar
>  >
>  > jar:install:
>  >     [echo] Installing...
>  > Uploading to org.apache.axis2/jars/axis2-kernel-SNAPSHOT.jar:
>  > .................... (798K)
>  > Uploading to org.apache.axis2/poms/axis2-kernel-SNAPSHOT.pom:
>  > .................... (15K)
>  >
>  > +----------------------------------------
>  > | Executing multiproject:install-callback Apache Axis 2.0 - Data Binding
>  > | Memory: 14M/44M
>  > +----------------------------------------
>  > DEPRECATED: the default goal should be specified in the <build> section of project.xml instead of maven.xml
>  > DEPRECATED: the default goal should be specified in the <build> section of project.xml instead of maven.xml
>  >
>  > build:end:
>  >
>  > Trying to get missing/snapshot dependencies required by Apache Axis 2.0 - Data Binding:
>  > Attempting to download axiom-dom-SNAPSHOT.jar.
>  > 4/130K
>  > 8/130K
>  > 12/130K
>  > 16/130K
>  > 20/130K
>  > 24/130K
>  > 28/130K
>  > 28/130K
>  > 29/130K
>  > 33/130K
>  > 36/130K
>  > 40/130K
>  > 44/130K
>  > 48/130K
>  > 51/130K
>  > 55/130K
>  > 58/130K
>  > 62/130K
>  > 65/130K
>  > 66/130K
>  > 70/130K
>  > 74/130K
>  > 78/130K
>  > 80/130K
>  > 84/130K
>  > 88/130K
>  > 92/130K
>  > 95/130K
>  > 99/130K
>  > 102/130K
>  > 106/130K
>  > 109/130K
>  > 113/130K
>  > 116/130K
>  > 120/130K
>  > 123/130K
>  > 127/130K
>  > 130/130K
>  > 130K downloaded
>  > Error retrieving artifact from [http://people.apache.org/repo/m1-snapshot-repository/]: org.apache.maven.verifier.ChecksumVerificationException: Error retrieving checksum file for /org.apache.ws.commons.axiom/jars/axiom-dom-SNAPSHOT.jar
>  > Skipping download as local copy is up to date!
>  > Attempting to download axis2-kernel-SNAPSHOT.jar.
>  > Skipping download as local copy is up to date!
>  > build:start:
>  >
>  > multiproject:install-callback:
>  >     [echo] Running jar:install for Apache Axis 2.0 - Data Binding
>  > java:prepare-filesystem:
>  >     [mkdir] Created dir: /export/home/illsleyd/continuum/continuum-1.0.3/apps/continuum/working-directory/1/modules/adb/target/classes
>  > Running post goal: java:prepare-filesystem
>  >
>  > java:compile:
>  >     [echo] Compiling to /export/home/illsleyd/continuum/continuum-1.0.3/apps/continuum/working-directory/1/modules/adb/target/classes
>  >     [javac] Compiling 62 source files to /export/home/illsleyd/continuum/continuum-1.0.3/apps/continuum/working-directory/1/modules/adb/target/classes
>  >     [javac] Note: /export/home/illsleyd/continuum/continuum-1.0.3/apps/continuum/working-directory/1/modules/adb/src/org/apache/axis2/databinding/types/Union.java uses or overrides a deprecated API.
>  >     [javac] Note: Recompile with -Xlint:deprecation for details.
>  >
>  > java:jar-resources:
>  > Copying 1 file to /export/home/illsleyd/continuum/continuum-1.0.3/apps/continuum/working-directory/1/modules/adb/target/classes
>  > Copying 2 files to /export/home/illsleyd/continuum/continuum-1.0.3/apps/continuum/working-directory/1/modules/adb/target/classes/META-INF
>  >
>  > test:test:
>  > java:prepare-filesystem:
>  > Running post goal: java:prepare-filesystem
>  >
>  > java:compile:
>  >     [echo] Compiling to /export/home/illsleyd/continuum/continuum-1.0.3/apps/continuum/working-directory/1/modules/adb/target/classes
>  >
>  > java:jar-resources:
>  >
>  > test:prepare-filesystem:
>  >     [mkdir] Created dir: /export/home/illsleyd/continuum/continuum-1.0.3/apps/continuum/working-directory/1/modules/adb/target/test-classes
>  >     [mkdir] Created dir: /export/home/illsleyd/continuum/continuum-1.0.3/apps/continuum/working-directory/1/modules/adb/target/test-reports
>  >
>  > test:test-resources:
>  > Copying 1 file to /export/home/illsleyd/continuum/continuum-1.0.3/apps/continuum/working-directory/1/modules/adb/target/test-classes
>  > Copying 1 file to /export/home/illsleyd/continuum/continuum-1.0.3/apps/continuum/working-directory/1/modules/adb/target/test-classes
>  >
>  > test:compile:
>  >     [javac] Compiling 9 source files to /export/home/illsleyd/continuum/continuum-1.0.3/apps/continuum/working-directory/1/modules/adb/target/test-classes
>  >
>  >     [junit] Running org.apache.axis2.databinding.ADBSOAPModelBuilderTest
>  >     [junit] Tests run: 5, Failures: 0, Errors: 0, Time elapsed: 0.745 sec
>  >     [junit] Running org.apache.axis2.databinding.utils.NamedStaxOMBuilderTest
>  >     [junit] Tests run: 2, Failures: 0, Errors: 0, Time elapsed: 0.805 sec
>  >     [junit] Running org.apache.axis2.databinding.utils.SimpleArrayReaderStateMachineTest
>  >     [junit] Tests run: 4, Failures: 0, Errors: 0, Time elapsed: 0.691 sec
>  >     [junit] Running org.apache.axis2.databinding.utils.SimpleElementReaderStateMachineTest
>  >     [junit] Tests run: 3, Failures: 0, Errors: 0, Time elapsed: 0.573 sec
>  >     [junit] Running org.apache.axis2.databinding.utils.reader.ADBXMLStreamReaderTest
>  >     [junit] Tests run: 15, Failures: 0, Errors: 0, Time elapsed: 1.118 sec
>  >
>  > jar:jar:
>  >     [jar] Building jar: /export/home/illsleyd/continuum/continuum-1.0.3/apps/continuum/working-directory/1/modules/adb/target/axis2-adb-SNAPSHOT.jar
>  >
>  > jar:install:
>  >     [echo] Installing...
>  > Uploading to org.apache.axis2/jars/axis2-adb-SNAPSHOT.jar:
>  > .................... (137K)
>  > Uploading to org.apache.axis2/poms/axis2-adb-SNAPSHOT.pom:
>  > .................... (14K)
>  >
>  > +----------------------------------------
>  > | Executing multiproject:install-callback Apache Axis 2.0 - Code Generation
>  > | Memory: 21M/44M
>  > +----------------------------------------
>  > DEPRECATED: the default goal should be specified in the <build> section of project.xml instead of maven.xml
>  > DEPRECATED: the default goal should be specified in the <build> section of project.xml instead of maven.xml
>  >
>  > build:end:
>  >
>  > Trying to get missing/snapshot dependencies required by Apache Axis 2.0 - Code Generation:
>  > Attempting to download axis2-adb-SNAPSHOT.jar.
>  > Skipping download as local copy is up to date!
>  > build:start:
>  >
>  > multiproject:install-callback:
>  >     [echo] Running jar:install for Apache Axis 2.0 - Code Generation
>  > java:prepare-filesystem:
>  >     [mkdir] Created dir: /export/home/illsleyd/continuum/continuum-1.0.3/apps/continuum/working-directory/1/modules/codegen/target/classes
>  > Running post goal: java:prepare-filesystem
>  >
>  > java:compile:
>  >     [echo] Compiling to /export/home/illsleyd/continuum/continuum-1.0.3/apps/continuum/working-directory/1/modules/codegen/target/classes
>  >     [javac] Compiling 69 source files to /export/home/illsleyd/continuum/continuum-1.0.3/apps/continuum/working-directory/1/modules/codegen/target/classes
>  >
>  > java:jar-resources:
>  > Copying 33 files to /export/home/illsleyd/continuum/continuum-1.0.3/apps/continuum/working-directory/1/modules/codegen/target/classes
>  > Copying 2 files to /export/home/illsleyd/continuum/continuum-1.0.3/apps/continuum/working-directory/1/modules/codegen/target/classes/META-INF
>  > Running post goal: java:jar-resources
>  >
>  > test:test:
>  > java:prepare-filesystem:
>  > Running post goal: java:prepare-filesystem
>  >
>  > java:compile:
>  >     [echo] Compiling to /export/home/illsleyd/continuum/continuum-1.0.3/apps/continuum/working-directory/1/modules/codegen/target/classes
>  >
>  > java:jar-resources:
>  > Running post goal: java:jar-resources
>  >
>  > test:prepare-filesystem:
>  >     [mkdir] Created dir: /export/home/illsleyd/continuum/continuum-1.0.3/apps/continuum/working-directory/1/modules/codegen/target/test-classes
>  >     [mkdir] Created dir: /export/home/illsleyd/continuum/continuum-1.0.3/apps/continuum/working-directory/1/modules/codegen/target/test-reports
>  >
>  > test:test-resources:
>  > Copying 6 files to /export/home/illsleyd/continuum/continuum-1.0.3/apps/continuum/working-directory/1/modules/codegen/target/test-classes
>  > Copying 31 files to /export/home/illsleyd/continuum/continuum-1.0.3/apps/continuum/working-directory/1/modules/codegen/target/test-classes
>  >
>  > test:compile:
>  >     [javac] Compiling 2 source files to /export/home/illsleyd/continuum/continuum-1.0.3/apps/continuum/working-directory/1/modules/codegen/target/test-classes
>  >
>  >     [junit] Running org.apache.axis2.wsdl.WSDLServiceBuilderTest
>  >     [junit] Tests run: 1, Failures: 0, Errors: 0, Time elapsed: 4.158 sec
>  >     [junit] Running org.apache.axis2.wsdl.codegen.extension.SchemaUnwrapperExtensionTest
>  >     [junit] Tests run: 4, Failures: 0, Errors: 0, Time elapsed: 0.839 sec
>  >
>  > jar:jar:
>  >     [jar] Building jar: /export/home/illsleyd/continuum/continuum-1.0.3/apps/continuum/working-directory/1/modules/codegen/target/axis2-codegen-SNAPSHOT.jar
>  >
>  > jar:install:
>  >     [echo] Installing...
>  > Uploading to org.apache.axis2/jars/axis2-codegen-SNAPSHOT.jar:
>  > .................... (178K)
>  > Uploading to org.apache.axis2/poms/axis2-codegen-SNAPSHOT.pom:
>  > .................... (17K)
>  >
>  > +----------------------------------------
>  > | Executing multiproject:install-callback Apache Axis 2.0 - ADB Codegen
>  > | Memory: 36M/44M
>  > +----------------------------------------
>  > DEPRECATED: the default goal should be specified in the <build> section of project.xml instead of maven.xml
>  > DEPRECATED: the default goal should be specified in the <build> section of project.xml instead of maven.xml
>  >
>  > build:end:
>  >
>  > Trying to get missing/snapshot dependencies required by Apache Axis 2.0 - ADB Codegen:
>  > Attempting to download axis2-codegen-SNAPSHOT.jar.
>  > Skipping download as local copy is up to date!
>  > build:start:
>  >
>  > multiproject:install-callback:
>  >     [echo] Running jar:install for Apache Axis 2.0 - ADB Codegen
>  > java:prepare-filesystem:
>  >     [mkdir] Created dir: /export/home/illsleyd/continuum/continuum-1.0.3/apps/continuum/working-directory/1/modules/adb-codegen/target/classes
>  > Running post goal: java:prepare-filesystem
>  >
>  > java:compile:
>  >     [echo] Compiling to /export/home/illsleyd/continuum/continuum-1.0.3/apps/continuum/working-directory/1/modules/adb-codegen/target/classes
>  >     [javac] Compiling 17 source files to /export/home/illsleyd/continuum/continuum-1.0.3/apps/continuum/working-directory/1/modules/adb-codegen/target/classes
>  >
>  > java:jar-resources:
>  > Copying 8 files to /export/home/illsleyd/continuum/continuum-1.0.3/apps/continuum/working-directory/1/modules/adb-codegen/target/classes
>  > Copying 2 files to /export/home/illsleyd/continuum/continuum-1.0.3/apps/continuum/working-directory/1/modules/adb-codegen/target/classes/META-INF
>  >
>  > test:test:
>  > java:prepare-filesystem:
>  > Running post goal: java:prepare-filesystem
>  >
>  > java:compile:
>  >     [echo] Compiling to /export/home/illsleyd/continuum/continuum-1.0.3/apps/continuum/working-directory/1/modules/adb-codegen/target/classes
>  >
>  > java:jar-resources:
>  >
>  > test:prepare-filesystem:
>  >     [mkdir] Created dir: /export/home/illsleyd/continuum/continuum-1.0.3/apps/continuum/working-directory/1/modules/adb-codegen/target/test-classes
>  >     [mkdir] Created dir: /export/home/illsleyd/continuum/continuum-1.0.3/apps/continuum/working-directory/1/modules/adb-codegen/target/test-reports
>  >
>  > test:test-resources:
>  > Copying 32 files to /export/home/illsleyd/continuum/continuum-1.0.3/apps/continuum/working-directory/1/modules/adb-codegen/target/test-classes
>  > Copying 8 files to /export/home/illsleyd/continuum/continuum-1.0.3/apps/continuum/working-directory/1/modules/adb-codegen/target/test-classes
>  >
>  > test:compile:
>  >     [mkdir] Created dir: /export/home/illsleyd/continuum/continuum-1.0.3/apps/continuum/working-directory/1/modules/adb-codegen/target/schema
>  >     [mkdir] Created dir: /export/home/illsleyd/continuum/continuum-1.0.3/apps/continuum/working-directory/1/modules/adb-codegen/target/schema/src
>  >     [mkdir] Created dir: /export/home/illsleyd/continuum/continuum-1.0.3/apps/continuum/working-directory/1/modules/adb-codegen/target/schema/classes
>  >     [echo] Compiling simple_maxOccurs2.xsd
>  >     [echo] Compiling anonymous_complexType.xsd
>  >     [echo] Compiling simple_choice.xsd
>  >     [echo] Compiling simple_particle_all.xsd
>  >     [echo] Compiling simple_maxOccurs.xsd
>  >     [echo] Compiling simple_anytype.xsd
>  >     [echo] Compiling simple-minoccurs0.xsd
>  >     [echo] Compiling complex-minoccurs0.xsd
>  >     [echo] Compiling simple-recursive-datatypes.xsd
>  >     [echo] Compiling mixed_minoccus0.xsd
>  >     [echo] Compiling complete.xsd
>  >     [echo] Compiling simpleExtension.xsd
>  >     [echo] Compiling union.xsd
>  >     [echo] Compiling all.xsd
>  >     [javac] Compiling 135 source files to /export/home/illsleyd/continuum/continuum-1.0.3/apps/continuum/working-directory/1/modules/adb-codegen/target/schema/classes
>  >     [javac] Note: Some input files use unchecked or unsafe operations.
>  >     [javac] Note: Recompile with -Xlint:unchecked for details.
>  >     [javac] Compiling 76 source files to /export/home/illsleyd/continuum/continuum-1.0.3/apps/continuum/working-directory/1/modules/adb-codegen/target/test-classes
>  >
>  >     [junit] Running org.apache.axis2.schema.all.AllTest
>  >     [junit] Tests run: 1, Failures: 0, Errors: 0, Time elapsed: 0.567 sec
>  >     [junit] Running org.apache.axis2.schema.compile.AnonymousComplexTypeTest
>  >     [junit] Tests run: 1, Failures: 0, Errors: 0, Time elapsed: 3.789 sec
>  >     [junit] Running org.apache.axis2.schema.compile.ComplexAllTest
>  >     [junit] Tests run: 1, Failures: 0, Errors: 0, Time elapsed: 4.241 sec
>  >     [junit] Running org.apache.axis2.schema.compile.ComplexExtensionTest
>  >     [junit] Tests run: 1, Failures: 0, Errors: 0, Time elapsed: 2.975 sec
>  >     [junit] Running org.apache.axis2.schema.compile.ImportTest
>  >     [junit] Tests run: 1, Failures: 0, Errors: 0, Time elapsed: 4.175 sec
>  >     [junit] Running org.apache.axis2.schema.compile.RecursiveCompileTest
>  >     [junit] Tests run: 1, Failures: 0, Errors: 0, Time elapsed: 2.818 sec
>  >     [junit] Running org.apache.axis2.schema.compile.SimpleAnyAttribTest
>  >     [junit] Tests run: 1, Failures: 0, Errors: 0, Time elapsed: 3.31 sec
>  >     [junit] Running org.apache.axis2.schema.compile.SimpleAnyTest
>  >     [junit] Tests run: 1, Failures: 0, Errors: 0, Time elapsed: 3.233 sec
>  >     [junit] Running org.apache.axis2.schema.compile.SimpleAnyTypeTest
>  >     [junit] Tests run: 1, Failures: 0, Errors: 0, Time elapsed: 3.3 sec
>  >     [junit] Running org.apache.axis2.schema.compile.SimpleAttributeTest
>  >     [junit] Tests run: 1, Failures: 0, Errors: 0, Time elapsed: 3.633 sec
>  >     [junit] Running org.apache.axis2.schema.compile.SimpleChoiceTest
>  >     [junit] Tests run: 1, Failures: 0, Errors: 0, Time elapsed: 4.118 sec
>  >     [junit] Running org.apache.axis2.schema.compile.SimpleContentExtensionTest
>  >     [junit] Tests run: 1, Failures: 0, Errors: 0, Time elapsed: 4.625 sec
>  >     [junit] Running org.apache.axis2.schema.compile.SimpleElementReferenceTest
>  >     [junit] Tests run: 1, Failures: 0, Errors: 0, Time elapsed: 4.098 sec
>  >     [junit] Running org.apache.axis2.schema.compile.SimpleElementTest
>  >     [junit] Tests run: 1, Failures: 0, Errors: 0, Time elapsed: 4.106 sec
>  >     [junit] Running org.apache.axis2.schema.compile.SimpleParticleAllTest
>  >     [junit] Tests run: 1, Failures: 0, Errors: 0, Time elapsed: 5.759 sec
>  >     [junit] Running org.apache.axis2.schema.compile.SimpleRestrictionTest
>  >     [junit] Tests run: 1, Failures: 0, Errors: 0, Time elapsed: 4.892 sec
>  >     [junit] Running org.apache.axis2.schema.compile.SimpleSequence2Test
>  >     [junit] Tests run: 1, Failures: 0, Errors: 0, Time elapsed: 4.45 sec
>  >     [junit] Running org.apache.axis2.schema.compile.SimpleSequenceTest
>  >     [junit] Tests run: 1, Failures: 0, Errors: 0, Time elapsed: 3.353 sec
>  >     [junit] Running org.apache.axis2.schema.compile.XmlMaxOccurs2Test
>  >     [junit] Tests run: 1, Failures: 0, Errors: 0, Time elapsed: 3.28 sec
>  >     [junit] Running org.apache.axis2.schema.compile.XmlmaxOccursTest
>  >     [junit] Tests run: 1, Failures: 0, Errors: 0, Time elapsed: 3.818 sec
>  >     [junit] Running org.apache.axis2.schema.compile.simple.SimpleTypeAllCompileTest
>  >     [junit] Tests run: 1, Failures: 0, Errors: 0, Time elapsed: 7.052 sec
>  >     [junit] Running org.apache.axis2.schema.extension.ComplexExtenstionTest
>  >     [junit] Tests run: 1, Failures: 0, Errors: 0, Time elapsed: 0.376 sec
>  >     [junit] Running org.apache.axis2.schema.extension.SimpleExtensionTest
>  >     [junit] Tests run: 1, Failures: 0, Errors: 0, Time elapsed: 0.659 sec
>  >     [junit] Running org.apache.axis2.schema.populate.derived.DerivedTypeBytePopulateTest
>  >     [junit] Tests run: 1, Failures: 0, Errors: 0, Time elapsed: 1.038 sec
>  >     [junit] Running org.apache.axis2.schema.populate.derived.DerivedTypeIntPopulateTest
>  >     [junit] Tests run: 1, Failures: 0, Errors: 0, Time elapsed: 0.686 sec
>  >     [junit] Running org.apache.axis2.schema.populate.derived.DerivedTypeIntegerPopulateTest
>  >     [junit] Tests run: 1, Failures: 0, Errors: 0, Time elapsed: 1.643 sec
>  >     [junit] Running org.apache.axis2.schema.populate.derived.DerivedTypeLongPopulateTest
>  >     [junit] Tests run: 1, Failures: 0, Errors: 0, Time elapsed: 0.943 sec
>  >     [junit] Running org.apache.axis2.schema.populate.derived.DerivedTypeNegativeIntegerPopulateTest
>  >     [junit] Tests run: 1, Failures: 0, Errors: 0, Time elapsed: 0.731 sec
>  >     [junit] Running org.apache.axis2.schema.populate.derived.DerivedTypeNonNegativeIntegerPopulateTest
>  >     [junit] Tests run: 1, Failures: 0, Errors: 0, Time elapsed: 1.013 sec
>  >     [junit] Running org.apache.axis2.schema.populate.derived.DerivedTypeNonPositiveIntegerPopulateTest
>  >     [junit] Tests run: 1, Failures: 0, Errors: 0, Time elapsed: 0.749 sec
>  >     [junit] Running org.apache.axis2.schema.populate.derived.DerivedTypePositveIntegerPopulateTest
>  >     [junit] Tests run: 1, Failures: 0, Errors: 0, Time elapsed: 1.103 sec
>  >     [junit] Running org.apache.axis2.schema.populate.derived.DerivedTypeShortPopulateTest
>  >     [junit] Tests run: 1, Failures: 0, Errors: 0, Time elapsed: 1.277 sec
>  >     [junit] Running org.apache.axis2.schema.populate.derived.DerivedTypeUnsignedBytePopulateTest
>  >     [junit] Tests run: 1, Failures: 0, Errors: 0, Time elapsed: 2.011 sec
>  >     [junit] Running org.apache.axis2.schema.populate.derived.DerivedTypeUnsignedIntPopulateTest
>  >     [junit] Tests run: 1, Failures: 0, Errors: 0, Time elapsed: 1.232 sec
>  >     [junit] Running org.apache.axis2.schema.populate.derived.DerivedTypeUnsignedLongPopulateTest
>  >     [junit] Tests run: 1, Failures: 0, Errors: 0, Time elapsed: 0.902 sec
>  >     [junit] Running org.apache.axis2.schema.populate.derived.DerivedTypeUnsignedShortPopulateTest
>  >     [junit] Tests run: 1, Failures: 0, Errors: 0, Time elapsed: 0.919 sec
>  >     [junit] Running org.apache.axis2.schema.populate.other.ADBInOutTest
>  >     [junit] Tests run: 2, Failures: 0, Errors: 0, Time elapsed: 0.834 sec
>  >     [junit] Running org.apache.axis2.schema.populate.other.PopulateAnonComplexTypeTest
>  >     [junit] Tests run: 1, Failures: 0, Errors: 0, Time elapsed: 1.081 sec
>  >     [junit] Running org.apache.axis2.schema.populate.other.PopulateAnyTypeTest
>  >     [junit] Tests run: 1, Failures: 0, Errors: 0, Time elapsed: 1.405 sec
>  >     [junit] Running org.apache.axis2.schema.populate.other.PopulateArrayInArrayTest
>  >     [junit] Tests run: 1, Failures: 0, Errors: 0, Time elapsed: 0.772 sec
>  >     [junit] Running org.apache.axis2.schema.populate.other.PopulateArrayTest
>  >     [junit] Tests run: 1, Failures: 0, Errors: 0, Time elapsed: 0.562 sec
>  >     [junit] Running org.apache.axis2.schema.populate.other.PopulateChoiceTest
>  >     [junit] Tests run: 1, Failures: 0, Errors: 0, Time elapsed: 0.607 sec
>  >     [junit] Running org.apache.axis2.schema.populate.other.PopulateComplexMinOccurs0Test
>  >     [junit] Tests run: 4, Failures: 0, Errors: 0, Time elapsed: 0.744 sec
>  >     [junit] Running org.apache.axis2.schema.populate.other.PopulateMinOccurs0Test
>  >     [junit] Tests run: 3, Failures: 0, Errors: 0, Time elapsed: 0.688 sec
>  >     [junit] Running org.apache.axis2.schema.populate.other.PopulateMixedMinoccurs0Test
>  >     [junit] Tests run: 2, Failures: 0, Errors: 0, Time elapsed: 0.736 sec
>  >     [junit] Running org.apache.axis2.schema.populate.other.PopulateParticleAllTest
>  >     [junit] Tests run: 1, Failures: 0, Errors: 0, Time elapsed: 0.627 sec
>  >     [junit] Running org.apache.axis2.schema.populate.other.PopulateRecursiveTest
>  >     [junit] Tests run: 1, Failures: 0, Errors: 0, Time elapsed: 0.518 sec
>  >     [junit] Running org.apache.axis2.schema.populate.simple.SimpleTypeAnyURIPopulateTest
>  >     [junit] Tests run: 1, Failures: 0, Errors: 0, Time elapsed: 0.767 sec
>  >     [junit] Running org.apache.axis2.schema.populate.simple.SimpleTypeBase64BinPopulateTest
>  >     [junit] Tests run: 1, Failures: 0, Errors: 0, Time elapsed: 0.513 sec
>  >     [junit] Running org.apache.axis2.schema.populate.simple.SimpleTypeBooleanPopulateTest
>  >     [junit] Tests run: 1, Failures: 0, Errors: 0, Time elapsed: 0.634 sec
>  >     [junit] Running org.apache.axis2.schema.populate.simple.SimpleTypeDatePopulateTest
>  >     [junit] Tests run: 1, Failures: 0, Errors: 0, Time elapsed: 0.556 sec
>  >     [junit] Running org.apache.axis2.schema.populate.simple.SimpleTypeDateTimePopulateTest
>  >     [junit] Tests run: 1, Failures: 0, Errors: 0, Time elapsed: 1.094 sec
>  >     [junit] Running org.apache.axis2.schema.populate.simple.SimpleTypeDayPopulateTest
>  >     [junit] Tests run: 1, Failures: 0, Errors: 0, Time elapsed: 0.565 sec
>  >     [junit] Running org.apache.axis2.schema.populate.simple.SimpleTypeDoublePopulateTest
>  >     [junit] Tests run: 1, Failures: 0, Errors: 0, Time elapsed: 0.547 sec
>  >     [junit] Running org.apache.axis2.schema.populate.simple.SimpleTypeDurationPopulateTest
>  >     [junit] Tests run: 1, Failures: 0, Errors: 0, Time elapsed: 0.523 sec
>  >     [junit] Running org.apache.axis2.schema.populate.simple.SimpleTypeFloatPopulateTest
>  >     [junit] Tests run: 1, Failures: 0, Errors: 0, Time elapsed: 0.552 sec
>  >     [junit] Running org.apache.axis2.schema.populate.simple.SimpleTypeHexBinaryPopulateTest
>  >     [junit] Tests run: 1, Failures: 0, Errors: 0, Time elapsed: 0.516 sec
>  >     [junit] Running org.apache.axis2.schema.populate.simple.SimpleTypeMonthDayPopulateTest
>  >     [junit] Tests run: 1, Failures: 0, Errors: 0, Time elapsed: 0.651 sec
>  >     [junit] Running org.apache.axis2.schema.populate.simple.SimpleTypeQNamePopulateTest
>  >     [junit] Tests run: 1, Failures: 0, Errors: 0, Time elapsed: 1.003 sec
>  >     [junit] Running org.apache.axis2.schema.populate.simple.SimpleTypeTimePopulateTest
>  >     [junit] Tests run: 1, Failures: 0, Errors: 0, Time elapsed: 0.623 sec
>  >     [junit] Running org.apache.axis2.schema.populate.simple.SimpleTypegMonthPopulateTest
>  >     [junit] Tests run: 1, Failures: 0, Errors: 0, Time elapsed: 0.583 sec
>  >     [junit] Running org.apache.axis2.schema.populate.simple.SimpleTypegYearMonthPopulateTest
>  >     [junit] Tests run: 1, Failures: 0, Errors: 0, Time elapsed: 0.712 sec
>  >     [junit] Running org.apache.axis2.schema.populate.simple.SimpleTypegYearPopulateTest
>  >     [junit] Tests run: 1, Failures: 0, Errors: 0, Time elapsed: 0.518 sec
>  >     [junit] Running org.apache.axis2.schema.restriction.ComplexRestrictionTest
>  >     [junit] Tests run: 1, Failures: 0, Errors: 0, Time elapsed: 0.333 sec
>  >     [junit] Running org.apache.axis2.schema.restriction.SimpleRestrictionTest
>  >     [junit] Tests run: 1, Failures: 0, Errors: 0, Time elapsed: 0.375 sec
>  >     [junit] Running org.apache.axis2.schema.testsuite.AnyElementsTest
>  >     [junit] Tests run: 2, Failures: 0, Errors: 0, Time elapsed: 0.768 sec
>  >     [junit] Running org.apache.axis2.schema.testsuite.CustomElementsTest
>  >     [junit] Tests run: 2, Failures: 0, Errors: 0, Time elapsed: 0.992 sec
>  >     [junit] Running org.apache.axis2.schema.testsuite.IntElementsTest
>  >     [junit] Tests run: 2, Failures: 0, Errors: 0, Time elapsed: 0.807 sec
>  >     [junit] Running org.apache.axis2.schema.testsuite.OuterElementsTest
>  >     [junit] Tests run: 4, Failures: 0, Errors: 0, Time elapsed: 0.963 sec
>  >     [junit] Running org.apache.axis2.schema.testsuite.StringElementsTest
>  >     [junit] Tests run: 2, Failures: 0, Errors: 0, Time elapsed: 1.172 sec
>  >     [junit] Running org.apache.axis2.schema.testsuite.XsdAnyElementsTest
>  >     [junit] Tests run: 2, Failures: 0, Errors: 0, Time elapsed: 0.768 sec
>  >     [junit] Running org.apache.axis2.schema.union.UnionTest
>  >     [junit] Tests run: 3, Failures: 0, Errors: 0, Time elapsed: 0.794 sec
>  >
>  > jar:jar:
>  >     [jar] Building jar: /export/home/illsleyd/continuum/continuum-1.0.3/apps/continuum/working-directory/1/modules/adb-codegen/target/axis2-adb-codegen-SNAPSHOT.jar
>  >
>  > jar:install:
>  >     [echo] Installing...
>  > Uploading to org.apache.axis2/jars/axis2-adb-codegen-SNAPSHOT.jar:
>  > .................... (114K)
>  > Uploading to org.apache.axis2/poms/axis2-adb-codegen-SNAPSHOT.pom:
>  > .................... (15K)
>  >
>  > +----------------------------------------
>  > | Executing multiproject:install-callback Apache Axis 2.0 - Addressing
>  > | Memory: 32M/56M
>  > +----------------------------------------
>  > DEPRECATED: the default goal should be specified in the <build> section of project.xml instead of maven.xml
>  > DEPRECATED: the default goal should be specified in the <build> section of project.xml instead of maven.xml
>  >
>  > build:end:
>  >
>  > build:start:
>  >
>  > multiproject:install-callback:
>  >     [echo] Running jar:install for Apache Axis 2.0 - Addressing
>  > java:prepare-filesystem:
>  >     [mkdir] Created dir: /export/home/illsleyd/continuum/continuum-1.0.3/apps/continuum/working-directory/1/modules/addressing/target/classes
>  > Running post goal: java:prepare-filesystem
>  >
>  > java:compile:
>  >     [echo] Compiling to /export/home/illsleyd/continuum/continuum-1.0.3/apps/continuum/working-directory/1/modules/addressing/target/classes
>  >     [javac] Compiling 9 source files to /export/home/illsleyd/continuum/continuum-1.0.3/apps/continuum/working-directory/1/modules/addressing/target/classes
>  > Running post goal: java:compile
>  >     [mkdir] Created dir: /export/home/illsleyd/continuum/continuum-1.0.3/apps/continuum/working-directory/1/modules/addressing/target/classes/META-INF
>  >     [copy] Copying 1 file to /export/home/illsleyd/continuum/continuum-1.0.3/apps/continuum/working-directory/1/modules/addressing/target/classes/META-INF
>  >     [copy] Copying 1 file to /export/home/illsleyd/continuum/continuum-1.0.3/apps/continuum/working-directory/1/modules/addressing/target/classes/META-INF
>  >     [copy] Copying 1 file to /export/home/illsleyd/continuum/continuum-1.0.3/apps/continuum/working-directory/1/modules/addressing/target/classes/META-INF
>  >     [copy] Copying 1 file to /export/home/illsleyd/continuum/continuum-1.0.3/apps/continuum/working-directory/1/modules/addressing/target
>  >     [mkdir] Created dir: /export/home/illsleyd/continuum/continuum-1.0.3/apps/continuum/working-directory/1/modules/addressing/target/modules
> >     [jar] Building jar: /export/home/illsleyd/continuum/continuum-1.0.3/apps/continuum/working-directory/1/modules/addressing/target/addressing-SNAPSHOT.mar
>  >     [copy] Copying 1 file to /export/home/illsleyd/continuum/continuum-1.0.3/apps/continuum/working-directory/1/modules/addressing/target/modules
>  >     [copy] Copying 1 file to /export/home/illsleyd/.maven/repository/org.apache.axis2/mars
>  >
>  > java:jar-resources:
>  > Copying 1 file to /export/home/illsleyd/continuum/continuum-1.0.3/apps/continuum/working-directory/1/modules/addressing/target/classes
>  >
>  > test:test:
>  > java:prepare-filesystem:
>  > Running post goal: java:prepare-filesystem
>  >
>  > java:compile:
>  >     [echo] Compiling to /export/home/illsleyd/continuum/continuum-1.0.3/apps/continuum/working-directory/1/modules/addressing/target/classes
>  > Running post goal: java:compile
>  >     [copy] Copying 1 file to /export/home/illsleyd/continuum/continuum-1.0.3/apps/continuum/working-directory/1/modules/addressing/target/classes/META-INF
>  >     [copy] Copying 1 file to /export/home/illsleyd/continuum/continuum-1.0.3/apps/continuum/working-directory/1/modules/addressing/target/classes/META-INF
>  >     [jar] Building jar: /export/home/illsleyd/continuum/continuum-1.0.3/apps/continuum/working-directory/1/modules/addressing/target/addressing-SNAPSHOT.mar
>  >     [copy] Copying 1 file to /export/home/illsleyd/continuum/continuum-1.0.3/apps/continuum/working-directory/1/modules/addressing/target/modules
>  >     [copy] Copying 1 file to /export/home/illsleyd/.maven/repository/org.apache.axis2/mars
>  >
>  > java:jar-resources:
>  >
>  > test:prepare-filesystem:
>  >     [mkdir] Created dir: /export/home/illsleyd/continuum/continuum-1.0.3/apps/continuum/working-directory/1/modules/addressing/target/test-classes
>  >     [mkdir] Created dir: /export/home/illsleyd/continuum/continuum-1.0.3/apps/continuum/working-directory/1/modules/addressing/target/test-reports
>  >
>  > test:test-resources:
>  > Copying 35 files to /export/home/illsleyd/continuum/continuum-1.0.3/apps/continuum/working-directory/1/modules/addressing/target/test-classes
>  > Copying 2 files to /export/home/illsleyd/continuum/continuum-1.0.3/apps/continuum/working-directory/1/modules/addressing/target/test-classes
>  >
>  > test:compile:
>  >     [javac] Compiling 8 source files to /export/home/illsleyd/continuum/continuum-1.0.3/apps/continuum/working-directory/1/modules/addressing/target/test-classes
>  >     [javac] Note: /export/home/illsleyd/continuum/continuum-1.0.3/apps/continuum/working-directory/1/modules/addressing/test/org/apache/axis2/handlers/addressing/AddressingOutHandlerTest.java uses or overrides a deprecated API.
>  >     [javac] Note: Recompile with -Xlint:deprecation for details.
>  >
>  >     [junit] Running org.apache.axis2.addressing.AddressingFaultsTest
>  >     [junit] Tests run: 6, Failures: 0, Errors: 0, Time elapsed: 0.423 sec
>  >     [junit] Running org.apache.axis2.handlers.addressing.AddressingFinalInHandlerTest
>  >     [junit] Tests run: 17, Failures: 0, Errors: 0, Time elapsed: 0.94 sec
>  >     [junit] Running org.apache.axis2.handlers.addressing.AddressingInFaultHandlerTest
>  >     [junit] Tests run: 4, Failures: 0, Errors: 0, Time elapsed: 1.009 sec
>  >     [junit] Running org.apache.axis2.handlers.addressing.AddressingOutHandlerTest
>  >     [junit] Tests run: 6, Failures: 0, Errors: 0, Time elapsed: 1.888 sec
>  >     [junit] Running org.apache.axis2.handlers.addressing.AddressingSubmissionInHandlerTest
>  >     [junit] Tests run: 14, Failures: 0, Errors: 0, Time elapsed: 1.375 sec
>  >     [junit] Running org.apache.axis2.handlers.addressing.AddressingValidationHandlerTest
>  >     [junit] Tests run: 4, Failures: 0, Errors: 0, Time elapsed: 1.568 sec
>  >
>  > jar:jar:
>  >     [jar] Building jar: /export/home/illsleyd/continuum/continuum-1.0.3/apps/continuum/working-directory/1/modules/addressing/target/axis2-addressing-SNAPSHOT.jar
>  >
>  > jar:install:
>  >     [echo] Installing...
>  > Uploading to org.apache.axis2/jars/axis2-addressing-SNAPSHOT.jar:
>  > .................... (32K)
>  > Uploading to org.apache.axis2/poms/axis2-addressing-SNAPSHOT.pom:
>  > .................... (15K)
>  >
>  > +----------------------------------------
>  > | Executing multiproject:install-callback Apache Axis 2.0 - JiBX Data Binding
>  > | Memory: 26M/57M
>  > +----------------------------------------
>  > DEPRECATED: the default goal should be specified in the <build> section of project.xml instead of maven.xml
>  > DEPRECATED: the default goal should be specified in the <build> section of project.xml instead of maven.xml
>  >
>  > build:end:
>  >
>  > build:start:
>  >
>  > multiproject:install-callback:
>  >     [echo] Running jar:install for Apache Axis 2.0 - JiBX Data Binding
>  > java:prepare-filesystem:
>  >     [mkdir] Created dir: /export/home/illsleyd/continuum/continuum-1.0.3/apps/continuum/working-directory/1/modules/jibx/target/classes
>  > Running post goal: java:prepare-filesystem
>  >
>  > java:compile:
>  >     [echo] Compiling to /export/home/illsleyd/continuum/continuum-1.0.3/apps/continuum/working-directory/1/modules/jibx/target/classes
>  >     [javac] Compiling 3 source files to /export/home/illsleyd/continuum/continuum-1.0.3/apps/continuum/working-directory/1/modules/jibx/target/classes
>  >
>  > java:jar-resources:
>  > Copying 2 files to /export/home/illsleyd/continuum/continuum-1.0.3/apps/continuum/working-directory/1/modules/jibx/target/classes/META-INF
>  >
>  > test:test:
>  > java:prepare-filesystem:
>  > Running post goal: java:prepare-filesystem
>  >
>  > java:compile:
>  >     [echo] Compiling to /export/home/illsleyd/continuum/continuum-1.0.3/apps/continuum/working-directory/1/modules/jibx/target/classes
>  >
>  > java:jar-resources:
>  >
>  > test:prepare-filesystem:
>  >     [mkdir] Created dir: /export/home/illsleyd/continuum/continuum-1.0.3/apps/continuum/working-directory/1/modules/jibx/target/test-classes
>  >     [mkdir] Created dir: /export/home/illsleyd/continuum/continuum-1.0.3/apps/continuum/working-directory/1/modules/jibx/target/test-reports
>  >
>  > test:test-resources:
>  > Copying 7 files to /export/home/illsleyd/continuum/continuum-1.0.3/apps/continuum/working-directory/1/modules/jibx/target/test-classes
>  > Copying 1 file to /export/home/illsleyd/continuum/continuum-1.0.3/apps/continuum/working-directory/1/modules/jibx/target/test-classes
>  >
>  > test:compile:
>  >     [javac] Compiling 17 source files to /export/home/illsleyd/continuum/continuum-1.0.3/apps/continuum/working-directory/1/modules/jibx/target/test-classes
>  > Running post goal: test:compile
>  >     [java] Using paths:
>  >     [java]  /export/home/illsleyd/.maven/repository/org.apache.ws.commons.axiom/jars/axiom-api-SNAPSHOT.jar
>  >     [java]  /export/home/illsleyd/.maven/repository/org.apache.ws.commons.axiom/jars/axiom-impl-SNAPSHOT.jar
>  >     [java]  /export/home/illsleyd/.maven/repository/org.apache.ws.commons.schema/jars/XmlSchema-1.2.jar
>  >     [java]  /export/home/illsleyd/.maven/repository/org.apache.neethi/jars/neethi-SNAPSHOT.jar
>  >     [java]  /export/home/illsleyd/.maven/repository/org.apache.axis2/jars/axis2-codegen-SNAPSHOT.jar
>  >     [java]  /export/home/illsleyd/.maven/repository/org.apache.axis2/jars/axis2-java2wsdl-SNAPSHOT.jar
>  >     [java]  /export/home/illsleyd/.maven/repository/org.apache.axis2/jars/axis2-kernel-SNAPSHOT.jar
>  >     [java]  /export/home/illsleyd/.maven/repository/wsdl4j/jars/wsdl4j-1.6.2.jar
>  >     [java]  /export/home/illsleyd/.maven/repository/ant/jars/ant-1.6.5.jar
>  >     [java]  /export/home/illsleyd/.maven/repository/commons-logging/jars/commons-logging-1.1.jar
>  >     [java]  /export/home/illsleyd/.maven/repository/org.apache.bcel/jars/bcel-5.2.jar
>  >     [java]  /export/home/illsleyd/.maven/repository/commons-httpclient/jars/commons-httpclient-3.0.1.jar
>  >     [java]  /export/home/illsleyd/.maven/repository/commons-codec/jars/commons-codec-1.3.jar
>  >     [java]  /export/home/illsleyd/.maven/repository/httpcomponents-httpcore/jars/jakarta-httpcore-4.0-alpha3.jar
>  >     [java]  /export/home/illsleyd/.maven/repository/backport-util-concurrent/jars/backport-util-concurrent-2.2.jar
>  >     [java]  /export/home/illsleyd/.maven/repository/org.codehaus.woodstox/jars/wstx-asl-3.2.0.jar
>  >     [java]  /export/home/illsleyd/.maven/repository/stax/jars/stax-api-1.0.1.jar
>  >     [java]  /export/home/illsleyd/.maven/repository/javax.mail/jars/mail-1.4.jar
>  >     [java]  /export/home/illsleyd/.maven/repository/javax.mail/jars/activation.jar
>  >     [java]  /export/home/illsleyd/.maven/repository/jibx/jars/jibx-bind-1.1.2.jar
>  >     [java]  /export/home/illsleyd/.maven/repository/jibx/jars/bcel.jar
>  >     [java]  /export/home/illsleyd/.maven/repository/jibx/jars/jibx-run.jar
>  >     [java]  /export/home/illsleyd/.maven/repository/jibx/jars/xpp3.jar
>  >     [java]  /export/home/illsleyd/.maven/repository/jibx/jars/stax-api.jar
>  >     [java]  /export/home/illsleyd/.maven/repository/jibx/jars/wstx-asl.jar
>  >     [java]  /export/home/illsleyd/.maven/repository/jibx/jars/jibx-run-1.1.2.jar
>  >     [java]  /export/home/illsleyd/.maven/repository/org.apache.woden/jars/woden-1.0-incubating-SNAPSHOT.jar
>  >     [java]  /export/home/illsleyd/continuum/continuum-1.0.3/apps/continuum/working-directory/1/modules/jibx/target/test-classes
>  >     [java]  .
>  >     [java] Using bindings:
>  >     [java]  test-resources/binding/customer-binding.xml
>  >     [java]  test-resources/binding/library-binding.xml
>  >     [java] Running binding compiler version jibx_1_1_2
>  >     [java] binding customer_binding:
>  >     [java]  context (mp#=1) (cv#=0) (fm#=0)
>  >     [java]   mapping class org.apache.axis2.jibx.Customer to element customer (#0)
>  >     [java]    context (ns#=1) (cv#=0) (fm#=0)
>  >     [java]     namespace http://ws.apache.org/axis2/jibx/customer/data
>  >     [java]    element wrapper customer
>  >     [java]     object binding for org.apache.axis2.jibx.Customer create class org.apache.axis2.jibx.Customer
>  >     [java]      structure ordered
>  >     [java]       element wrapper person
>  >     [java]        component property person (org.apache.axis2.jibx.Person)
>  >     [java]         object binding for org.apache.axis2.jibx.Person create class org.apache.axis2.jibx.Person
>  >     [java]          structure ordered
>  >     [java]           element {http://ws.apache.org/axis2/jibx/customer/data}:cust-num from property customerNumber (int)
>  >     [java]           element {http://ws.apache.org/axis2/jibx/customer/data}:first-name from property firstName (java.lang.String)
>  >     [java]           element {http://ws.apache.org/axis2/jibx/customer/data}:last-name from property lastName (java.lang.String)
>  >     [java]       element {http://ws.apache.org/axis2/jibx/customer/data}:street from property street (java.lang.String)
>  >     [java]       element {http://ws.apache.org/axis2/jibx/customer/data}:city from property city (java.lang.String)
>  >     [java]       element {http://ws.apache.org/axis2/jibx/customer/data}:state from property state (java.lang.String)
>  >     [java]       element {http://ws.apache.org/axis2/jibx/customer/data}:zip from property zip (java.lang.Integer)
>  >     [java]       element {http://ws.apache.org/axis2/jibx/customer/data}:phone from property phone (java.lang.String)
>  >     [java] binding library_binding:
>  >     [java]  context (mp#=12) (cv#=0) (fm#=0)
>  >     [java]   mapping class org.apache.axis2.jibx.wrappers.GetBookRequest to element getBook (#1)
>  >     [java]    context (ns#=1) (cv#=0) (fm#=0)
>  >     [java]     namespace http://ws.sosnoski.com/library/types
>  >     [java]    element wrapper getBook
>  >     [java]     object binding for org.apache.axis2.jibx.wrappers.GetBookRequest create class org.apache.axis2.jibx.wrappers.GetBookRequest
>  >     [java]      structure ordered
>  >     [java]       element {http://ws.sosnoski.com/library/types}:isbn from property m_isbn (java.lang.String)
>  >     [java]   mapping class org.apache.axis2.jibx.wrappers.GetBookResponse to element getBookResponse (#2)
>  >     [java]    context (ns#=1) (cv#=0) (fm#=0)
>  >     [java]     namespace http://ws.sosnoski.com/library/types
>  >     [java]    element wrapper getBookResponse
>  >     [java]     object binding for org.apache.axis2.jibx.wrappers.GetBookResponse create class org.apache.axis2.jibx.wrappers.GetBookResponse
>  >     [java]      structure ordered
>  >     [java]       mapping reference to tns:BookInformation using optional property m_book (org.apache.axis2.jibx.beans.Book)
>  >     [java]   mapping class org.apache.axis2.jibx.wrappers.GetBooksByTypeRequest to element getBooksByType (#3)
>  >     [java]    context (ns#=1) (cv#=0) (fm#=0)
>  >     [java]     namespace http://ws.sosnoski.com/library/types
>  >     [java]    element wrapper getBooksByType
>  >     [java]     object binding for org.apache.axis2.jibx.wrappers.GetBooksByTypeRequest create class org.apache.axis2.jibx.wrappers.GetBooksByTypeRequest
>  >     [java]      structure ordered
>  >     [java]       element {http://ws.sosnoski.com/library/types}:type from property m_type (java.lang.String)
>  >     [java]   mapping class org.apache.axis2.jibx.wrappers.GetBooksByTypeResponse to element getBooksByTypeResponse (#4)
>  >     [java]    context (ns#=1) (cv#=0) (fm#=0)
>  >     [java]     namespace http://ws.sosnoski.com/library/types
>  >     [java]    element wrapper getBooksByTypeResponse
>  >     [java]     object binding for org.apache.axis2.jibx.wrappers.GetBooksByTypeResponse create class org.apache.axis2.jibx.wrappers.GetBooksByTypeResponse
>  >     [java]      structure ordered
>  >     [java]       component optional property m_books (org.apache.axis2.jibx.beans.Book[])
>  >     [java]        object binding for org.apache.axis2.jibx.beans.Book[] create class org.apache.axis2.jibx.beans.Book[]
>  >     [java]         collection ordered (org.apache.axis2.jibx.beans.Book)
>  >     [java]          mapping reference to tns:BookInformation using property from collection
>  >     [java]   mapping class org.apache.axis2.jibx.wrappers.GetTypesRequest to element getTypes (#5)
>  >     [java]    context (ns#=1) (cv#=0) (fm#=0)
>  >     [java]     namespace http://ws.sosnoski.com/library/types
>  >     [java]    element wrapper getTypes
>  >     [java]     object binding for org.apache.axis2.jibx.wrappers.GetTypesRequest create class org.apache.axis2.jibx.wrappers.GetTypesRequest
>  >     [java]      structure ordered
>  >     [java]   mapping class org.apache.axis2.jibx.wrappers.GetTypesResponse to element getTypesResponse (#6)
>  >     [java]    context (ns#=1) (cv#=0) (fm#=0)
>  >     [java]     namespace http://ws.sosnoski.com/library/types
>  >     [java]    element wrapper getTypesResponse
>  >     [java]     object binding for org.apache.axis2.jibx.wrappers.GetTypesResponse create class org.apache.axis2.jibx.wrappers.GetTypesResponse
>  >     [java]      structure ordered
>  >     [java]       component optional property m_types (org.apache.axis2.jibx.beans.Type[])
>  >     [java]        object binding for org.apache.axis2.jibx.beans.Type[] create class org.apache.axis2.jibx.beans.Type[]
>  >     [java]         collection ordered (org.apache.axis2.jibx.beans.Type)
>  >     [java]          mapping reference to tns:TypeInformation using property from collection
>  >     [java]   mapping class org.apache.axis2.jibx.wrappers.AddBookRequest to element addBook (#7)
>  >     [java]    context (ns#=1) (cv#=0) (fm#=0)
>  >     [java]     namespace http://ws.sosnoski.com/library/types
>  >     [java]    element wrapper addBook
>  >     [java]     object binding for org.apache.axis2.jibx.wrappers.AddBookRequest create class org.apache.axis2.jibx.wrappers.AddBookRequest
>  >     [java]      structure ordered
>  >     [java]       component property m_book (org.apache.axis2.jibx.beans.Book)
>  >     [java]        object binding for org.apache.axis2.jibx.beans.Book create class org.apache.axis2.jibx.beans.Book
>  >     [java]         structure ordered
>  >     [java]          element {http://ws.sosnoski.com/library/types}:type from property m_type (java.lang.String)
>  >     [java]          element {http://ws.sosnoski.com/library/types}:isbn from property m_isbn (java.lang.String)
>  >     [java]          component property m_authors (java.lang.String[])
>  >     [java]           object binding for java.lang.String[] create class java.lang.String[]
>  >     [java]            collection ordered (java.lang.String)
>  >     [java]             element {http://ws.sosnoski.com/library/types}:author from property from collection (java.lang.String)
>  >     [java]          element {http://ws.sosnoski.com/library/types}:title from property m_title (java.lang.String)
>  >     [java]   mapping class org.apache.axis2.jibx.wrappers.AddBookResponse to element addBookResponse (#8)
>  >     [java]    context (ns#=1) (cv#=0) (fm#=0)
>  >     [java]     namespace http://ws.sosnoski.com/library/types
>  >     [java]    element wrapper addBookResponse
>  >     [java]     object binding for org.apache.axis2.jibx.wrappers.AddBookResponse create class org.apache.axis2.jibx.wrappers.AddBookResponse
>  >     [java]      structure ordered
>  >     [java]       element {http://ws.sosnoski.com/library/types}:addBookReturn from property m_success (boolean)
>  >     [java]   mapping class org.apache.axis2.jibx.wrappers.AddBookInstanceRequest to element addBookInstance (#9)
>  >     [java]    context (ns#=1) (cv#=0) (fm#=0)
>  >     [java]     namespace http://ws.sosnoski.com/library/types
>  >     [java]    element wrapper addBookInstance
>  >     [java]     object binding for org.apache.axis2.jibx.wrappers.AddBookInstanceRequest create class org.apache.axis2.jibx.wrappers.AddBookInstanceRequest
>  >     [java]      structure ordered
>  >     [java]       mapping reference to tns:BookInformation using property m_book (org.apache.axis2.jibx.beans.Book)
>  >     [java]   mapping class org.apache.axis2.jibx.wrappers.AddBookInstanceResponse to element addBookInstanceResponse (#10)
>  >     [java]    context (ns#=1) (cv#=0) (fm#=0)
>  >     [java]     namespace http://ws.sosnoski.com/library/types
>  >     [java]    element wrapper addBookInstanceResponse
>  >     [java]     object binding for org.apache.axis2.jibx.wrappers.AddBookInstanceResponse create class org.apache.axis2.jibx.wrappers.AddBookInstanceResponse
>  >     [java]      structure ordered
>  >     [java]   mapping class org.apache.axis2.jibx.beans.Book (#11) (abstract)
>  >     [java]    context (ns#=2) (cv#=0) (fm#=0)
>  >     [java]     namespace http://ws.sosnoski.com/library/types
>  >     [java]     namespace http://ws.sosnoski.com/library/types (prefix types)
>  >     [java]    object binding for org.apache.axis2.jibx.beans.Book create class org.apache.axis2.jibx.beans.Book
>  >     [java]     structure ordered
>  >     [java]      attribute type from property m_type (java.lang.String)
>  >     [java]      attribute isbn from property m_isbn (java.lang.String)
>  >     [java]      component property m_authors (java.lang.String[])
>  >     [java]       object binding for java.lang.String[] create class java.lang.String[]
>  >     [java]        collection ordered (java.lang.String)
>  >     [java]         element {http://ws.sosnoski.com/library/types}:author from property from collection (java.lang.String)
>  >     [java]      element {http://ws.sosnoski.com/library/types}:title from property m_title (java.lang.String)
>  >     [java]   mapping class org.apache.axis2.jibx.beans.Type (#12) (abstract)
>  >     [java]    context (ns#=1) (cv#=0) (fm#=0)
>  >     [java]     namespace http://ws.sosnoski.com/library/types
>  >     [java]    object binding for org.apache.axis2.jibx.beans.Type create class org.apache.axis2.jibx.beans.Type
>  >     [java]     structure ordered
>  >     [java]      attribute name from property m_name (java.lang.String)
>  >     [java]      attribute count from property m_count (int)
>  >     [java]      text from property m_description (java.lang.String)
>  >     [java] Generating code for mapping org.apache.axis2.jibx.Customer
>  >     [java] After linking view of binding customer_binding:
>  >     [java] binding customer_binding:
>  >     [java]  context (mp#=1) (cv#=0) (fm#=0)
>  >     [java]   mapping class org.apache.axis2.jibx.Customer to element {http://ws.apache.org/axis2/jibx/customer/data}:customer (#0)
>  >     [java]    c...
>
> [Message clipped]



-- 
Davanum Srinivas :: http://wso2.org/ :: Oxygen for Web Services Developers

---------------------------------------------------------------------
To unsubscribe, e-mail: axis-dev-unsubscribe@ws.apache.org
For additional commands, e-mail: axis-dev-help@ws.apache.org


Mime
View raw message