axis-java-dev mailing list archives

Site index · List index
Message view « Date » · « Thread »
Top « Date » · « Thread »
From Bill Nagy <n...@watson.ibm.com>
Subject Re: [continuum] BUILD FAILURE: Axis2
Date Tue, 27 Feb 2007 14:39:04 GMT
Hi Chamikara,

These are failing for me, and they seem to be failing on the Continuum
server.  (I'm running Linux and Continuum is running on Solaris I
believe.)

Testsuite: org.apache.axis2.clustering.tribes.ManageContextTest
Tests run: 1, Failures: 1, Errors: 0, Time elapsed: 10.724 sec

------------- Standard Error -----------------
Feb 27, 2007 6:36:44 AM
org.apache.catalina.tribes.transport.ReceiverBase bind
INFO: Receiver Server Socket bound to:/127.0.0.1:4000
Feb 27, 2007 6:36:45 AM
org.apache.catalina.tribes.membership.McastServiceImpl setupSocket
INFO: Setting cluster mcast soTimeout to 500
Feb 27, 2007 6:36:45 AM
org.apache.catalina.tribes.membership.McastServiceImpl waitForMembers
INFO: Sleeping for 1000 milliseconds to establish cluster membership,
start level:4
Feb 27, 2007 6:36:46 AM
org.apache.catalina.tribes.membership.McastServiceImpl waitForMembers
INFO: Done sleeping, membership established, start level:4
Feb 27, 2007 6:36:46 AM
org.apache.catalina.tribes.membership.McastServiceImpl waitForMembers
INFO: Sleeping for 1000 milliseconds to establish cluster membership,
start level:8
Feb 27, 2007 6:36:47 AM
org.apache.catalina.tribes.membership.McastServiceImpl waitForMembers
INFO: Done sleeping, membership established, start level:8
Feb 27, 2007 6:36:47 AM
org.apache.catalina.tribes.transport.ReceiverBase bind
INFO: Receiver Server Socket bound to:/127.0.0.1:4001
Feb 27, 2007 6:36:47 AM
org.apache.catalina.tribes.membership.McastServiceImpl setupSocket
INFO: Setting cluster mcast soTimeout to 500
Feb 27, 2007 6:36:47 AM
org.apache.catalina.tribes.membership.McastServiceImpl waitForMembers
INFO: Sleeping for 1000 milliseconds to establish cluster membership,
start level:4
Feb 27, 2007 6:36:48 AM
org.apache.catalina.tribes.membership.McastServiceImpl waitForMembers
INFO: Done sleeping, membership established, start level:4
Feb 27, 2007 6:36:48 AM
org.apache.catalina.tribes.membership.McastServiceImpl waitForMembers
INFO: Sleeping for 1000 milliseconds to establish cluster membership,
start level:8
Feb 27, 2007 6:36:49 AM
org.apache.catalina.tribes.membership.McastServiceImpl waitForMembers
INFO: Done sleeping, membership established, start level:8
Feb 27, 2007 6:36:49 AM
org.apache.axis2.cluster.tribes.TribesClusterManager send
SEVERE: Error sending command message : TribesCommandMessage
[CREATE_SERVICE_GROUP_CONTEXT,,urn:uuid:E7807C850E3E04AAE91172587009539,testService]
org.apache.catalina.tribes.ChannelException: No destination given; No
faulty members identified.
	at
org.apache.catalina.tribes.group.GroupChannel.send(GroupChannel.java:195)
	at
org.apache.catalina.tribes.group.GroupChannel.send(GroupChannel.java:176)
	at
org.apache.axis2.cluster.tribes.TribesClusterManager.send(TribesClusterManager.java:364)
	at
org.apache.axis2.cluster.tribes.TribesClusterManager.addContext(TribesClusterManager.java:153)
	at
org.apache.axis2.clustering.ManageContextTestCase.testAddContext(ManageContextTestCase.java:38)
	at sun.reflect.NativeMethodAccessorImpl.invoke0(Native Method)
	at
sun.reflect.NativeMethodAccessorImpl.invoke(NativeMethodAccessorImpl.java:64)
	at
sun.reflect.DelegatingMethodAccessorImpl.invoke(DelegatingMethodAccessorImpl.java:43)
	at java.lang.reflect.Method.invoke(Method.java:615)
	at junit.framework.TestCase.runTest(TestCase.java:164)
	at junit.framework.TestCase.runBare(TestCase.java:130)
	at junit.framework.TestResult$1.protect(TestResult.java:106)
	at junit.framework.TestResult.runProtected(TestResult.java:124)
	at junit.framework.TestResult.run(TestResult.java:109)
	at junit.framework.TestCase.run(TestCase.java:120)
	at junit.framework.TestSuite.runTest(TestSuite.java:230)
	at junit.framework.TestSuite.run(TestSuite.java:225)
	at
org.apache.tools.ant.taskdefs.optional.junit.JUnitTestRunner.run(JUnitTestRunner.java:297)
	at
org.apache.tools.ant.taskdefs.optional.junit.JUnitTestRunner.launch(JUnitTestRunner.java:672)
	at
org.apache.tools.ant.taskdefs.optional.junit.JUnitTestRunner.main(JUnitTestRunner.java:567)
Feb 27, 2007 6:36:49 AM
org.apache.axis2.cluster.tribes.TribesClusterManager send
SEVERE: Error sending command message : TribesCommandMessage
[CREATE_SERVICE_CONTEXT,urn:uuid:E7807C850E3E04AAE91172587009539,testService,testService]
org.apache.catalina.tribes.ChannelException: No destination given; No
faulty members identified.
	at
org.apache.catalina.tribes.group.GroupChannel.send(GroupChannel.java:195)
	at
org.apache.catalina.tribes.group.GroupChannel.send(GroupChannel.java:176)
	at
org.apache.axis2.cluster.tribes.TribesClusterManager.send(TribesClusterManager.java:364)
	at
org.apache.axis2.cluster.tribes.TribesClusterManager.addContext(TribesClusterManager.java:117)
	at
org.apache.axis2.clustering.ManageContextTestCase.testAddContext(ManageContextTestCase.java:39)
	at sun.reflect.NativeMethodAccessorImpl.invoke0(Native Method)
	at
sun.reflect.NativeMethodAccessorImpl.invoke(NativeMethodAccessorImpl.java:64)
	at
sun.reflect.DelegatingMethodAccessorImpl.invoke(DelegatingMethodAccessorImpl.java:43)
	at java.lang.reflect.Method.invoke(Method.java:615)
	at junit.framework.TestCase.runTest(TestCase.java:164)
	at junit.framework.TestCase.runBare(TestCase.java:130)
	at junit.framework.TestResult$1.protect(TestResult.java:106)
	at junit.framework.TestResult.runProtected(TestResult.java:124)
	at junit.framework.TestResult.run(TestResult.java:109)
	at junit.framework.TestCase.run(TestCase.java:120)
	at junit.framework.TestSuite.runTest(TestSuite.java:230)
	at junit.framework.TestSuite.run(TestSuite.java:225)
	at
org.apache.tools.ant.taskdefs.optional.junit.JUnitTestRunner.run(JUnitTestRunner.java:297)
	at
org.apache.tools.ant.taskdefs.optional.junit.JUnitTestRunner.launch(JUnitTestRunner.java:672)
	at
org.apache.tools.ant.taskdefs.optional.junit.JUnitTestRunner.main(JUnitTestRunner.java:567)
------------- ---------------- ---------------
Testcase:
testAddContext(org.apache.axis2.clustering.tribes.ManageContextTest):
FAILED
null
junit.framework.AssertionFailedError
	at
org.apache.axis2.clustering.ManageContextTestCase.testAddContext(ManageContextTestCase.java:46)

-Bill

On Tue, 2007-02-27 at 19:41 +0530, Chamikara Jayalath wrote:
> Hi Bill,
> 
> Are these failing locally for you. They seems to be passing for us.
> This might be a port issue at the machine this built is run.
> 
> Can we have a more detailed error report ?
> 
> Chamikara
> 
> 
> On 2/27/07, Bill Nagy <nagy@watson.ibm.com> wrote:
>         The clustering tests seem to all be failing now; I believe
>         that maven
>         pulled down a new version of the tribes jar for me just before
>         this
>         happened.
>         
>         -Bill
>         
>         On Mon, 2007-02-26 at 23:10 +0000, davidillsley (Continuum)
>         wrote: 
>         > Online report :
>         http://localhost:8080/continuum/servlet/continuum/target/ProjectBuild.vm/view/ProjectBuild/id/1/buildId/1184
>         > Build statistics:
>         >   State: Failed
>         >   Previous State: Failed
>         >   Started at: Mon, 26 Feb 2007 23:00:45 +0000
>         >   Finished at: Mon, 26 Feb 2007 23:10:02 +0000
>         >   Total time: 9m 17s 
>         >   Build Trigger: Schedule
>         >   Exit code: 70
>         >   Building machine hostname: ws.zones.apache.org
>         >   Operating system : SunOS(unknown)
>         >   Java version : 1.5.0_09(Sun Microsystems Inc.)
>         >
>         > Changes
>         >          scheu          AXIS2-2259
>         > Contributor: Dustin Amrhein
>         >
>         >              /webservices/axis2/trunk/java/modules/metadata/src/org/apache/axis2/jaxws/description/impl/EndpointInterfaceDescriptionImpl.java 
>         >
>         >
>         ****************************************************************************
>         > Output:
>         >
>         ****************************************************************************
>         >  __  __
>         > |  \/  |__ _Apache__ ___ 
>         > | |\/| / _` \ V / -_) ' \  ~ intelligent projects ~
>         > |_|  |_\__,_|\_/\___|_||_|  v. 1.1-beta-3
>         >
>         > DEPRECATED: the default goal should be specified in the
>         <build> section of project.xml instead of maven.xml
>         > DEPRECATED: the default goal should be specified in the
>         <build> section of project.xml instead of maven.xml
>         > Trying to get missing/snapshot dependencies required by
>         Apache Axis2: 
>         > Attempting to download maven-test-plugin-1.8.1-SNAPSHOT.jar.
>         > Skipping download as local copy is up to date!
>         > Attempting to download
>         maven-multiproject-plugin-1.5-SNAPSHOT.jar.
>         > Skipping download as local copy is up to date! 
>         > Attempting to download maven-jar-plugin-1.8-SNAPSHOT.jar.
>         > Skipping download as local copy is up to date!
>         > Attempting to download maven-plugin-plugin-1.8-SNAPSHOT.jar.
>         > Skipping download as local copy is up to date! 
>         >     [echo] Current Java Version is: 1.5
>         >     [echo]
>         >             JDK 1.5 detected, including the following
>         modules:
>         >
>         modules/metadata/project.xml,modules/saaj-api/project.xml,modules/saaj/project.xml,modules/jaxbri/project.xml,modules/jaxws/project.xml,modules/jaxws-api/project.xml,modules/json/project.xml,modules/clustering/project.xml 
>         >
>         > build:start:
>         >
>         > clean:
>         > modules:clean:
>         > modules:reactor:init:
>         > plugin:download-artifact:
>         >
>         >     [echo] Adding to modules.reactor.includes:
>         modules/adb-codegen/project.xml 
>         >     [echo] Adding to modules.reactor.includes:
>         modules/adb/project.xml
>         >     [echo] Adding to modules.reactor.includes:
>         modules/addressing/project.xml
>         >     [echo] Adding to modules.reactor.includes:
>         modules/clustering/project.xml 
>         >     [echo] Adding to modules.reactor.includes:
>         modules/codegen/project.xml
>         >     [echo] Adding to modules.reactor.includes:
>         modules/integration/project.xml
>         >     [echo] Adding to modules.reactor.includes :
>         modules/java2wsdl/project.xml
>         >     [echo] Adding to modules.reactor.includes:
>         modules/jaxbri/project.xml
>         >     [echo] Adding to modules.reactor.includes:
>         modules/jaxws-api/project.xml
>         >     [echo] Adding to modules.reactor.includes:
>         modules/jaxws/project.xml
>         >     [echo] Adding to modules.reactor.includes:
>         modules/jibx/project.xml
>         >     [echo] Adding to modules.reactor.includes:
>         modules/json/project.xml
>         >     [echo] Adding to modules.reactor.includes:
>         modules/kernel/project.xml
>         >     [echo] Adding to modules.reactor.includes:
>         modules/metadata/project.xml
>         >     [echo] Adding to modules.reactor.includes:
>         modules/mex/project.xml
>         >     [echo] Adding to modules.reactor.includes:
>         modules/mtompolicy/project.xml
>         >     [echo] Adding to modules.reactor.includes:
>         modules/ping/project.xml
>         >     [echo] Adding to modules.reactor.includes:
>         modules/saaj-api/project.xml
>         >     [echo] Adding to modules.reactor.includes:
>         modules/saaj/project.xml
>         >     [echo] Adding to modules.reactor.includes:
>         modules/samples/project.xml
>         >     [echo] Adding to modules.reactor.includes:
>         modules/soapmonitor/project.xml 
>         >     [echo] Adding to modules.reactor.includes:
>         modules/spring/project.xml
>         >     [echo] Adding to modules.reactor.includes:
>         modules/tool/project.xml
>         >     [echo] Adding to modules.reactor.includes:
>         modules/webapp/project.xml 
>         >     [echo] Adding to modules.reactor.includes:
>         modules/xmlbeans/project.xml
>         >
>         >     [echo] +----------------------------------------
>         >     [echo] | Cleaning: modules/adb-codegen
>         >     [echo] +---------------------------------------- 
>         >     [delete] Deleting
>         directory /export/home/illsleyd/continuum/continuum-1.0.3/apps/continuum/working-directory/1/modules/adb-codegen/target
>         >     [echo]
>         >     [echo] +---------------------------------------- 
>         >     [echo] | Cleaning: modules/adb
>         >     [echo] +----------------------------------------
>         >     [delete] Deleting
>         directory /export/home/illsleyd/continuum/continuum-1.0.3/apps/continuum/working-directory/1/modules/adb/target 
>         >     [echo]
>         >     [echo] +----------------------------------------
>         >     [echo] | Cleaning: modules/addressing
>         >     [echo] +----------------------------------------
>         >     [delete] Deleting
>         directory /export/home/illsleyd/continuum/continuum-
>         1.0.3/apps/continuum/working-directory/1/modules/addressing/target
>         >     [echo]
>         >     [echo] +----------------------------------------
>         >     [echo] | Cleaning: modules/clustering
>         >     [echo] +---------------------------------------- 
>         >     [delete] Deleting
>         directory /export/home/illsleyd/continuum/continuum-1.0.3/apps/continuum/working-directory/1/modules/clustering/target
>         >     [echo]
>         >     [echo] +---------------------------------------- 
>         >     [echo] | Cleaning: modules/codegen
>         >     [echo] +----------------------------------------
>         >     [delete] Deleting
>         directory /export/home/illsleyd/continuum/continuum-1.0.3/apps/continuum/working-directory/1/modules/codegen/target 
>         >     [echo]
>         >     [echo] +----------------------------------------
>         >     [echo] | Cleaning: modules/integration
>         >     [echo] +----------------------------------------
>         >     [echo]
>         >     [echo] +---------------------------------------- 
>         >     [echo] | Cleaning: modules/java2wsdl
>         >     [echo] +----------------------------------------
>         >     [delete] Deleting
>         directory /export/home/illsleyd/continuum/continuum-1.0.3/apps/continuum/working-directory/1/modules/java2wsdl/target 
>         >     [echo]
>         >     [echo] +----------------------------------------
>         >     [echo] | Cleaning: modules/jaxbri
>         >     [echo] +----------------------------------------
>         >     [echo]
>         >     [echo] +---------------------------------------- 
>         >     [echo] | Cleaning: modules/jaxws-api
>         >     [echo] +----------------------------------------
>         >     [echo]
>         >     [echo] +----------------------------------------
>         >     [echo] | Cleaning: modules/jaxws 
>         >     [echo] +----------------------------------------
>         >     [echo]
>         >     [echo] +----------------------------------------
>         >     [echo] | Cleaning: modules/jibx
>         >     [echo] +---------------------------------------- 
>         >     [echo]
>         >     [echo] +----------------------------------------
>         >     [echo] | Cleaning: modules/json
>         >     [echo] +----------------------------------------
>         >     [echo]
>         >     [echo] +---------------------------------------- 
>         >     [echo] | Cleaning: modules/kernel
>         >     [echo] +----------------------------------------
>         >     [delete] Deleting
>         directory /export/home/illsleyd/continuum/continuum-1.0.3/apps/continuum/working-directory/1/modules/kernel/target 
>         >     [echo]
>         >     [echo] +----------------------------------------
>         >     [echo] | Cleaning: modules/metadata
>         >     [echo] +----------------------------------------
>         >     [echo]
>         >     [echo] +---------------------------------------- 
>         >     [echo] | Cleaning: modules/mex
>         >     [echo] +----------------------------------------
>         >     [echo]
>         >     [echo] +----------------------------------------
>         >     [echo] | Cleaning: modules/mtompolicy 
>         >     [echo] +----------------------------------------
>         >     [echo]
>         >     [echo] +----------------------------------------
>         >     [echo] | Cleaning: modules/ping
>         >     [echo] +---------------------------------------- 
>         >     [echo]
>         >     [echo] +----------------------------------------
>         >     [echo] | Cleaning: modules/saaj-api
>         >     [echo] +----------------------------------------
>         >     [echo]
>         >     [echo] +---------------------------------------- 
>         >     [echo] | Cleaning: modules/saaj
>         >     [echo] +----------------------------------------
>         >     [echo]
>         >     [echo] +----------------------------------------
>         >     [echo] | Cleaning: modules/samples 
>         >     [echo] +----------------------------------------
>         >     [echo]
>         >     [echo] +----------------------------------------
>         >     [echo] | Cleaning: modules/soapmonitor
>         >     [echo] +---------------------------------------- 
>         >     [echo]
>         >     [echo] +----------------------------------------
>         >     [echo] | Cleaning: modules/spring
>         >     [echo] +----------------------------------------
>         >     [echo]
>         >     [echo] +---------------------------------------- 
>         >     [echo] | Cleaning: modules/tool
>         >     [echo] +----------------------------------------
>         >     [echo]
>         >     [echo] +----------------------------------------
>         >     [echo] | Cleaning: modules/webapp 
>         >     [echo] +----------------------------------------
>         >     [echo]
>         >     [echo] +----------------------------------------
>         >     [echo] | Cleaning: modules/xmlbeans
>         >     [echo] +---------------------------------------- 
>         >     [echo]
>         >     [echo] +----------------------------------------
>         >     [echo] | Cleaning: target and etc/target
>         >     [echo] +----------------------------------------
>         >
>         >
>         > jar: 
>         > multiproject:install:
>         > multiproject:projects-init:
>         >     [echo] Gathering project list
>         > Starting the reactor...
>         > Our processing order:
>         > Apache Axis 2.0 - Java2WSDL
>         > Apache Axis 2.0 - Kernel
>         > Apache Axis 2.0 - Data Binding
>         > Apache Axis 2.0 - Code Generation
>         > Apache Axis 2.0 - ADB Codegen
>         > Apache Axis 2.0 - Addressing
>         > Apache Axis 2.0 - Cluster
>         > Apache Axis 2.0 - Samples
>         > Apache Axis 2.0 - spring
>         > Apache Axis 2.0 - XMLBeans Data Binding
>         > Apache Axis 2.0 - Tools
>         > Apache Axis 2.0 - Integration
>         > Apache Axis 2.0 - JAXB-RI Data Binding
>         > Apache Axis 2.0 - SAAJ API
>         > Apache Axis 2.0 - JAXWS API
>         > Apache Axis 2.0 - SAAJ
>         > Apache Axis 2.0 - Metadata
>         > Apache Axis 2.0 - JAX-WS
>         > Apache Axis 2.0 - JiBX Data Binding
>         > Apache Axis 2.0 - JSON 
>         > Apache Axis 2.0 - Metadata Exchange
>         > Apache Axis 2.0 - MTOM Policy
>         > Apache Axis 2.0 - ping
>         > Apache Axis 2.0 - soapmonitor
>         > +----------------------------------------
>         > | Gathering project list Apache Axis 2.0 - Java2WSDL
>         > | Memory: 18M/39M
>         > +----------------------------------------
>         > +----------------------------------------
>         > | Gathering project list Apache Axis 2.0 - Kernel
>         > | Memory: 18M/39M 
>         > +----------------------------------------
>         > +----------------------------------------
>         > | Gathering project list Apache Axis 2.0 - Data Binding
>         > | Memory: 18M/39M
>         > +---------------------------------------- 
>         > +----------------------------------------
>         > | Gathering project list Apache Axis 2.0 - Code Generation
>         > | Memory: 18M/39M
>         > +----------------------------------------
>         > +---------------------------------------- 
>         > | Gathering project list Apache Axis 2.0 - ADB Codegen
>         > | Memory: 18M/39M
>         > +----------------------------------------
>         > +----------------------------------------
>         > | Gathering project list Apache Axis 2.0 - Addressing
>         > | Memory: 18M/39M
>         > +----------------------------------------
>         > +----------------------------------------
>         > | Gathering project list Apache Axis 2.0 - Cluster
>         > | Memory: 18M/39M 
>         > +----------------------------------------
>         > +----------------------------------------
>         > | Gathering project list Apache Axis 2.0 - Samples
>         > | Memory: 18M/39M
>         > +---------------------------------------- 
>         > +----------------------------------------
>         > | Gathering project list Apache Axis 2.0 - spring
>         > | Memory: 18M/39M
>         > +----------------------------------------
>         > +---------------------------------------- 
>         > | Gathering project list Apache Axis 2.0 - XMLBeans Data
>         Binding
>         > | Memory: 18M/39M
>         > +----------------------------------------
>         > +----------------------------------------
>         > | Gathering project list Apache Axis 2.0 - Tools
>         > | Memory: 18M/39M
>         > +----------------------------------------
>         > +----------------------------------------
>         > | Gathering project list Apache Axis 2.0 - Integration
>         > | Memory: 18M/39M 
>         > +----------------------------------------
>         > +----------------------------------------
>         > | Gathering project list Apache Axis 2.0 - JAXB-RI Data
>         Binding
>         > | Memory: 18M/39M
>         > +---------------------------------------- 
>         > +----------------------------------------
>         > | Gathering project list Apache Axis 2.0 - SAAJ API
>         > | Memory: 18M/39M
>         > +----------------------------------------
>         > +---------------------------------------- 
>         > | Gathering project list Apache Axis 2.0 - JAXWS API
>         > | Memory: 18M/39M
>         > +----------------------------------------
>         > +----------------------------------------
>         > | Gathering project list Apache Axis 2.0 - SAAJ
>         > | Memory: 18M/39M
>         > +----------------------------------------
>         > +----------------------------------------
>         > | Gathering project list Apache Axis 2.0 - Metadata
>         > | Memory: 18M/39M 
>         > +----------------------------------------
>         > +----------------------------------------
>         > | Gathering project list Apache Axis 2.0 - JAX-WS
>         > | Memory: 18M/39M
>         > +---------------------------------------- 
>         > +----------------------------------------
>         > | Gathering project list Apache Axis 2.0 - JiBX Data Binding
>         > | Memory: 18M/39M
>         > +----------------------------------------
>         > +---------------------------------------- 
>         > | Gathering project list Apache Axis 2.0 - JSON
>         > | Memory: 18M/39M
>         > +----------------------------------------
>         > +----------------------------------------
>         > | Gathering project list Apache Axis 2.0 - Metadata Exchange
>         > | Memory: 18M/39M
>         > +----------------------------------------
>         > +----------------------------------------
>         > | Gathering project list Apache Axis 2.0 - MTOM Policy
>         > | Memory: 18M/39M 
>         > +----------------------------------------
>         > +----------------------------------------
>         > | Gathering project list Apache Axis 2.0 - ping
>         > | Memory: 18M/39M
>         > +---------------------------------------- 
>         > +----------------------------------------
>         > | Gathering project list Apache Axis 2.0 - soapmonitor
>         > | Memory: 18M/39M
>         > +----------------------------------------
>         >
>         > multiproject:goal: 
>         > Starting the reactor...
>         > Our processing order:
>         > Apache Axis 2.0 - Java2WSDL
>         > Apache Axis 2.0 - Kernel
>         > Apache Axis 2.0 - Data Binding
>         > Apache Axis 2.0 - Code Generation
>         > Apache Axis 2.0 - ADB Codegen
>         > Apache Axis 2.0 - Addressing
>         > Apache Axis 2.0 - Cluster
>         > Apache Axis 2.0 - Samples
>         > Apache Axis 2.0 - spring
>         > Apache Axis 2.0 - XMLBeans Data Binding
>         > Apache Axis 2.0 - Tools
>         > Apache Axis 2.0 - Integration
>         > Apache Axis 2.0 - JAXB-RI Data Binding
>         > Apache Axis 2.0 - SAAJ API
>         > Apache Axis 2.0 - JAXWS API
>         > Apache Axis 2.0 - SAAJ
>         > Apache Axis 2.0 - Metadata
>         > Apache Axis 2.0 - JAX-WS
>         > Apache Axis 2.0 - JiBX Data Binding
>         > Apache Axis 2.0 - JSON
>         > Apache Axis 2.0 - Metadata Exchange
>         > Apache Axis 2.0 - MTOM Policy
>         > Apache Axis 2.0 - ping
>         > Apache Axis 2.0 - soapmonitor
>         > +----------------------------------------
>         > | Executing multiproject:install-callback Apache Axis 2.0 -
>         Java2WSDL
>         > | Memory: 18M/39M
>         > +---------------------------------------- 
>         > DEPRECATED: the default goal should be specified in the
>         <build> section of project.xml instead of maven.xml
>         > DEPRECATED: the default goal should be specified in the
>         <build> section of project.xml instead of maven.xml
>         > Trying to get missing/snapshot dependencies required by
>         Apache Axis 2.0 - Java2WSDL:
>         > Attempting to download axiom-api-SNAPSHOT.jar.
>         > Skipping download as local copy is up to date! 
>         > Attempting to download axiom-impl-SNAPSHOT.jar.
>         > Skipping download as local copy is up to date!
>         > build:start:
>         >
>         > multiproject:install-callback:
>         >     [echo] Running jar:install for Apache Axis 2.0 -
>         Java2WSDL
>         > java:prepare-filesystem:
>         >     [mkdir] Created
>         dir: /export/home/illsleyd/continuum/continuum-1.0.3/apps/continuum/working-directory/1/modules/java2wsdl/target/classes
>         > Running post goal: java:prepare-filesystem 
>         >
>         > java:compile:
>         >     [echo] Compiling
>         to /export/home/illsleyd/continuum/continuum-1.0.3/apps/continuum/working-directory/1/modules/java2wsdl/target/classes
>         >     [javac] Compiling 23 source files
>         to /export/home/illsleyd/continuum/continuum-
>         1.0.3/apps/continuum/working-directory/1/modules/java2wsdl/target/classes
>         >
>         > java:jar-resources:
>         > Copying 2 files
>         to /export/home/illsleyd/continuum/continuum-1.0.3/apps/continuum/working-directory/1/modules/java2wsdl/target/classes/META-INF 
>         >
>         > test:test:
>         >     [echo] No tests to run.
>         >
>         > jar:jar:
>         >     [jar] Building
>         jar: /export/home/illsleyd/continuum/continuum-1.0.3/apps/continuum/working-directory/1/modules/java2wsdl/target/axis2- java2wsdl-SNAPSHOT.jar
>         >
>         > jar:install:
>         >     [echo] Installing...
>         > Uploading to
>         org.apache.axis2/jars/axis2-java2wsdl-SNAPSHOT.jar:
>         > .................... (56K)
>         > Uploading to
>         org.apache.axis2 /poms/axis2-java2wsdl-SNAPSHOT.pom:
>         > .................... (14K)
>         >
>         > +----------------------------------------
>         > | Executing multiproject:install-callback Apache Axis 2.0 -
>         Kernel
>         > | Memory: 19M/40M 
>         > +----------------------------------------
>         > DEPRECATED: the default goal should be specified in the
>         <build> section of project.xml instead of maven.xml
>         > DEPRECATED: the default goal should be specified in the
>         <build> section of project.xml instead of maven.xml
>         >
>         > build:end:
>         >
>         > Trying to get missing/snapshot dependencies required by
>         Apache Axis 2.0 - Kernel:
>         > Attempting to download axis2-java2wsdl-SNAPSHOT.jar.
>         > Skipping download as local copy is up to date!
>         > Attempting to download neethi-SNAPSHOT.jar.
>         > Skipping download as local copy is up to date!
>         > Attempting to download woden-1.0-incubating-SNAPSHOT.jar .
>         > Skipping download as local copy is up to date!
>         > build:start:
>         >
>         > multiproject:install-callback:
>         >     [echo] Running jar:install for Apache Axis 2.0 - Kernel
>         > java:prepare-filesystem: 
>         >     [mkdir] Created
>         dir: /export/home/illsleyd/continuum/continuum-1.0.3/apps/continuum/working-directory/1/modules/kernel/target/classes
>         > Running post goal: java:prepare-filesystem
>         >
>         > java:compile: 
>         >     [echo] Compiling
>         to /export/home/illsleyd/continuum/continuum-1.0.3/apps/continuum/working-directory/1/modules/kernel/target/classes
>         >     [javac] Compiling 319 source files
>         to /export/home/illsleyd/continuum/continuum-
>         1.0.3/apps/continuum/working-directory/1/modules/kernel/target/classes
>         >     [javac] Note: Some input files use or override a
>         deprecated API.
>         >     [javac] Note: Recompile with -Xlint:deprecation for
>         details.
>         >
>         > java:jar-resources:
>         > Copying 1 file
>         to /export/home/illsleyd/continuum/continuum-1.0.3/apps/continuum/working-directory/1/modules/kernel/target/classes
>         > Copying 2 files
>         to /export/home/illsleyd/continuum/continuum-
>         1.0.3/apps/continuum/working-directory/1/modules/kernel/target/classes
>         > Copying 2 files
>         to /export/home/illsleyd/continuum/continuum-1.0.3/apps/continuum/working-directory/1/modules/kernel/target/classes/META-INF
>         >
>         > test:test:
>         > java:prepare-filesystem:
>         > Running post goal: java:prepare-filesystem
>         >
>         > java:compile:
>         >     [echo] Compiling
>         to /export/home/illsleyd/continuum/continuum-1.0.3/apps/continuum/working-directory/1/modules/kernel/target/classes 
>         >     [javac] Compiling 1 source file
>         to /export/home/illsleyd/continuum/continuum-1.0.3/apps/continuum/working-directory/1/modules/kernel/target/classes
>         >
>         > java:jar-resources:
>         >
>         > test:prepare-filesystem: 
>         >     [mkdir] Created
>         dir: /export/home/illsleyd/continuum/continuum-1.0.3/apps/continuum/working-directory/1/modules/kernel/target/test-classes
>         >     [mkdir] Created
>         dir: /export/home/illsleyd/continuum/continuum-
>         1.0.3/apps/continuum/working-directory/1/modules/kernel/target/test-reports
>         >
>         > test:test-resources:
>         > Copying 59 files
>         to /export/home/illsleyd/continuum/continuum-1.0.3/apps/continuum/working-directory/1/modules/kernel/target/test-classes/../test-resources 
>         >
>         > test:compile:
>         >     [javac] Compiling 93 source files
>         to /export/home/illsleyd/continuum/continuum-1.0.3/apps/continuum/working-directory/1/modules/kernel/target/test-classes
>         >     [javac] Note: Some input files use or override a
>         deprecated API. 
>         >     [javac] Note: Recompile with -Xlint:deprecation for
>         details.
>         > Running post goal: test:compile
>         >     [echo] the files are up to date = ${jars.uptodate}
>         >     [mkdir] Created
>         dir: /export/home/illsleyd/continuum/continuum-
>         1.0.3/apps/continuum/working-directory/1/modules/kernel/test-resources/deployment/service2/build/classes
>         >     [mkdir] Created
>         dir: /export/home/illsleyd/continuum/continuum-1.0.3/apps/continuum/working-directory/1/modules/kernel/test-resources/deployment/service2/build/lib 
>         >     [copy] Copying 1 file
>         to /export/home/illsleyd/continuum/continuum-1.0.3/apps/continuum/working-directory/1/modules/kernel/test-resources/deployment/service2/build/classes/META-INF
>         >     [mkdir] Created
>         dir: /export/home/illsleyd/continuum/continuum-
>         1.0.3/apps/continuum/working-directory/1/modules/kernel/target/test-resources/deployment/services
>         >     [jar] Building
>         jar: /export/home/illsleyd/continuum/continuum-1.0.3/apps/continuum/working-directory/1/modules/kernel/target/test-resources/deployment/services/service2.jar 
>         >     [delete] Deleting
>         directory /export/home/illsleyd/continuum/continuum-1.0.3/apps/continuum/working-directory/1/modules/kernel/test-resources/deployment/service2/build
>         >     [echo] the files are up to date = ${ jars.uptodate}
>         >     [mkdir] Created
>         dir: /export/home/illsleyd/continuum/continuum-1.0.3/apps/continuum/working-directory/1/modules/kernel/test-resources/deployment/echo/build/classes
>         >     [mkdir] Created
>         dir: /export/home/illsleyd/continuum/continuum-
>         1.0.3/apps/continuum/working-directory/1/modules/kernel/test-resources/deployment/echo/build/lib
>         >     [copy] Copying 1 file
>         to /export/home/illsleyd/continuum/continuum-1.0.3/apps/continuum/working-directory/1/modules/kernel/test-resources/deployment/echo/build/classes/META-INF 
>         >     [mkdir] Created
>         dir: /export/home/illsleyd/continuum/continuum-1.0.3/apps/continuum/working-directory/1/modules/kernel/target/echo
>         >     [jar] Building
>         jar: /export/home/illsleyd/continuum/continuum-1.0.3 /apps/continuum/working-directory/1/modules/kernel/target/echo/echo.aar
>         >     [delete] Deleting
>         directory /export/home/illsleyd/continuum/continuum-1.0.3/apps/continuum/working-directory/1/modules/kernel/test-resources/deployment/echo/build 
>         >     [echo] the files are up to date = ${jars.uptodate}
>         >     [mkdir] Created
>         dir: /export/home/illsleyd/continuum/continuum-1.0.3/apps/continuum/working-directory/1/modules/kernel/test-resources/deployment/invalidservice/build/classes 
>         >     [mkdir] Created
>         dir: /export/home/illsleyd/continuum/continuum-1.0.3/apps/continuum/working-directory/1/modules/kernel/test-resources/deployment/invalidservice/build/lib
>         >     [copy] Copying 1 file
>         to /export/home/illsleyd/continuum/continuum-
>         1.0.3/apps/continuum/working-directory/1/modules/kernel/test-resources/deployment/invalidservice/build/classes/META-INF
>         >     [mkdir] Created
>         dir: /export/home/illsleyd/continuum/continuum-1.0.3/apps/continuum/working-directory/1/modules/kernel/target/test-resources/InvalidDeployment/services 
>         >     [jar] Building
>         jar: /export/home/illsleyd/continuum/continuum-1.0.3/apps/continuum/working-directory/1/modules/kernel/target/test-resources/InvalidDeployment/services/invalidService.jar
>         >     [delete] Deleting
>         directory /export/home/illsleyd/continuum/continuum-
>         1.0.3/apps/continuum/working-directory/1/modules/kernel/test-resources/deployment/invalidservice/build
>         >     [echo] the files are up to date = ${jars.uptodate}
>         >     [mkdir] Created
>         dir: /export/home/illsleyd/continuum/continuum-
>         1.0.3/apps/continuum/working-directory/1/modules/kernel/test-resources/deployment/module1/build/classes
>         >     [mkdir] Created
>         dir: /export/home/illsleyd/continuum/continuum-1.0.3/apps/continuum/working-directory/1/modules/kernel/test-resources/deployment/module1/build/lib 
>         >     [copy] Copying 1 file
>         to /export/home/illsleyd/continuum/continuum-1.0.3/apps/continuum/working-directory/1/modules/kernel/test-resources/deployment/module1/build/classes/META-INF
>         >     [mkdir] Created
>         dir: /export/home/illsleyd/continuum/continuum-
>         1.0.3/apps/continuum/working-directory/1/modules/kernel/target/test-resources/deployment/modules
>         >     [jar] Building
>         jar: /export/home/illsleyd/continuum/continuum-1.0.3/apps/continuum/working-directory/1/modules/kernel/target/test-resources/deployment/modules/module1.mar 
>         >     [delete] Deleting
>         directory /export/home/illsleyd/continuum/continuum-1.0.3/apps/continuum/working-directory/1/modules/kernel/test-resources/deployment/module1/build
>         >     [echo] the files are up to date = ${ jars.uptodate}
>         >     [mkdir] Created
>         dir: /export/home/illsleyd/continuum/continuum-1.0.3/apps/continuum/working-directory/1/modules/kernel/test-resources/deployment/serviceModule/build/classes
>         >     [mkdir] Created
>         dir: /export/home/illsleyd/continuum/continuum-
>         1.0.3/apps/continuum/working-directory/1/modules/kernel/test-resources/deployment/serviceModule/build/lib
>         >     [copy] Copying 1 file
>         to /export/home/illsleyd/continuum/continuum-1.0.3/apps/continuum/working-directory/1/modules/kernel/test-resources/deployment/serviceModule/build/classes/META-INF 
>         >     [mkdir] Created
>         dir: /export/home/illsleyd/continuum/continuum-1.0.3/apps/continuum/working-directory/1/modules/kernel/target/test-resources/InvalidDeployment/modules
>         >     [jar] Building
>         jar: /export/home/illsleyd/continuum/continuum-
>         1.0.3/apps/continuum/working-directory/1/modules/kernel/target/test-resources/InvalidDeployment/modules/serviceModule.jar
>         >     [delete] Deleting
>         directory /export/home/illsleyd/continuum/continuum-1.0.3/apps/continuum/working-directory/1/modules/kernel/test-resources/deployment/serviceModule/build 
>         >     [mkdir] Created
>         dir: /export/home/illsleyd/continuum/continuum-1.0.3/apps/continuum/working-directory/1/modules/kernel/target/test-resources/java2sec/more
>         >     [mkdir] Created
>         dir: /export/home/illsleyd/continuum/continuum-
>         1.0.3/apps/continuum/working-directory/1/modules/kernel/target/test-resources/java2sec/less
>         >     [jar] Building
>         jar: /export/home/illsleyd/continuum/continuum-1.0.3/apps/continuum/working-directory/1/modules/kernel/target/test-resources/java2sec/more/MorePermission.jar 
>         >     [delete] Deleting
>         directory /export/home/illsleyd/continuum/continuum-1.0.3/apps/continuum/working-directory/1/modules/kernel/target/test-classes/org/apache/axis2/java/security/driver
>         >     [delete] Deleting
>         directory /export/home/illsleyd/continuum/continuum-
>         1.0.3/apps/continuum/working-directory/1/modules/kernel/target/test-classes/org/apache/axis2/java/security/more
>         >     [delete] Deleting
>         directory /export/home/illsleyd/continuum/continuum-1.0.3/apps/continuum/working-directory/1/modules/kernel/target/test-classes/org/apache/axis2/java/security/action 
>         >     [delete] Deleting
>         directory /export/home/illsleyd/continuum/continuum-1.0.3/apps/continuum/working-directory/1/modules/kernel/target/test-classes/org/apache/axis2/java/security/interf
>         >     [jar] Building
>         jar: /export/home/illsleyd/continuum/continuum-
>         1.0.3/apps/continuum/working-directory/1/modules/kernel/target/test-resources/java2sec/less/LessPermission.jar
>         >     [delete] Deleting
>         directory /export/home/illsleyd/continuum/continuum-1.0.3/apps/continuum/working-directory/1/modules/kernel/target/test-classes/org/apache/axis2/java/security/less 
>         >
>         >     [junit] Running
>         org.apache.axis2.addressing.AddressingHelperTest
>         >     [junit] Tests run: 6, Failures: 0, Errors: 0, Time
>         elapsed: 0.408 sec
>         >     [junit] Running
>         org.apache.axis2.addressing.EndpointReferenceHelperTest 
>         >     [junit] Tests run: 2, Failures: 0, Errors: 0, Time
>         elapsed: 0.431 sec
>         >     [junit] Running
>         org.apache.axis2.addressing.EndpointReferenceTypeTest
>         >     [junit] Tests run: 5, Failures: 0, Errors: 0, Time
>         elapsed: 0.691 sec
>         >     [junit] Running
>         org.apache.axis2.addressing.miheaders.RelatesToTest
>         >     [junit] Tests run: 3, Failures: 0, Errors: 0, Time
>         elapsed: 0.37 sec
>         >     [junit] Running
>         org.apache.axis2.addressing.wsdl.WSDL11ActionHelperTest 
>         >     [junit] Tests run: 8, Failures: 0, Errors: 0, Time
>         elapsed: 0.811 sec
>         >     [junit] Running
>         org.apache.axis2.context.ContextHierarchyTest
>         >     [junit] Tests run: 2, Failures: 0, Errors: 0, Time
>         elapsed: 0.815 sec
>         >     [junit] Running
>         org.apache.axis2.context.OperationContextTest
>         >     [junit] Tests run: 1, Failures: 0, Errors: 0, Time
>         elapsed: 0.754 sec
>         >     [junit] Running
>         org.apache.axis2.deployment.AddingObserverTest 
>         >     [junit] Tests run: 1, Failures: 0, Errors: 0, Time
>         elapsed: 0.863 sec
>         >     [junit] Running
>         org.apache.axis2.deployment.AxisMessageTest
>         >     [junit] Tests run: 1, Failures: 0, Errors: 0, Time
>         elapsed: 1.409 sec
>         >     [junit] Running
>         org.apache.axis2.deployment.BadModuleTest
>         >     [junit] Tests run: 1, Failures: 0, Errors: 0, Time
>         elapsed: 0.717 sec
>         >     [junit] Running
>         org.apache.axis2.deployment.BuildERWithDeploymentTest 
>         >     [junit] Tests run: 1, Failures: 0, Errors: 0, Time
>         elapsed: 1.185 sec
>         >     [junit] Running
>         org.apache.axis2.deployment.BuilderSelectorDeploymentTest
>         >     [junit] Tests run: 2, Failures: 0, Errors: 0, Time
>         elapsed: 0.816 sec
>         >     [junit] Running
>         org.apache.axis2.deployment.DeploymentTotalTest
>         >     [junit] Tests run: 1, Failures: 0, Errors: 0, Time
>         elapsed: 1.169 sec
>         >     [junit] Running
>         org.apache.axis2.deployment.MessageFormatterDeploymentTest 
>         >     [junit] Tests run: 2, Failures: 0, Errors: 0, Time
>         elapsed: 1.327 sec
>         >     [junit] Running
>         org.apache.axis2.deployment.ModifiedConfigFileTest
>         >     [junit] Tests run: 1, Failures: 0, Errors: 0, Time
>         elapsed: 0.765 sec
>         >     [junit] Running
>         org.apache.axis2.deployment.ModuleDisengagementTest
>         >     [junit] Tests run: 7, Failures: 0, Errors: 0, Time
>         elapsed: 1.536 sec
>         >     [junit] Running
>         org.apache.axis2.deployment.ModuleversionTest 
>         >     [junit] Tests run: 2, Failures: 0, Errors: 0, Time
>         elapsed: 0.747 sec
>         >     [junit] Running
>         org.apache.axis2.deployment.OperationExcludeTest
>         >     [junit] Tests run: 1, Failures: 0, Errors: 0, Time
>         elapsed: 1.59 sec
>         >     [junit] Running
>         org.apache.axis2.deployment.SameServiceAddingTest
>         >     [junit] Tests run: 1, Failures: 0, Errors: 0, Time
>         elapsed: 0.837 sec
>         >     [junit] Running
>         org.apache.axis2.deployment.ServiceGroupTest 
>         >     [junit] Tests run: 1, Failures: 0, Errors: 0, Time
>         elapsed: 1.495 sec
>         >     [junit] Running
>         org.apache.axis2.deployment.SystemPhasesremovedTest
>         >     [junit] Tests run: 1, Failures: 0, Errors: 0, Time
>         elapsed: 0.76 sec
>         >     [junit] Running
>         org.apache.axis2.deployment.TransportDeploymentTest
>         >     [junit] Tests run: 1, Failures: 0, Errors: 0, Time
>         elapsed: 1.259 sec
>         >     [junit] Running
>         org.apache.axis2.description.RegistryTest 
>         >     [junit] Tests run: 5, Failures: 0, Errors: 0, Time
>         elapsed: 0.903 sec
>         >     [junit] Running
>         org.apache.axis2.description.WSDLToAllServicesBuilderTest
>         >     [junit] Tests run: 2, Failures: 0, Errors: 0, Time
>         elapsed: 4.023 sec
>         >     [junit] Running
>         org.apache.axis2.dispatchers.ActionBasedOperationDispatchTest
>         >     [junit] Tests run: 1, Failures: 0, Errors: 0, Time
>         elapsed: 0.737 sec
>         >     [junit] Running
>         org.apache.axis2.dispatchers.RelatesToBasedOperationDispatcherTest 
>         >     [junit] Tests run: 1, Failures: 0, Errors: 0, Time
>         elapsed: 0.845 sec
>         >     [junit] Running
>         org.apache.axis2.dispatchers.RelatesToBasedServiceDispatcherTest
>         >     [junit] Tests run: 1, Failures: 0, Errors: 0, Time
>         elapsed: 0.825 sec
>         >     [junit] Running
>         org.apache.axis2.dispatchers.RequestURIBasedOperationDispatcherTest
>         >     [junit] Tests run: 1, Failures: 0, Errors: 0, Time
>         elapsed: 0.896 sec
>         >     [junit] Running
>         org.apache.axis2.dispatchers.RequestURIBasedServiceDispatcherTest 
>         >     [junit] Tests run: 1, Failures: 0, Errors: 0, Time
>         elapsed: 0.58 sec
>         >     [junit] Running
>         org.apache.axis2.dispatchers.SOAPMessageBodyBasedOperationDispatcherTest
>         >     [junit] Tests run: 1, Failures: 0, Errors: 0, Time
>         elapsed: 0.989 sec
>         >     [junit] Running
>         org.apache.axis2.dispatchers.SOAPMessageBodyBasedServiceDispatcherTest
>         >     [junit] Tests run: 1, Failures: 0, Errors: 0, Time
>         elapsed: 0.548 sec
>         >     [junit] Running
>         org.apache.axis2.engine.EnginePausingTest 
>         >     [junit] Tests run: 1, Failures: 0, Errors: 0, Time
>         elapsed: 0.822 sec
>         >     [junit] Running
>         org.apache.axis2.engine.MessageContextChangeTest
>         >     [junit] Tests run: 1, Failures: 0, Errors: 0, Time
>         elapsed: 0.409 sec
>         >     [junit] Running
>         org.apache.axis2.engine.MessageContextSaveATest
>         >     [junit] Tests run: 4, Failures: 0, Errors: 0, Time
>         elapsed: 1.014 sec
>         >     [junit] Running
>         org.apache.axis2.engine.MessageContextSaveBTest 
>         >     [junit] Tests run: 1, Failures: 0, Errors: 0, Time
>         elapsed: 0.873 sec
>         >     [junit] Running
>         org.apache.axis2.engine.MessageContextSaveCTest
>         >     [junit] Tests run: 2, Failures: 0, Errors: 0, Time
>         elapsed: 1.06 sec
>         >     [junit] Running
>         org.apache.axis2.engine.MessageContextSelfManagedDataTest
>         >     [junit] Tests run: 10, Failures: 0, Errors: 0, Time
>         elapsed: 1.804 sec
>         >     [junit] Running
>         org.apache.axis2.engine.MessageContextTest 
>         >     [junit] Tests run: 1, Failures: 0, Errors: 0, Time
>         elapsed: 0.598 sec
>         >     [junit] Running org.apache.axis2.engine.ModuleConfigTest
>         >     [junit] Tests run: 2, Failures: 0, Errors: 0, Time
>         elapsed: 1.306 sec
>         >     [junit] Running org.apache.axis2.engine.ModuleEngageTest
>         >     [junit] Tests run: 1, Failures: 0, Errors: 0, Time
>         elapsed: 1.159 sec
>         >     [junit] Running org.apache.axis2.engine.ObjectSaveTest 
>         >     [junit] Tests run: 5, Failures: 0, Errors: 0, Time
>         elapsed: 0.718 sec
>         >     [junit] Running
>         org.apache.axis2.engine.OperationContextSaveTest
>         >     [junit] Tests run: 1, Failures: 0, Errors: 0, Time
>         elapsed: 0.726 sec
>         >     [junit] Running org.apache.axis2.engine.OptionsSaveTest
>         >     [junit] Tests run: 1, Failures: 0, Errors: 0, Time
>         elapsed: 1.201 sec
>         >     [junit] Running
>         org.apache.axis2.engine.ParameterAddTest 
>         >     [junit] Tests run: 4, Failures: 0, Errors: 0, Time
>         elapsed: 1.083 sec
>         >     [junit] Running
>         org.apache.axis2.engine.SOAPActionBasedDispatcherTest
>         >     [junit] Tests run: 4, Failures: 0, Errors: 0, Time
>         elapsed: 0.967 sec
>         >     [junit] Running
>         org.apache.axis2.java.security.driver.Java2SecTest
>         >     [junit] Tests run: 9, Failures: 0, Errors: 0, Time
>         elapsed: 0.586 sec
>         >     [junit] Running org.apache.axis2.misc.MiscTest 
>         >     [junit] Tests run: 1, Failures: 0, Errors: 0, Time
>         elapsed: 0.325 sec
>         >     [junit] Running
>         org.apache.axis2.phaserule.AddingHandlerToEachPhaseTest
>         >     [junit] Tests run: 3, Failures: 0, Errors: 0, Time
>         elapsed: 0.395 sec
>         >     [junit] Running
>         org.apache.axis2.phaserule.BeforeAfterTest
>         >     [junit] Tests run: 1, Failures: 0, Errors: 0, Time
>         elapsed: 0.39 sec
>         >     [junit] Running org.apache.axis2.phaserule.BeforeTest 
>         >     [junit] Tests run: 1, Failures: 0, Errors: 0, Time
>         elapsed: 0.517 sec
>         >     [junit] Running
>         org.apache.axis2.phaserule.BeforeWithNoFirstHandlerTest
>         >     [junit] Tests run: 1, Failures: 0, Errors: 0, Time
>         elapsed: 0.461 sec
>         >     [junit] Running
>         org.apache.axis2.phaserule.InvalidPhaseFirstRulesTest
>         >     [junit] Tests run: 1, Failures: 0, Errors: 0, Time
>         elapsed: 0.436 sec
>         >     [junit] Running
>         org.apache.axis2.phaserule.InvalidPhaseFirstTest 
>         >     [junit] Tests run: 1, Failures: 0, Errors: 0, Time
>         elapsed: 0.555 sec
>         >     [junit] Running
>         org.apache.axis2.phaserule.InvalidPhaseLastRuleTest
>         >     [junit] Tests run: 1, Failures: 0, Errors: 0, Time
>         elapsed: 0.555 sec
>         >     [junit] Running
>         org.apache.axis2.phaserule.InvalidPhaseRuleTest
>         >     [junit] Tests run: 2, Failures: 0, Errors: 0, Time
>         elapsed: 0.416 sec
>         >     [junit] Running
>         org.apache.axis2.phaserule.InvalidPhaselastTest 
>         >     [junit] Tests run: 1, Failures: 0, Errors: 0, Time
>         elapsed: 0.446 sec
>         >     [junit] Running
>         org.apache.axis2.phaserule.PhaseFirstTest
>         >     [junit] Tests run: 1, Failures: 0, Errors: 0, Time
>         elapsed: 0.375 sec
>         >     [junit] Running org.apache.axis2.phaserule.PhaseLastTest
>         >     [junit] Tests run: 1, Failures: 0, Errors: 0, Time
>         elapsed: 0.374 sec
>         >     [junit] Running
>         org.apache.axis2.phaserule.PhaseRuleTest 
>         >     [junit] Tests run: 1, Failures: 0, Errors: 0, Time
>         elapsed: 0.413 sec
>         >     [junit] Running
>         org.apache.axis2.phaserule.PreDispatchPhaseRuleTest
>         >     [junit] Tests run: 1, Failures: 0, Errors: 0, Time
>         elapsed: 0.43 sec
>         >     [junit] Running
>         org.apache.axis2.phaserule.SingleHandlerPhaseTest
>         >     [junit] Tests run: 1, Failures: 0, Errors: 0, Time
>         elapsed: 0.426 sec
>         >     [junit] Running
>         org.apache.axis2.transport.tcp.TCPTransportTest 
>         >     [junit] Tests run: 1, Failures: 0, Errors: 0, Time
>         elapsed: 0.334 sec
>         >     [junit] Running
>         org.apache.axis2.util.ThreadContextMigratorTest
>         >     [junit] Tests run: 2, Failures: 0, Errors: 0, Time
>         elapsed: 0.411 sec
>         >
>         > jar:jar:
>         >     [copy] Copying 1 file
>         to /export/home/illsleyd/continuum/continuum-1.0.3/apps/continuum/working-directory/1/modules/kernel/target/classes/org/apache/axis2/i18n
>         >     [jar] Building
>         jar: /export/home/illsleyd/continuum/continuum-
>         1.0.3/apps/continuum/working-directory/1/modules/kernel/target/axis2-kernel-SNAPSHOT.jar
>         >
>         > jar:install:
>         >     [echo] Installing...
>         > Uploading to
>         org.apache.axis2/jars/axis2-kernel-SNAPSHOT.jar:
>         > .................... (850K)
>         > Uploading to
>         org.apache.axis2/poms/axis2-kernel-SNAPSHOT.pom:
>         > .................... (15K)
>         >
>         > +----------------------------------------
>         > | Executing multiproject:install-callback Apache Axis 2.0 -
>         Data Binding
>         > | Memory: 25M/38M
>         > +----------------------------------------
>         > DEPRECATED: the default goal should be specified in the
>         <build> section of project.xml instead of maven.xml
>         > DEPRECATED: the default goal should be specified in the
>         <build> section of project.xml instead of maven.xml
>         >
>         > build:end:
>         >
>         > Trying to get missing/snapshot dependencies required by
>         Apache Axis 2.0 - Data Binding:
>         > Attempting to download axiom-dom-SNAPSHOT.jar.
>         > Skipping download as local copy is up to date!
>         > Attempting to download axis2-kernel-SNAPSHOT.jar.
>         > Skipping download as local copy is up to date!
>         > build:start:
>         >
>         > multiproject:install-callback: 
>         >     [echo] Running jar:install for Apache Axis 2.0 - Data
>         Binding
>         > java:prepare-filesystem:
>         >     [mkdir] Created
>         dir: /export/home/illsleyd/continuum/continuum-1.0.3/apps/continuum/working-directory/1/modules/adb/target/classes 
>         > Running post goal: java:prepare-filesystem
>         >
>         > java:compile:
>         >     [echo] Compiling
>         to /export/home/illsleyd/continuum/continuum-1.0.3/apps/continuum/working-directory/1/modules/adb/target/classes 
>         >     [javac] Compiling 66 source files
>         to /export/home/illsleyd/continuum/continuum-1.0.3/apps/continuum/working-directory/1/modules/adb/target/classes
>         >
>         > java:jar-resources:
>         > Copying 1 file to /export/home/illsleyd/continuum/continuum-
>         1.0.3/apps/continuum/working-directory/1/modules/adb/target/classes
>         > Copying 2 files
>         to /export/home/illsleyd/continuum/continuum-1.0.3/apps/continuum/working-directory/1/modules/adb/target/classes/META-INF
>         > 
>         > test:test:
>         > java:prepare-filesystem:
>         > Running post goal: java:prepare-filesystem
>         >
>         > java:compile:
>         >     [echo] Compiling
>         to /export/home/illsleyd/continuum/continuum-1.0.3/apps/continuum/working-directory/1/modules/adb/target/classes 
>         >
>         > java:jar-resources:
>         >
>         > test:prepare-filesystem:
>         >     [mkdir] Created
>         dir: /export/home/illsleyd/continuum/continuum-1.0.3/apps/continuum/working-directory/1/modules/adb/target/test-classes 
>         >     [mkdir] Created
>         dir: /export/home/illsleyd/continuum/continuum-1.0.3/apps/continuum/working-directory/1/modules/adb/target/test-reports
>         >
>         > test:test-resources:
>         > Copying 1 file to /export/home/illsleyd/continuum/continuum-
>         1.0.3/apps/continuum/working-directory/1/modules/adb/target/test-classes
>         > Copying 1 file
>         to /export/home/illsleyd/continuum/continuum-1.0.3/apps/continuum/working-directory/1/modules/adb/target/test-classes
>         > 
>         > test:compile:
>         >     [javac] Compiling 9 source files
>         to /export/home/illsleyd/continuum/continuum-1.0.3/apps/continuum/working-directory/1/modules/adb/target/test-classes
>         >
>         >     [junit] Running
>         org.apache.axis2.databinding.ADBSOAPModelBuilderTest
>         >     [junit] Tests run: 5, Failures: 0, Errors: 0, Time
>         elapsed: 0.775 sec
>         >     [junit] Running
>         org.apache.axis2.databinding.utils.NamedStaxOMBuilderTest
>         >     [junit] Tests run: 2, Failures: 0, Errors: 0, Time
>         elapsed: 0.567 sec
>         >     [junit] Running
>         org.apache.axis2.databinding.utils.SimpleArrayReaderStateMachineTest
>         >     [junit] Tests run: 4, Failures: 0, Errors: 0, Time
>         elapsed: 0.509 sec
>         >     [junit] Running
>         org.apache.axis2.databinding.utils.SimpleElementReaderStateMachineTest
>         >     [junit] Tests run: 3, Failures: 0, Errors: 0, Time
>         elapsed: 0.493 sec
>         >     [junit] Running
>         org.apache.axis2.databinding.utils.reader.ADBXMLStreamReaderTest 
>         >     [junit] Tests run: 15, Failures: 0, Errors: 0, Time
>         elapsed: 1.001 sec
>         >
>         > jar:jar:
>         >     [jar] Building
>         jar: /export/home/illsleyd/continuum/continuum-1.0.3/apps/continuum/working-directory/1/modules/adb/target/axis2- adb-SNAPSHOT.jar
>         >
>         > jar:install:
>         >     [echo] Installing...
>         > Uploading to org.apache.axis2/jars/axis2-adb-SNAPSHOT.jar:
>         > .................... (146K)
>         > Uploading to org.apache.axis2/poms/axis2- adb-SNAPSHOT.pom:
>         > .................... (14K)
>         >
>         > +----------------------------------------
>         > | Executing multiproject:install-callback Apache Axis 2.0 -
>         Code Generation
>         > | Memory: 12M/39M
>         > +----------------------------------------
>         > DEPRECATED: the default goal should be specified in the
>         <build> section of project.xml instead of maven.xml
>         > DEPRECATED: the default goal should be specified in the
>         <build> section of project.xml instead of maven.xml
>         >
>         > build:end:
>         >
>         > Trying to get missing/snapshot dependencies required by
>         Apache Axis 2.0 - Code Generation:
>         > Attempting to download axis2-adb-SNAPSHOT.jar. 
>         > Skipping download as local copy is up to date!
>         > build:start:
>         >
>         > multiproject:install-callback:
>         >     [echo] Running jar:install for Apache Axis 2.0 - Code
>         Generation
>         > java:prepare-filesystem: 
>         >     [mkdir] Created
>         dir: /export/home/illsleyd/continuum/continuum-1.0.3/apps/continuum/working-directory/1/modules/codegen/target/classes
>         > Running post goal: java:prepare-filesystem
>         >
>         > java:compile: 
>         >     [echo] Compiling
>         to /export/home/illsleyd/continuum/continuum-1.0.3/apps/continuum/working-directory/1/modules/codegen/target/classes
>         >     [javac] Compiling 69 source files
>         to /export/home/illsleyd/continuum/continuum-
>         1.0.3/apps/continuum/working-directory/1/modules/codegen/target/classes
>         >
>         > java:jar-resources:
>         > Copying 33 files
>         to /export/home/illsleyd/continuum/continuum-1.0.3/apps/continuum/working-directory/1/modules/codegen/target/classes 
>         > Copying 2 files
>         to /export/home/illsleyd/continuum/continuum-1.0.3/apps/continuum/working-directory/1/modules/codegen/target/classes/META-INF
>         > Running post goal: java:jar-resources
>         >
>         > test:test: 
>         > java:prepare-filesystem:
>         > Running post goal: java:prepare-filesystem
>         >
>         > java:compile:
>         >     [echo] Compiling
>         to /export/home/illsleyd/continuum/continuum-1.0.3/apps/continuum/working-directory/1/modules/codegen/target/classes 
>         >
>         > java:jar-resources:
>         > Running post goal: java:jar-resources
>         >
>         > test:prepare-filesystem:
>         >     [mkdir] Created
>         dir: /export/home/illsleyd/continuum/continuum-1.0.3/apps/continuum/working-directory/1/modules/codegen/target/test-classes 
>         >     [mkdir] Created
>         dir: /export/home/illsleyd/continuum/continuum-1.0.3/apps/continuum/working-directory/1/modules/codegen/target/test-reports
>         >
>         > test:test-resources:
>         > Copying 6 files
>         to /export/home/illsleyd/continuum/continuum-
>         1.0.3/apps/continuum/working-directory/1/modules/codegen/target/test-classes
>         > Copying 31 files
>         to /export/home/illsleyd/continuum/continuum-1.0.3/apps/continuum/working-directory/1/modules/codegen/target/test-classes 
>         >
>         > test:compile:
>         >     [javac] Compiling 2 source files
>         to /export/home/illsleyd/continuum/continuum-1.0.3/apps/continuum/working-directory/1/modules/codegen/target/test-classes
>         >
>         >     [junit] Running
>         org.apache.axis2.wsdl.WSDLServiceBuilderTest
>         >     [junit] Tests run: 1, Failures: 0, Errors: 0, Time
>         elapsed: 1.158 sec
>         >     [junit] Running
>         org.apache.axis2.wsdl.codegen.extension.SchemaUnwrapperExtensionTest 
>         >     [junit] Tests run: 4, Failures: 0, Errors: 0, Time
>         elapsed: 0.98 sec
>         >
>         > jar:jar:
>         >     [jar] Building
>         jar: /export/home/illsleyd/continuum/continuum-1.0.3/apps/continuum/working-directory/1/modules/codegen/target/axis2- codegen-SNAPSHOT.jar
>         >
>         > jar:install:
>         >     [echo] Installing...
>         > Uploading to
>         org.apache.axis2/jars/axis2-codegen-SNAPSHOT.jar:
>         > .................... (179K)
>         > Uploading to
>         org.apache.axis2 /poms/axis2-codegen-SNAPSHOT.pom:
>         > .................... (17K)
>         >
>         > +----------------------------------------
>         > | Executing multiproject:install-callback Apache Axis 2.0 -
>         ADB Codegen
>         > | Memory: 29M/39M 
>         > +----------------------------------------
>         > DEPRECATED: the default goal should be specified in the
>         <build> section of project.xml instead of maven.xml
>         > DEPRECATED: the default goal should be specified in the
>         <build> section of project.xml instead of maven.xml
>         >
>         > build:end:
>         >
>         > Trying to get missing/snapshot dependencies required by
>         Apache Axis 2.0 - ADB Codegen:
>         > Attempting to download axis2-codegen-SNAPSHOT.jar. 
>         > Skipping download as local copy is up to date!
>         > build:start:
>         >
>         > multiproject:install-callback:
>         >     [echo] Running jar:install for Apache Axis 2.0 - ADB
>         Codegen
>         > java:prepare-filesystem: 
>         >     [mkdir] Created
>         dir: /export/home/illsleyd/continuum/continuum-1.0.3/apps/continuum/working-directory/1/modules/adb-codegen/target/classes
>         > Running post goal: java:prepare-filesystem
>         >
>         > java:compile: 
>         >     [echo] Compiling
>         to /export/home/illsleyd/continuum/continuum-1.0.3/apps/continuum/working-directory/1/modules/adb-codegen/target/classes
>         >     [javac] Compiling 17 source files
>         to /export/home/illsleyd/continuum/continuum-
>         1.0.3/apps/continuum/working-directory/1/modules/adb-codegen/target/classes
>         >
>         > java:jar-resources:
>         > Copying 8 files
>         to /export/home/illsleyd/continuum/continuum-1.0.3/apps/continuum/working-directory/1/modules/adb-codegen/target/classes 
>         > Copying 2 files
>         to /export/home/illsleyd/continuum/continuum-1.0.3/apps/continuum/working-directory/1/modules/adb-codegen/target/classes/META-INF
>         >
>         > test:test:
>         > java:prepare-filesystem:
>         > Running post goal: java:prepare-filesystem 
>         >
>         > java:compile:
>         >     [echo] Compiling
>         to /export/home/illsleyd/continuum/continuum-1.0.3/apps/continuum/working-directory/1/modules/adb-codegen/target/classes
>         >
>         > java:jar-resources:
>         > 
>         > test:prepare-filesystem:
>         >     [mkdir] Created
>         dir: /export/home/illsleyd/continuum/continuum-1.0.3/apps/continuum/working-directory/1/modules/adb-codegen/target/test-classes
>         >     [mkdir] Created
>         dir: /export/home/illsleyd/continuum/continuum-
>         1.0.3/apps/continuum/working-directory/1/modules/adb-codegen/target/test-reports
>         >
>         > test:test-resources:
>         > Copying 37 files
>         to /export/home/illsleyd/continuum/continuum-1.0.3/apps/continuum/working-directory/1/modules/adb-codegen/target/test-classes 
>         > Copying 8 files
>         to /export/home/illsleyd/continuum/continuum-1.0.3/apps/continuum/working-directory/1/modules/adb-codegen/target/test-classes
>         >
>         > test:compile:
>         >     [mkdir] Created
>         dir: /export/home/illsleyd/continuum/continuum-
>         1.0.3/apps/continuum/working-directory/1/modules/adb-codegen/target/schema
>         >     [mkdir] Created
>         dir: /export/home/illsleyd/continuum/continuum-1.0.3/apps/continuum/working-directory/1/modules/adb-codegen/target/schema/src 
>         >     [mkdir] Created
>         dir: /export/home/illsleyd/continuum/continuum-1.0.3/apps/continuum/working-directory/1/modules/adb-codegen/target/schema/classes
>         >     [echo] Compiling simple_maxOccurs2.xsd
>         >     [echo] Compiling anonymous_complexType.xsd 
>         >     [echo] Compiling simple_choice.xsd
>         >     [echo] Compiling simple_particle_all.xsd
>         >     [echo] Compiling simple_maxOccurs.xsd
>         >     [echo] Compiling simple_anytype.xsd
>         >     [echo] Compiling simple-minoccurs0.xsd
>         >     [echo] Compiling complex-minoccurs0.xsd
>         >     [echo] Compiling simple-recursive-datatypes.xsd
>         >     [echo] Compiling mixed_minoccus0.xsd
>         >     [echo] Compiling complete.xsd 
>         >     [echo] Compiling simpleExtension.xsd
>         >     [echo] Compiling union.xsd
>         >     [echo] Compiling all.xsd
>         >     [echo] Compiling enumeration.xsd
>         >     [echo] Compiling restrictions.xsd
>         >     [echo] Compiling choice.xsd
>         >     [echo] Compiling list.xsd
>         >     [echo] Compiling element_references.xsd
>         >     [echo] Compiling innersequence_choice.xsd
>         >     [javac] Compiling 196 source files
>         to /export/home/illsleyd/continuum/continuum-
>         1.0.3/apps/continuum/working-directory/1/modules/adb-codegen/target/schema/classes
>         >     [javac] Note: Some input files use unchecked or unsafe
>         operations.
>         >     [javac] Note: Recompile with -Xlint:unchecked for
>         details. 
>         >     [javac] Compiling 81 source files
>         to /export/home/illsleyd/continuum/continuum-1.0.3/apps/continuum/working-directory/1/modules/adb-codegen/target/test-classes
>         >
>         >     [junit] Running org.apache.axis2.schema.all.AllTest 
>         >     [junit] Tests run: 1, Failures: 0, Errors: 0, Time
>         elapsed: 0.771 sec
>         >     [junit] Running org.apache.axis2.schema.choice.ChiceTest
>         >     [junit] Tests run: 1, Failures: 0, Errors: 0, Time
>         elapsed: 0.65 sec
>         >     [junit] Running
>         org.apache.axis2.schema.compile.AnonymousComplexTypeTest
>         >     [junit] Tests run: 1, Failures: 0, Errors: 0, Time
>         elapsed: 3.873 sec
>         >     [junit] Running
>         org.apache.axis2.schema.compile.ComplexAllTest 
>         >     [junit] Tests run: 1, Failures: 0, Errors: 0, Time
>         elapsed: 4.452 sec
>         >     [junit] Running
>         org.apache.axis2.schema.compile.ComplexExtensionTest
>         >     [junit] Tests run: 1, Failures: 0, Errors: 0, Time
>         elapsed: 4.103 sec
>         >     [junit] Running
>         org.apache.axis2.schema.compile.ImportTest
>         >     [junit] Tests run: 1, Failures: 0, Errors: 0, Time
>         elapsed: 4.064 sec
>         >     [junit] Running
>         org.apache.axis2.schema.compile.RecursiveCompileTest 
>         >     [junit] Tests run: 1, Failures: 0, Errors: 0, Time
>         elapsed: 4.357 sec
>         >     [junit] Running
>         org.apache.axis2.schema.compile.SimpleAnyAttribTest
>         >     [junit] Tests run: 1, Failures: 0, Errors: 0, Time
>         elapsed: 9.184 sec
>         >     [junit] Running
>         org.apache.axis2.schema.compile.SimpleAnyTest
>         >     [junit] Tests run: 1, Failures: 0, Errors: 0, Time
>         elapsed: 4.449 sec
>         >     [junit] Running
>         org.apache.axis2.schema.compile.SimpleAnyTypeTest 
>         >     [junit] Tests run: 1, Failures: 0, Errors: 0, Time
>         elapsed: 4.065 sec
>         >     [junit] Running
>         org.apache.axis2.schema.compile.SimpleAttributeTest
>         >     [junit] Tests run: 1, Failures: 0, Errors: 0, Time
>         elapsed: 6.017 sec
>         >     [junit] Running
>         org.apache.axis2.schema.compile.SimpleChoiceTest
>         >     [junit] Tests run: 1, Failures: 0, Errors: 0, Time
>         elapsed: 4.916 sec
>         >     [junit] Running
>         org.apache.axis2.schema.compile.SimpleContentExtensionTest 
>         >     [junit] Tests run: 1, Failures: 0, Errors: 0, Time
>         elapsed: 4.004 sec
>         >     [junit] Running
>         org.apache.axis2.schema.compile.SimpleElementReferenceTest
>         >     [junit] Tests run: 1, Failures: 0, Errors: 0, Time
>         elapsed: 4.825 sec
>         >     [junit] Running
>         org.apache.axis2.schema.compile.SimpleElementTest
>         >     [junit] Tests run: 1, Failures: 0, Errors: 0, Time
>         elapsed: 4.09 sec
>         >     [junit] Running
>         org.apache.axis2.schema.compile.SimpleParticleAllTest 
>         >     [junit] Tests run: 1, Failures: 0, Errors: 0, Time
>         elapsed: 4.698 sec
>         >     [junit] Running
>         org.apache.axis2.schema.compile.SimpleRestrictionTest
>         >     [junit] Tests run: 1, Failures: 0, Errors: 0, Time
>         elapsed: 4.573 sec
>         >     [junit] Running
>         org.apache.axis2.schema.compile.SimpleSequence2Test
>         >     [junit] Tests run: 1, Failures: 0, Errors: 0, Time
>         elapsed: 4.757 sec
>         >     [junit] Running
>         org.apache.axis2.schema.compile.SimpleSequenceTest 
>         >     [junit] Tests run: 1, Failures: 0, Errors: 0, Time
>         elapsed: 3.667 sec
>         >     [junit] Running
>         org.apache.axis2.schema.compile.XmlMaxOccurs2Test
>         >     [junit] Tests run: 1, Failures: 0, Errors: 0, Time
>         elapsed: 4.381 sec
>         >     [junit] Running
>         org.apache.axis2.schema.compile.XmlmaxOccursTest
>         >     [junit] Tests run: 1, Failures: 0, Errors: 0, Time
>         elapsed: 4.262 sec
>         >     [junit] Running
>         org.apache.axis2.schema.compile.simple.SimpleTypeAllCompileTest 
>         >     [junit] Tests run: 1, Failures: 0, Errors: 0, Time
>         elapsed: 5.613 sec
>         >     [junit] Running
>         org.apache.axis2.schema.enumeration.EnumerationTest
>         >     [junit] Tests run: 1, Failures: 0, Errors: 0, Time
>         elapsed: 0.789 sec
>         >     [junit] Running
>         org.apache.axis2.schema.extension.ComplexExtenstionTest
>         >     [junit] Tests run: 1, Failures: 0, Errors: 0, Time
>         elapsed: 0.607 sec
>         >     [junit] Running
>         org.apache.axis2.schema.extension.SimpleExtensionTest 
>         >     [junit] Tests run: 1, Failures: 0, Errors: 0, Time
>         elapsed: 0.908 sec
>         >     [junit] Running
>         org.apache.axis2.schema.innerChoice.InnerChoiceTest
>         >     [junit] Tests run: 5, Failures: 0, Errors: 0, Time
>         elapsed: 0.704 sec
>         >     [junit] Running org.apache.axis2.schema.list.ListTest
>         >     [junit] Tests run: 5, Failures: 0, Errors: 0, Time
>         elapsed: 1.094 sec
>         >     [junit] Running
>         org.apache.axis2.schema.populate.derived.DerivedTypeBytePopulateTest 
>         >     [junit] Tests run: 1, Failures: 0, Errors: 0, Time
>         elapsed: 0.844 sec
>         >     [junit] Running
>         org.apache.axis2.schema.populate.derived.DerivedTypeIntPopulateTest
>         >     [junit] Tests run: 1, Failures: 0, Errors: 0, Time
>         elapsed: 0.833 sec
>         >     [junit] Running
>         org.apache.axis2.schema.populate.derived.DerivedTypeIntegerPopulateTest
>         >     [junit] Tests run: 1, Failures: 0, Errors: 0, Time
>         elapsed: 1.259 sec
>         >     [junit] Running
>         org.apache.axis2.schema.populate.derived.DerivedTypeLongPopulateTest 
>         >     [junit] Tests run: 1, Failures: 0, Errors: 0, Time
>         elapsed: 0.971 sec
>         >     [junit] Running
>         org.apache.axis2.schema.populate.derived.DerivedTypeNegativeIntegerPopulateTest
>         >     [junit] Tests run: 1, Failures: 0, Errors: 0, Time
>         elapsed: 1.033 sec
>         >     [junit] Running
>         org.apache.axis2.schema.populate.derived.DerivedTypeNonNegativeIntegerPopulateTest
>         >     [junit] Tests run: 1, Failures: 0, Errors: 0, Time
>         elapsed: 0.858 sec
>         >     [junit] Running
>         org.apache.axis2.schema.populate.derived.DerivedTypeNonPositiveIntegerPopulateTest
>         >     [junit] Tests run: 1, Failures: 0, Errors: 0, Time
>         elapsed: 0.804 sec
>         >     [junit] Running
>         org.apache.axis2.schema.populate.derived.DerivedTypePositveIntegerPopulateTest 
>         >     [junit] Tests run: 1, Failures: 0, Errors: 0, Time
>         elapsed: 0.862 sec
>         >     [junit] Running
>         org.apache.axis2.schema.populate.derived.DerivedTypeShortPopulateTest
>         >     [junit] Tests run: 1, Failures: 0, Errors: 0, Time
>         elapsed: 0.985 sec
>         >     [junit] Running
>         org.apache.axis2.schema.populate.derived.DerivedTypeUnsignedBytePopulateTest
>         >     [junit] Tests run: 1, Failures: 0, Errors: 0, Time
>         elapsed: 0.739 sec
>         >     [junit] Running
>         org.apache.axis2.schema.populate.derived.DerivedTypeUnsignedIntPopulateTest
>         >     [junit] Tests run: 1, Failures: 0, Errors: 0, Time
>         elapsed: 0.997 sec
>         >     [junit] Running
>         org.apache.axis2.schema.populate.derived.DerivedTypeUnsignedLongPopulateTest 
>         >     [junit] Tests run: 1, Failures: 0, Errors: 0, Time
>         elapsed: 0.735 sec
>         >     [junit] Running
>         org.apache.axis2.schema.populate.derived.DerivedTypeUnsignedShortPopulateTest
>         >     [junit] Tests run: 1, Failures: 0, Errors: 0, Time
>         elapsed: 0.757 sec
>         >     [junit] Running
>         org.apache.axis2.schema.populate.other.ADBInOutTest
>         >     [junit] Tests run: 2, Failures: 0, Errors: 0, Time
>         elapsed: 0.581 sec
>         >     [junit] Running
>         org.apache.axis2.schema.populate.other.PopulateAnonComplexTypeTest 
>         >     [junit] Tests run: 1, Failures: 0, Errors: 0, Time
>         elapsed: 0.645 sec
>         >     [junit] Running
>         org.apache.axis2.schema.populate.other.PopulateAnyTypeTest
>         >     [junit] Tests run: 1, Failures: 0, Errors: 0, Time
>         elapsed: 0.654 sec
>         >     [junit] Running
>         org.apache.axis2.schema.populate.other.PopulateArrayInArrayTest
>         >     [junit] Tests run: 1, Failures: 0, Errors: 0, Time
>         elapsed: 0.656 sec
>         >     [junit] Running
>         org.apache.axis2.schema.populate.other.PopulateArrayTest 
>         >     [junit] Tests run: 1, Failures: 0, Errors: 0, Time
>         elapsed: 0.786 sec
>         >     [junit] Running
>         org.apache.axis2.schema.populate.other.PopulateChoiceTest
>         >     [junit] Tests run: 1, Failures: 0, Errors: 0, Time
>         elapsed: 0.554 sec
>         >     [junit] Running
>         org.apache.axis2.schema.populate.other.PopulateComplexMinOccurs0Test
>         >     [junit] Tests run: 4, Failures: 0, Errors: 0, Time
>         elapsed: 0.523 sec
>         >     [junit] Running
>         org.apache.axis2.schema.populate.other.PopulateMinOccurs0Test 
>         >     [junit] Tests run: 3, Failures: 0, Errors: 0, Time
>         elapsed: 0.695 sec
>         >     [junit] Running
>         org.apache.axis2.schema.populate.other.PopulateMixedMinoccurs0Test
>         >     [junit] Tests run: 2, Failures: 0, Errors: 0, Time
>         elapsed: 0.698 sec
>         >     [junit] Running
>         org.apache.axis2.schema.populate.other.PopulateParticleAllTest
>         >     [junit] Tests run: 1, Failures: 0, Errors: 0, Time
>         elapsed: 0.601 sec
>         >     [junit] Running
>         org.apache.axis2.schema.populate.other.PopulateRecursiveTest 
>         >     [junit] Tests run: 1, Failures: 0, Errors: 0, Time
>         elapsed: 0.547 sec
>         >     [junit] Running
>         org.apache.axis2.schema.populate.simple.SimpleTypeAnyURIPopulateTest
>         >     [junit] Tests run: 1, Failures: 0, Errors: 0, Time
>         elapsed: 0.714 sec
>         >     [junit] Running
>         org.apache.axis2.schema.populate.simple.SimpleTypeBase64BinPopulateTest
>         >     [junit] Tests run: 1, Failures: 0, Errors: 0, Time
>         elapsed: 0.621 sec
>         >     [junit] Running
>         org.apache.axis2.schema.populate.simple.SimpleTypeBooleanPopulateTest 
>         >     [junit] Tests run: 1, Failures: 0, Errors: 0, Time
>         elapsed: 0.729 sec
>         >     [junit] Running
>         org.apache.axis2.schema.populate.simple.SimpleTypeDatePopulateTest
>         >     [junit] Tests run: 1, Failures: 0, Errors: 0, Time
>         elapsed: 0.611 sec
>         >     [junit] Running
>         org.apache.axis2.schema.populate.simple.SimpleTypeDateTimePopulateTest
>         >     [junit] Tests run: 1, Failures: 0, Errors: 0, Time
>         elapsed: 0.586 sec
>         >     [junit] Running
>         org.apache.axis2.schema.populate.simple.SimpleTypeDayPopulateTest 
>         >     [junit] Tests run: 1, Failures: 0, Errors: 0, Time
>         elapsed: 0.627 sec
>         >     [junit] Running
>         org.apache.axis2.schema.populate.simple.SimpleTypeDoublePopulateTest
>         >     [junit] Tests run: 1, Failures: 0, Errors: 0, Time
>         elapsed: 0.602 sec
>         >     [junit] Running
>         org.apache.axis2.schema.populate.simple.SimpleTypeDurationPopulateTest
>         >     [junit] Tests run: 1, Failures: 0, Errors: 0, Time
>         elapsed: 0.563 sec
>         >     [junit] Running
>         org.apache.axis2.schema.populate.simple.SimpleTypeFloatPopulateTest 
>         >     [junit] Tests run: 1, Failures: 0, Errors: 0, Time
>         elapsed: 0.924 sec
>         >     [junit] Running
>         org.apache.axis2.schema.populate.simple.SimpleTypeHexBinaryPopulateTest
>         >     [junit] Tests run: 1, Failures: 0, Errors: 0, Time
>         elapsed: 0.749 sec
>         >     [junit] Running
>         org.apache.axis2.schema.populate.simple.SimpleTypeMonthDayPopulateTest
>         >     [junit] Tests run: 1, Failures: 0, Errors: 0, Time
>         elapsed: 0.563 sec
>         >     [junit] Running
>         org.apache.axis2.schema.populate.simple.SimpleTypeQNamePopulateTest 
>         >     [junit] Tests run: 1, Failures: 0, Errors: 0, Time
>         elapsed: 0.636 sec
>         >     [junit] Running
>         org.apache.axis2.schema.populate.simple.SimpleTypeTimePopulateTest
>         >     [junit] Tests run: 1, Failures: 0, Errors: 0, Time
>         elapsed: 0.589 sec
>         >     [junit] Running
>         org.apache.axis2.schema.populate.simple.SimpleTypegMonthPopulateTest
>         >     [junit] Tests run: 1, Failures: 0, Errors: 0, Time
>         elapsed: 0.53 sec
>         >     [junit] Running
>         org.apache.axis2.schema.populate.simple.SimpleTypegYearMonthPopulateTest 
>         >     [junit] Tests run: 1, Failures: 0, Errors: 0, Time
>         elapsed: 0.545 sec
>         >     [junit] Running
>         org.apache.axis2.schema.populate.simple.SimpleTypegYearPopulateTest
>         >     [junit] Tests run: 1, Failures: 0, Errors: 0, Time
>         elapsed: 0.551 sec
>         >     [junit] Running
>         org.apache.axis2.schema.references.ElementReferenceTest
>         >     [junit] Tests run: 2, Failures: 0, Errors: 0, Time
>         elapsed: 0.88 sec
>         >     [junit] Running
>         org.apache.axis2.schema.restriction.ComplexRestrictionTest 
>         >     [junit] Tests run: 1, Failures: 0, Errors: 0, Time
>         elapsed: 1.185 sec
>         >     [junit] Running
>         org.apache.axis2.schema.restriction.SimpleRestrictionTest
>         >     [junit] Tests run: 5, Failures: 0, Errors: 0, Time
>         elapsed: 0.706 sec
>         >     [junit] Running
>         org.apache.axis2.schema.testsuite.AnyElementsTest
>         >     [junit] Tests run: 3, Failures: 0, Errors: 0, Time
>         elapsed: 0.67 sec
>         >     [junit] Running
>         org.apache.axis2.schema.testsuite.CustomElementsTest 
>         >     [junit] Tests run: 3, Failures: 0, Errors: 0, Time
>         elapsed: 0.682 sec
>         >     [junit] Running
>         org.apache.axis2.schema.testsuite.IntElementsTest
>         >     [junit] Tests run: 3, Failures: 0, Errors: 0, Time
>         elapsed: 0.712 sec
>         >     [junit] Running
>         org.apache.axis2.schema.testsuite.OuterElementsTest
>         >     [junit] Tests run: 5, Failures: 0, Errors: 0, Time
>         elapsed: 0.858 sec
>         >     [junit] Running
>         org.apache.axis2.schema.testsuite.StringElementsTest 
>         >     [junit] Tests run: 3, Failures: 0, Errors: 0, Time
>         elapsed: 0.683 sec
>         >     [junit] Running
>         org.apache.axis2.schema.testsuite.XsdAnyElementsTest
>         >     [junit] Tests run: 3, Failures: 0, Errors: 0, Time
>         elapsed: 0.742 sec
>         >     [junit] Running org.apache.axis2.schema.union.UnionTest
>         >     [junit] Tests run: 4, Failures: 0, Errors: 0, Time
>         elapsed: 0.663 sec
>         >
>         > jar:jar:
>         >     [jar] Building
>         jar: /export/home/illsleyd/continuum/continuum-
>         1.0.3/apps/continuum/working-directory/1/modules/adb-codegen/target/axis2-adb-codegen-SNAPSHOT.jar
>         >
>         > jar:install:
>         >     [echo] Installing...
>         > Uploading to
>         org.apache.axis2/jars/axis2-adb-codegen-SNAPSHOT.jar :
>         > .................... (121K)
>         > Uploading to
>         org.apache.axis2/poms/axis2-adb-codegen-SNAPSHOT.pom:
>         > .................... (15K)
>         >
>         > +----------------------------------------
>         > | Executing multiproject:install-callback Apache Axis 2.0 -
>         Addressing
>         > | Memory: 36M/61M
>         > +----------------------------------------
>         > DEPRECATED: the default goal should be specified in the
>         <build> section of project.xml instead of maven.xml
>         > DEPRECATED: the default goal should be specified in the
>         <build> section of project.xml instead of maven.xml
>         >
>         > build:end:
>         >
>         > build:start:
>         >
>         > multiproject:install-callback:
>         >     [echo] Running jar:install for Apache Axis 2.0 -
>         Addressing
>         > java:prepare-filesystem: 
>         >     [mkdir] Created
>         dir: /export/home/illsleyd/continuum/continuum-1.0.3/apps/continuum/working-directory/1/modules/addressing/target/classes
>         > Running post goal: java:prepare-filesystem
>         >
>         > java:compile: 
>         >     [echo] Compiling
>         to /export/home/illsleyd/continuum/continuum-1.0.3/apps/continuum/working-directory/1/modules/addressing/target/classes
>         >     [javac] Compiling 9 source files
>         to /export/home/illsleyd/continuum/continuum-
>         1.0.3/apps/continuum/working-directory/1/modules/addressing/target/classes
>         > Running post goal: java:compile
>         >     [mkdir] Created
>         dir: /export/home/illsleyd/continuum/continuum-1.0.3/apps/continuum/working-directory/1/modules/addressing/target/classes/META-INF 
>         >     [copy] Copying 1 file
>         to /export/home/illsleyd/continuum/continuum-1.0.3/apps/continuum/working-directory/1/modules/addressing/target/classes/META-INF
>         >     [copy] Copying 1 file
>         to /export/home/illsleyd/continuum/continuum-
>         1.0.3/apps/continuum/working-directory/1/modules/addressing/target/classes/META-INF
>         >     [copy] Copying 1 file
>         to /export/home/illsleyd/continuum/continuum-1.0.3/apps/continuum/working-directory/1/modules/addressing/target/classes/META-INF 
>         >     [copy] Copying 1 file
>         to /export/home/illsleyd/continuum/continuum-1.0.3/apps/continuum/working-directory/1/modules/addressing/target
>         >     [mkdir] Created
>         dir: /export/home/illsleyd/continuum/continuum-
>         1.0.3/apps/continuum/working-directory/1/modules/addressing/target/modules
>         >     [jar] Building
>         jar: /export/home/illsleyd/continuum/continuum-1.0.3/apps/continuum/working-directory/1/modules/addressing/target/addressing- SNAPSHOT.mar
>         >     [copy] Copying 1 file
>         to /export/home/illsleyd/continuum/continuum-1.0.3/apps/continuum/working-directory/1/modules/addressing/target/modules
>         >     [copy] Copying 1 file
>         to /export/home/illsleyd/.maven/repository/org.apache.axis2/mars 
>         >
>         > java:jar-resources:
>         > Copying 1 file
>         to /export/home/illsleyd/continuum/continuum-1.0.3/apps/continuum/working-directory/1/modules/addressing/target/classes
>         >
>         > test:test:
>         > java:prepare-filesystem: 
>         > Running post goal: java:prepare-filesystem
>         >
>         > java:compile:
>         >     [echo] Compiling
>         to /export/home/illsleyd/continuum/continuum-1.0.3/apps/continuum/working-directory/1/modules/addressing/target/classes 
>         > Running post goal: java:compile
>         >     [copy] Copying 1 file
>         to /export/home/illsleyd/continuum/continuum-1.0.3/apps/continuum/working-directory/1/modules/addressing/target/classes/META-INF
>         >     [copy] Copying 1 file
>         to /export/home/illsleyd/continuum/continuum-
>         1.0.3/apps/continuum/working-directory/1/modules/addressing/target/classes/META-INF
>         >     [jar] Building
>         jar: /export/home/illsleyd/continuum/continuum-1.0.3/apps/continuum/working-directory/1/modules/addressing/target/addressing- SNAPSHOT.mar
>         >     [copy] Copying 1 file
>         to /export/home/illsleyd/continuum/continuum-1.0.3/apps/continuum/working-directory/1/modules/addressing/target/modules
>         >     [copy] Copying 1 file
>         to /export/home/illsleyd/.maven/repository/org.apache.axis2/mars 
>         >
>         > java:jar-resources:
>         >
>         > test:prepare-filesystem:
>         >     [mkdir] Created
>         dir: /export/home/illsleyd/continuum/continuum-1.0.3/apps/continuum/working-directory/1/modules/addressing/target/test-classes 
>         >     [mkdir] Created
>         dir: /export/home/illsleyd/continuum/continuum-1.0.3/apps/continuum/working-directory/1/modules/addressing/target/test-reports
>         >
>         > test:test-resources:
>         > Copying 35 files
>         to /export/home/illsleyd/continuum/continuum-
>         1.0.3/apps/continuum/working-directory/1/modules/addressing/target/test-classes
>         > Copying 2 files
>         to /export/home/illsleyd/continuum/continuum-1.0.3/apps/continuum/working-directory/1/modules/addressing/target/test-classes 
>         >
>         > test:compile:
>         >     [javac] Compiling 8 source files
>         to /export/home/illsleyd/continuum/continuum-1.0.3/apps/continuum/working-directory/1/modules/addressing/target/test-classes
>         >     [javac] Note: /export/home/illsleyd/continuum/continuum-
>         1.0.3/apps/continuum/working-directory/1/modules/addressing/test/org/apache/axis2/handlers/addressing/AddressingOutHandlerTest.java uses or overrides a deprecated API.
>         >     [javac] Note: Recompile with -Xlint:deprecation for
>         details. 
>         >
>         >     [junit] Running
>         org.apache.axis2.addressing.AddressingFaultsTest
>         >     [junit] Tests run: 6, Failures: 0, Errors: 0, Time
>         elapsed: 0.512 sec
>         >     [junit] Running
>         org.apache.axis2.handlers.addressing.AddressingFinalInHandlerTest 
>         >     [junit] Tests run: 17, Failures: 0, Errors: 0, Time
>         elapsed: 1.031 sec
>         >     [junit] Running
>         org.apache.axis2.handlers.addressing.AddressingInFaultHandlerTest
>         >     [junit] Tests run: 4, Failures: 0, Errors: 0, Time
>         elapsed: 0.911 sec
>         >     [junit] Running
>         org.apache.axis2.handlers.addressing.AddressingOutHandlerTest
>         >     [junit] Tests run: 6, Failures: 0, Errors: 0, Time
>         elapsed: 1.98 sec
>         >     [junit] Running
>         org.apache.axis2.handlers.addressing.AddressingSubmissionInHandlerTest 
>         >     [junit] Tests run: 14, Failures: 0, Errors: 0, Time
>         elapsed: 1.777 sec
>         >     [junit] Running
>         org.apache.axis2.handlers.addressing.AddressingValidationHandlerTest
>         >     [junit] Tests run: 4, Failures: 0, Errors: 0, Time
>         elapsed: 1.336 sec
>         >
>         > jar:jar:
>         >     [jar] Building
>         jar: /export/home/illsleyd/continuum/continuum-1.0.3/apps/continuum/working-directory/1/modules/addressing/target/axis2-addressing-SNAPSHOT.jar
>         >
>         > jar:install: 
>         >     [echo] Installing...
>         > Uploading to
>         org.apache.axis2/jars/axis2-addressing-SNAPSHOT.jar:
>         > .................... (38K)
>         > Uploading to
>         org.apache.axis2/poms/axis2-addressing-SNAPSHOT.pom:
>         > .................... (15K) 
>         >
>         > +----------------------------------------
>         > | Executing multiproject:install-callback Apache Axis 2.0 -
>         Cluster
>         > | Memory: 38M/61M
>         > +----------------------------------------
>         > DEPRECATED: the default goal should be specified in the
>         <build> section of project.xml instead of maven.xml
>         > DEPRECATED: the default goal should be specified in the
>         <build> section of project.xml instead of maven.xml
>         >
>         > build:end:
>         >
>         > build:start:
>         >
>         > multiproject:install-callback:
>         >     [echo] Running jar:install for Apache Axis 2.0 - Cluster
>         > java:prepare-filesystem:
>         >     [mkdir] Created
>         dir: /export/home/illsleyd/continuum/continuum-1.0.3/apps/continuum/working-directory/1/modules/clustering/target/classes 
>         > Running post goal: java:prepare-filesystem
>         >
>         > java:compile:
>         >     [echo] Compiling
>         to /export/home/illsleyd/continuum/continuum-1.0.3/apps/continuum/working-directory/1/modules/clustering/target/classes 
>         >     [javac] Compiling 10 source files
>         to /export/home/illsleyd/continuum/continuum-1.0.3/apps/continuum/working-directory/1/modules/clustering/target/classes
>         >     [javac] Note: Some input files use unchecked or unsafe
>         operations. 
>         >     [javac] Note: Recompile with -Xlint:unchecked for
>         details.
>         >
>         > java:jar-resources:
>         >
>         > test:test:
>         > java:prepare-filesystem:
>         > Running post goal: java:prepare-filesystem
>         >
>         > java:compile:
>         >     [echo] Compiling
>         to /export/home/illsleyd/continuum/continuum-1.0.3/apps/continuum/working-directory/1/modules/clustering/target/classes
>         >
>         > java:jar-resources:
>         >
>         > test:prepare-filesystem:
>         >     [mkdir] Created
>         dir: /export/home/illsleyd/continuum/continuum-1.0.3/apps/continuum/working-directory/1/modules/clustering/target/test-classes
>         >     [mkdir] Created
>         dir: /export/home/illsleyd/continuum/continuum-
>         1.0.3/apps/continuum/working-directory/1/modules/clustering/target/test-reports
>         >
>         > test:test-resources:
>         >
>         > test:compile:
>         >     [javac] Compiling 5 source files
>         to /export/home/illsleyd/continuum/continuum-
>         1.0.3/apps/continuum/working-directory/1/modules/clustering/target/test-classes
>         >
>         >     [junit] Running
>         org.apache.axis2.clustering.tribes.ManageContextTest
>         >     [junit] Tests run: 1, Failures: 1, Errors: 0, Time
>         elapsed: 16.817 sec
>         >
>         > BUILD FAILED
>         > File......
>         file:/export/home/illsleyd/.maven/cache/maven-multiproject-plugin-1.5-SNAPSHOT/plugin.jelly
>         > Element... maven:reactor
>         > Line...... 227
>         > Column.... 64 
>         > Unable to obtain goal [multiproject:install-callback] --
>         file:/export/home/illsleyd/.maven/cache/maven-test-plugin-1.8.1-SNAPSHOT/plugin.jelly:155:49: <junit> Test org.apache.axis2.clustering.tribes.ManageContextTest failed
>         > Total time   : 9 minutes 14 seconds
>         > Finished at  : Monday, February 26, 2007 11:10:02 PM GMT
>         +00:00
>         >
>         >
>         >
>         **************************************************************************** 
>         >
>         >
>         >
>         >
>         ---------------------------------------------------------------------
>         > To unsubscribe, e-mail: axis-dev-unsubscribe@ws.apache.org
>         > For additional commands, e-mail: axis-dev-help@ws.apache.org
>         
>         
>         ---------------------------------------------------------------------
>         To unsubscribe, e-mail: axis-dev-unsubscribe@ws.apache.org
>         For additional commands, e-mail: axis-dev-help@ws.apache.org
>         
> 


---------------------------------------------------------------------
To unsubscribe, e-mail: axis-dev-unsubscribe@ws.apache.org
For additional commands, e-mail: axis-dev-help@ws.apache.org


Mime
View raw message