axis-java-dev mailing list archives

Site index · List index
Message view « Date » · « Thread »
Top « Date » · « Thread »
From "davidillsley (Continuum)" <davidills...@apache.org>
Subject [continuum] BUILD FAILURE: Axis2
Date Fri, 26 Jan 2007 02:12:29 GMT
Online report : http://localhost:8080/continuum/servlet/continuum/target/ProjectBuild.vm/view/ProjectBuild/id/1/buildId/382
Build statistics:
  State: Failed
  Previous State: Failed
  Started at: Fri, 26 Jan 2007 02:05:32 +0000
  Finished at: Fri, 26 Jan 2007 02:12:06 +0000
  Total time: 6m 34s
  Build Trigger: Schedule
  Exit code: 70
  Building machine hostname: ws.zones.apache.org
  Operating system : SunOS(unknown)
  Java version : 1.5.0_09(Sun Microsystems Inc.)

Changes
         dims          Fix for AXIS2-1828 - Change DeploymentEngine and RepositoryListener fields and methods from private to protected
             /webservices/axis2/trunk/java/modules/kernel/src/org/apache/axis2/deployment/DeploymentEngine.java
            /webservices/axis2/trunk/java/modules/kernel/src/org/apache/axis2/deployment/RepositoryListener.java
        
****************************************************************************
Output:
****************************************************************************
 __  __
|  \/  |__ _Apache__ ___
| |\/| / _` \ V / -_) ' \  ~ intelligent projects ~
|_|  |_\__,_|\_/\___|_||_|  v. 1.1-beta-3

DEPRECATED: the default goal should be specified in the <build> section of project.xml instead of maven.xml
DEPRECATED: the default goal should be specified in the <build> section of project.xml instead of maven.xml
Trying to get missing/snapshot dependencies required by Apache Axis2:
Attempting to download maven-test-plugin-1.8.1-SNAPSHOT.jar.
Skipping download as local copy is up to date!
Attempting to download maven-multiproject-plugin-1.5-SNAPSHOT.jar.
Skipping download as local copy is up to date!
Attempting to download maven-jar-plugin-1.8-SNAPSHOT.jar.
Skipping download as local copy is up to date!
Attempting to download maven-plugin-plugin-1.8-SNAPSHOT.jar.
Skipping download as local copy is up to date!
    [echo] 1.5
    [echo] 
            JDK 1.5 detected, including the following modules:
            modules/metadata/project.xml,modules/saaj-api/project.xml,modules/saaj/project.xml,modules/jaxbri/project.xml,modules/jaxws/project.xml,modules/jaxws-api/project.xml,modules/json/project.xml
        
build:start:

clean:
modules:clean:
modules:reactor:init:
plugin:download-artifact:

    [echo] Adding to modules.reactor.includes: modules/adb-codegen/project.xml
    [echo] Adding to modules.reactor.includes: modules/adb/project.xml
    [echo] Adding to modules.reactor.includes: modules/addressing/project.xml
    [echo] Adding to modules.reactor.includes: modules/codegen/project.xml
    [echo] Adding to modules.reactor.includes: modules/integration/project.xml
    [echo] Adding to modules.reactor.includes: modules/java2wsdl/project.xml
    [echo] Adding to modules.reactor.includes: modules/jaxbri/project.xml
    [echo] Adding to modules.reactor.includes: modules/jaxws-api/project.xml
    [echo] Adding to modules.reactor.includes: modules/jaxws/project.xml
    [echo] Adding to modules.reactor.includes: modules/jibx/project.xml
    [echo] Adding to modules.reactor.includes: modules/json/project.xml
    [echo] Adding to modules.reactor.includes: modules/kernel/project.xml
    [echo] Adding to modules.reactor.includes: modules/metadata/project.xml
    [echo] Adding to modules.reactor.includes: modules/mtompolicy/project.xml
    [echo] Adding to modules.reactor.includes: modules/rahas/project.xml
    [echo] Adding to modules.reactor.includes: modules/saaj-api/project.xml
    [echo] Adding to modules.reactor.includes: modules/saaj/project.xml
    [echo] Adding to modules.reactor.includes: modules/samples/project.xml
    [echo] Adding to modules.reactor.includes: modules/savan/project.xml
    [echo] Adding to modules.reactor.includes: modules/secpolicy/project.xml
    [echo] Adding to modules.reactor.includes: modules/security/project.xml
    [echo] Adding to modules.reactor.includes: modules/soapmonitor/project.xml
    [echo] Adding to modules.reactor.includes: modules/spring/project.xml
    [echo] Adding to modules.reactor.includes: modules/tool/project.xml
    [echo] Adding to modules.reactor.includes: modules/webapp/project.xml
    [echo] Adding to modules.reactor.includes: modules/xmlbeans/project.xml

    [echo] +----------------------------------------
    [echo] | Cleaning: modules/adb-codegen
    [echo] +----------------------------------------
    [delete] Deleting directory /export/home/illsleyd/continuum/continuum-1.0.3/apps/continuum/working-directory/1/modules/adb-codegen/target
    [echo] 
    [echo] +----------------------------------------
    [echo] | Cleaning: modules/adb
    [echo] +----------------------------------------
    [delete] Deleting directory /export/home/illsleyd/continuum/continuum-1.0.3/apps/continuum/working-directory/1/modules/adb/target
    [echo] 
    [echo] +----------------------------------------
    [echo] | Cleaning: modules/addressing
    [echo] +----------------------------------------
    [echo] 
    [echo] +----------------------------------------
    [echo] | Cleaning: modules/codegen
    [echo] +----------------------------------------
    [delete] Deleting directory /export/home/illsleyd/continuum/continuum-1.0.3/apps/continuum/working-directory/1/modules/codegen/target
    [echo] 
    [echo] +----------------------------------------
    [echo] | Cleaning: modules/integration
    [echo] +----------------------------------------
    [echo] 
    [echo] +----------------------------------------
    [echo] | Cleaning: modules/java2wsdl
    [echo] +----------------------------------------
    [delete] Deleting directory /export/home/illsleyd/continuum/continuum-1.0.3/apps/continuum/working-directory/1/modules/java2wsdl/target
    [echo] 
    [echo] +----------------------------------------
    [echo] | Cleaning: modules/jaxbri
    [echo] +----------------------------------------
    [echo] 
    [echo] +----------------------------------------
    [echo] | Cleaning: modules/jaxws-api
    [echo] +----------------------------------------
    [echo] 
    [echo] +----------------------------------------
    [echo] | Cleaning: modules/jaxws
    [echo] +----------------------------------------
    [echo] 
    [echo] +----------------------------------------
    [echo] | Cleaning: modules/jibx
    [echo] +----------------------------------------
    [echo] 
    [echo] +----------------------------------------
    [echo] | Cleaning: modules/json
    [echo] +----------------------------------------
    [echo] 
    [echo] +----------------------------------------
    [echo] | Cleaning: modules/kernel
    [echo] +----------------------------------------
    [delete] Deleting directory /export/home/illsleyd/continuum/continuum-1.0.3/apps/continuum/working-directory/1/modules/kernel/target
    [echo] 
    [echo] +----------------------------------------
    [echo] | Cleaning: modules/metadata
    [echo] +----------------------------------------
    [echo] 
    [echo] +----------------------------------------
    [echo] | Cleaning: modules/mtompolicy
    [echo] +----------------------------------------
    [echo] 
    [echo] +----------------------------------------
    [echo] | Cleaning: modules/rahas
    [echo] +----------------------------------------
    [echo] 
    [echo] +----------------------------------------
    [echo] | Cleaning: modules/saaj-api
    [echo] +----------------------------------------
    [echo] 
    [echo] +----------------------------------------
    [echo] | Cleaning: modules/saaj
    [echo] +----------------------------------------
    [echo] 
    [echo] +----------------------------------------
    [echo] | Cleaning: modules/samples
    [echo] +----------------------------------------
    [echo] 
    [echo] +----------------------------------------
    [echo] | Cleaning: modules/savan
    [echo] +----------------------------------------
    [echo] 
    [echo] +----------------------------------------
    [echo] | Cleaning: modules/secpolicy
    [echo] +----------------------------------------
    [echo] 
    [echo] +----------------------------------------
    [echo] | Cleaning: modules/security
    [echo] +----------------------------------------
    [echo] 
    [echo] +----------------------------------------
    [echo] | Cleaning: modules/soapmonitor
    [echo] +----------------------------------------
    [echo] 
    [echo] +----------------------------------------
    [echo] | Cleaning: modules/spring
    [echo] +----------------------------------------
    [echo] 
    [echo] +----------------------------------------
    [echo] | Cleaning: modules/tool
    [echo] +----------------------------------------
    [echo] 
    [echo] +----------------------------------------
    [echo] | Cleaning: modules/webapp
    [echo] +----------------------------------------
    [echo] 
    [echo] +----------------------------------------
    [echo] | Cleaning: modules/xmlbeans
    [echo] +----------------------------------------
    [echo] 
    [echo] +----------------------------------------
    [echo] | Cleaning: target and etc/target
    [echo] +----------------------------------------


jar:
multiproject:install:
multiproject:projects-init:
    [echo] Gathering project list
Starting the reactor...
Our processing order:
Apache Axis 2.0 - Java2WSDL
Apache Axis 2.0 - Kernel
Apache Axis 2.0 - Data Binding
Apache Axis 2.0 - Code Generation
Apache Axis 2.0 - ADB Codegen
Apache Axis 2.0 - Addressing
Apache Axis 2.0 - JiBX Data Binding
Apache Axis 2.0 - Security Policy
Apache Axis 2.0 - XMLBeans Data Binding
Apache Axis 2.0 - Rahas
Apache Axis 2.0 - Security
Apache Axis 2.0 - Samples
Apache Axis 2.0 - spring
Apache Axis 2.0 - Tools
Apache Axis 2.0 - Integration
Apache Axis 2.0 - JAXB-RI Data Binding
Apache Axis 2.0 - SAAJ API
Apache Axis 2.0 - JAXWS API
Apache Axis 2.0 - SAAJ
Apache Axis 2.0 - Metadata
Apache Axis 2.0 - JAX-WS
Apache Axis 2.0 - JSON
Apache Axis 2.0 - MTOM Policy
Apache Axis 2.0 - Savan
Apache Axis 2.0 - soapmonitor
+----------------------------------------
| Gathering project list Apache Axis 2.0 - Java2WSDL
| Memory: 22M/40M
+----------------------------------------
+----------------------------------------
| Gathering project list Apache Axis 2.0 - Kernel
| Memory: 22M/40M
+----------------------------------------
+----------------------------------------
| Gathering project list Apache Axis 2.0 - Data Binding
| Memory: 22M/40M
+----------------------------------------
+----------------------------------------
| Gathering project list Apache Axis 2.0 - Code Generation
| Memory: 22M/40M
+----------------------------------------
+----------------------------------------
| Gathering project list Apache Axis 2.0 - ADB Codegen
| Memory: 22M/40M
+----------------------------------------
+----------------------------------------
| Gathering project list Apache Axis 2.0 - Addressing
| Memory: 22M/40M
+----------------------------------------
+----------------------------------------
| Gathering project list Apache Axis 2.0 - JiBX Data Binding
| Memory: 22M/40M
+----------------------------------------
+----------------------------------------
| Gathering project list Apache Axis 2.0 - Security Policy
| Memory: 22M/40M
+----------------------------------------
+----------------------------------------
| Gathering project list Apache Axis 2.0 - XMLBeans Data Binding
| Memory: 22M/40M
+----------------------------------------
+----------------------------------------
| Gathering project list Apache Axis 2.0 - Rahas
| Memory: 22M/40M
+----------------------------------------
+----------------------------------------
| Gathering project list Apache Axis 2.0 - Security
| Memory: 22M/40M
+----------------------------------------
+----------------------------------------
| Gathering project list Apache Axis 2.0 - Samples
| Memory: 22M/40M
+----------------------------------------
+----------------------------------------
| Gathering project list Apache Axis 2.0 - spring
| Memory: 22M/40M
+----------------------------------------
+----------------------------------------
| Gathering project list Apache Axis 2.0 - Tools
| Memory: 22M/40M
+----------------------------------------
+----------------------------------------
| Gathering project list Apache Axis 2.0 - Integration
| Memory: 22M/40M
+----------------------------------------
+----------------------------------------
| Gathering project list Apache Axis 2.0 - JAXB-RI Data Binding
| Memory: 22M/40M
+----------------------------------------
+----------------------------------------
| Gathering project list Apache Axis 2.0 - SAAJ API
| Memory: 22M/40M
+----------------------------------------
+----------------------------------------
| Gathering project list Apache Axis 2.0 - JAXWS API
| Memory: 22M/40M
+----------------------------------------
+----------------------------------------
| Gathering project list Apache Axis 2.0 - SAAJ
| Memory: 22M/40M
+----------------------------------------
+----------------------------------------
| Gathering project list Apache Axis 2.0 - Metadata
| Memory: 22M/40M
+----------------------------------------
+----------------------------------------
| Gathering project list Apache Axis 2.0 - JAX-WS
| Memory: 22M/40M
+----------------------------------------
+----------------------------------------
| Gathering project list Apache Axis 2.0 - JSON
| Memory: 22M/40M
+----------------------------------------
+----------------------------------------
| Gathering project list Apache Axis 2.0 - MTOM Policy
| Memory: 22M/40M
+----------------------------------------
+----------------------------------------
| Gathering project list Apache Axis 2.0 - Savan
| Memory: 22M/40M
+----------------------------------------
+----------------------------------------
| Gathering project list Apache Axis 2.0 - soapmonitor
| Memory: 22M/40M
+----------------------------------------

multiproject:goal:
Starting the reactor...
Our processing order:
Apache Axis 2.0 - Java2WSDL
Apache Axis 2.0 - Kernel
Apache Axis 2.0 - Data Binding
Apache Axis 2.0 - Code Generation
Apache Axis 2.0 - ADB Codegen
Apache Axis 2.0 - Addressing
Apache Axis 2.0 - JiBX Data Binding
Apache Axis 2.0 - Security Policy
Apache Axis 2.0 - XMLBeans Data Binding
Apache Axis 2.0 - Rahas
Apache Axis 2.0 - Security
Apache Axis 2.0 - Samples
Apache Axis 2.0 - spring
Apache Axis 2.0 - Tools
Apache Axis 2.0 - Integration
Apache Axis 2.0 - JAXB-RI Data Binding
Apache Axis 2.0 - SAAJ API
Apache Axis 2.0 - JAXWS API
Apache Axis 2.0 - SAAJ
Apache Axis 2.0 - Metadata
Apache Axis 2.0 - JAX-WS
Apache Axis 2.0 - JSON
Apache Axis 2.0 - MTOM Policy
Apache Axis 2.0 - Savan
Apache Axis 2.0 - soapmonitor
+----------------------------------------
| Executing multiproject:install-callback Apache Axis 2.0 - Java2WSDL
| Memory: 22M/40M
+----------------------------------------
DEPRECATED: the default goal should be specified in the <build> section of project.xml instead of maven.xml
DEPRECATED: the default goal should be specified in the <build> section of project.xml instead of maven.xml
Trying to get missing/snapshot dependencies required by Apache Axis 2.0 - Java2WSDL:
Attempting to download axiom-api-SNAPSHOT.jar.
4/124K
8/124K
12/124K
16/124K
20/124K
24/124K
28/124K
28/124K
29/124K
33/124K
37/124K
41/124K
45/124K
49/124K
53/124K
57/124K
61/124K
65/124K
66/124K
70/124K
73/124K
77/124K
81/124K
85/124K
89/124K
93/124K
97/124K
101/124K
105/124K
109/124K
113/124K
117/124K
121/124K
124/124K
124K downloaded
Error retrieving artifact from [http://people.apache.org/repo/m1-snapshot-repository/]: org.apache.maven.verifier.ChecksumVerificationException: Error retrieving checksum file for /org.apache.ws.commons.axiom/jars/axiom-api-SNAPSHOT.jar
Skipping download as local copy is up to date!
Attempting to download axiom-impl-SNAPSHOT.jar.
4/108K
8/108K
12/108K
16/108K
20/108K
24/108K
28/108K
28/108K
29/108K
33/108K
36/108K
40/108K
44/108K
48/108K
51/108K
55/108K
58/108K
62/108K
65/108K
66/108K
70/108K
73/108K
75/108K
79/108K
82/108K
86/108K
90/108K
94/108K
96/108K
100/108K
103/108K
107/108K
108/108K
108K downloaded
Error retrieving artifact from [http://people.apache.org/repo/m1-snapshot-repository/]: org.apache.maven.verifier.ChecksumVerificationException: Error retrieving checksum file for /org.apache.ws.commons.axiom/jars/axiom-impl-SNAPSHOT.jar
Skipping download as local copy is up to date!
build:start:

multiproject:install-callback:
    [echo] Running jar:install for Apache Axis 2.0 - Java2WSDL
java:prepare-filesystem:
    [mkdir] Created dir: /export/home/illsleyd/continuum/continuum-1.0.3/apps/continuum/working-directory/1/modules/java2wsdl/target/classes
Running post goal: java:prepare-filesystem

java:compile:
    [echo] Compiling to /export/home/illsleyd/continuum/continuum-1.0.3/apps/continuum/working-directory/1/modules/java2wsdl/target/classes
    [javac] Compiling 22 source files to /export/home/illsleyd/continuum/continuum-1.0.3/apps/continuum/working-directory/1/modules/java2wsdl/target/classes

java:jar-resources:
Copying 2 files to /export/home/illsleyd/continuum/continuum-1.0.3/apps/continuum/working-directory/1/modules/java2wsdl/target/classes/META-INF

test:test:
    [echo] No tests to run.

jar:jar:
    [jar] Building jar: /export/home/illsleyd/continuum/continuum-1.0.3/apps/continuum/working-directory/1/modules/java2wsdl/target/axis2-java2wsdl-SNAPSHOT.jar

jar:install:
    [echo] Installing...
Uploading to org.apache.axis2/jars/axis2-java2wsdl-SNAPSHOT.jar: 
.................... (55K)
Uploading to org.apache.axis2/poms/axis2-java2wsdl-SNAPSHOT.pom: 
.................... (14K)

+----------------------------------------
| Executing multiproject:install-callback Apache Axis 2.0 - Kernel
| Memory: 22M/40M
+----------------------------------------
DEPRECATED: the default goal should be specified in the <build> section of project.xml instead of maven.xml
DEPRECATED: the default goal should be specified in the <build> section of project.xml instead of maven.xml

build:end:

Trying to get missing/snapshot dependencies required by Apache Axis 2.0 - Kernel:
Attempting to download axis2-java2wsdl-SNAPSHOT.jar.
Skipping download as local copy is up to date!
Attempting to download neethi-SNAPSHOT.jar.
4/28K
8/28K
12/28K
16/28K
20/28K
24/28K
28/28K
28/28K
28K downloaded
Error retrieving artifact from [http://people.apache.org/repo/m1-snapshot-repository/]: org.apache.maven.verifier.ChecksumVerificationException: Error retrieving checksum file for /org.apache.neethi/jars/neethi-SNAPSHOT.jar
Skipping download as local copy is up to date!
Attempting to download woden-1.0-incubating-SNAPSHOT.jar.
Skipping download as local copy is up to date!
build:start:

multiproject:install-callback:
    [echo] Running jar:install for Apache Axis 2.0 - Kernel
java:prepare-filesystem:
    [mkdir] Created dir: /export/home/illsleyd/continuum/continuum-1.0.3/apps/continuum/working-directory/1/modules/kernel/target/classes
Running post goal: java:prepare-filesystem

java:compile:
    [echo] Compiling to /export/home/illsleyd/continuum/continuum-1.0.3/apps/continuum/working-directory/1/modules/kernel/target/classes
    [javac] Compiling 273 source files to /export/home/illsleyd/continuum/continuum-1.0.3/apps/continuum/working-directory/1/modules/kernel/target/classes
    [javac] Note: Some input files use or override a deprecated API.
    [javac] Note: Recompile with -Xlint:deprecation for details.

java:jar-resources:
Copying 1 file to /export/home/illsleyd/continuum/continuum-1.0.3/apps/continuum/working-directory/1/modules/kernel/target/classes
Copying 2 files to /export/home/illsleyd/continuum/continuum-1.0.3/apps/continuum/working-directory/1/modules/kernel/target/classes
Copying 2 files to /export/home/illsleyd/continuum/continuum-1.0.3/apps/continuum/working-directory/1/modules/kernel/target/classes/META-INF

test:test:
java:prepare-filesystem:
Running post goal: java:prepare-filesystem

java:compile:
    [echo] Compiling to /export/home/illsleyd/continuum/continuum-1.0.3/apps/continuum/working-directory/1/modules/kernel/target/classes

java:jar-resources:

test:prepare-filesystem:
    [mkdir] Created dir: /export/home/illsleyd/continuum/continuum-1.0.3/apps/continuum/working-directory/1/modules/kernel/target/test-classes
    [mkdir] Created dir: /export/home/illsleyd/continuum/continuum-1.0.3/apps/continuum/working-directory/1/modules/kernel/target/test-reports

test:test-resources:
Copying 61 files to /export/home/illsleyd/continuum/continuum-1.0.3/apps/continuum/working-directory/1/modules/kernel/target/test-classes/../test-resources

test:compile:
    [javac] Compiling 91 source files to /export/home/illsleyd/continuum/continuum-1.0.3/apps/continuum/working-directory/1/modules/kernel/target/test-classes
    [javac] Note: Some input files use or override a deprecated API.
    [javac] Note: Recompile with -Xlint:deprecation for details.
Running post goal: test:compile
    [echo] the files are up to date = ${jars.uptodate}
    [mkdir] Created dir: /export/home/illsleyd/continuum/continuum-1.0.3/apps/continuum/working-directory/1/modules/kernel/test-resources/deployment/service2/build/classes
    [mkdir] Created dir: /export/home/illsleyd/continuum/continuum-1.0.3/apps/continuum/working-directory/1/modules/kernel/test-resources/deployment/service2/build/lib
    [copy] Copying 1 file to /export/home/illsleyd/continuum/continuum-1.0.3/apps/continuum/working-directory/1/modules/kernel/test-resources/deployment/service2/build/classes/META-INF
    [mkdir] Created dir: /export/home/illsleyd/continuum/continuum-1.0.3/apps/continuum/working-directory/1/modules/kernel/target/test-resources/deployment/services
    [jar] Building jar: /export/home/illsleyd/continuum/continuum-1.0.3/apps/continuum/working-directory/1/modules/kernel/target/test-resources/deployment/services/service2.jar
    [delete] Deleting directory /export/home/illsleyd/continuum/continuum-1.0.3/apps/continuum/working-directory/1/modules/kernel/test-resources/deployment/service2/build
    [echo] the files are up to date = ${jars.uptodate}
    [mkdir] Created dir: /export/home/illsleyd/continuum/continuum-1.0.3/apps/continuum/working-directory/1/modules/kernel/test-resources/deployment/echo/build/classes
    [mkdir] Created dir: /export/home/illsleyd/continuum/continuum-1.0.3/apps/continuum/working-directory/1/modules/kernel/test-resources/deployment/echo/build/lib
    [copy] Copying 1 file to /export/home/illsleyd/continuum/continuum-1.0.3/apps/continuum/working-directory/1/modules/kernel/test-resources/deployment/echo/build/classes/META-INF
    [mkdir] Created dir: /export/home/illsleyd/continuum/continuum-1.0.3/apps/continuum/working-directory/1/modules/kernel/target/echo
    [jar] Building jar: /export/home/illsleyd/continuum/continuum-1.0.3/apps/continuum/working-directory/1/modules/kernel/target/echo/echo.aar
    [delete] Deleting directory /export/home/illsleyd/continuum/continuum-1.0.3/apps/continuum/working-directory/1/modules/kernel/test-resources/deployment/echo/build
    [echo] the files are up to date = ${jars.uptodate}
    [mkdir] Created dir: /export/home/illsleyd/continuum/continuum-1.0.3/apps/continuum/working-directory/1/modules/kernel/test-resources/deployment/invalidservice/build/classes
    [mkdir] Created dir: /export/home/illsleyd/continuum/continuum-1.0.3/apps/continuum/working-directory/1/modules/kernel/test-resources/deployment/invalidservice/build/lib
    [copy] Copying 1 file to /export/home/illsleyd/continuum/continuum-1.0.3/apps/continuum/working-directory/1/modules/kernel/test-resources/deployment/invalidservice/build/classes/META-INF
    [mkdir] Created dir: /export/home/illsleyd/continuum/continuum-1.0.3/apps/continuum/working-directory/1/modules/kernel/target/test-resources/InvalidDeployment/services
    [jar] Building jar: /export/home/illsleyd/continuum/continuum-1.0.3/apps/continuum/working-directory/1/modules/kernel/target/test-resources/InvalidDeployment/services/invalidService.jar
    [delete] Deleting directory /export/home/illsleyd/continuum/continuum-1.0.3/apps/continuum/working-directory/1/modules/kernel/test-resources/deployment/invalidservice/build
    [echo] the files are up to date = ${jars.uptodate}
    [mkdir] Created dir: /export/home/illsleyd/continuum/continuum-1.0.3/apps/continuum/working-directory/1/modules/kernel/test-resources/deployment/outservice/build/classes
    [mkdir] Created dir: /export/home/illsleyd/continuum/continuum-1.0.3/apps/continuum/working-directory/1/modules/kernel/test-resources/deployment/outservice/build/lib
    [copy] Copying 1 file to /export/home/illsleyd/continuum/continuum-1.0.3/apps/continuum/working-directory/1/modules/kernel/test-resources/deployment/outservice/build/classes/META-INF
    [jar] Building jar: /export/home/illsleyd/continuum/continuum-1.0.3/apps/continuum/working-directory/1/modules/kernel/target/test-resources/deployment/services/OutService.jar
    [delete] Deleting directory /export/home/illsleyd/continuum/continuum-1.0.3/apps/continuum/working-directory/1/modules/kernel/test-resources/deployment/outservice/build
    [echo] the files are up to date = ${jars.uptodate}
    [mkdir] Created dir: /export/home/illsleyd/continuum/continuum-1.0.3/apps/continuum/working-directory/1/modules/kernel/test-resources/deployment/module1/build/classes
    [mkdir] Created dir: /export/home/illsleyd/continuum/continuum-1.0.3/apps/continuum/working-directory/1/modules/kernel/test-resources/deployment/module1/build/lib
    [copy] Copying 1 file to /export/home/illsleyd/continuum/continuum-1.0.3/apps/continuum/working-directory/1/modules/kernel/test-resources/deployment/module1/build/classes/META-INF
    [mkdir] Created dir: /export/home/illsleyd/continuum/continuum-1.0.3/apps/continuum/working-directory/1/modules/kernel/target/test-resources/deployment/modules
    [jar] Building jar: /export/home/illsleyd/continuum/continuum-1.0.3/apps/continuum/working-directory/1/modules/kernel/target/test-resources/deployment/modules/module1.mar
    [delete] Deleting directory /export/home/illsleyd/continuum/continuum-1.0.3/apps/continuum/working-directory/1/modules/kernel/test-resources/deployment/module1/build
    [echo] the files are up to date = ${jars.uptodate}
    [mkdir] Created dir: /export/home/illsleyd/continuum/continuum-1.0.3/apps/continuum/working-directory/1/modules/kernel/test-resources/deployment/serviceModule/build/classes
    [mkdir] Created dir: /export/home/illsleyd/continuum/continuum-1.0.3/apps/continuum/working-directory/1/modules/kernel/test-resources/deployment/serviceModule/build/lib
    [copy] Copying 1 file to /export/home/illsleyd/continuum/continuum-1.0.3/apps/continuum/working-directory/1/modules/kernel/test-resources/deployment/serviceModule/build/classes/META-INF
    [mkdir] Created dir: /export/home/illsleyd/continuum/continuum-1.0.3/apps/continuum/working-directory/1/modules/kernel/target/test-resources/InvalidDeployment/modules
    [jar] Building jar: /export/home/illsleyd/continuum/continuum-1.0.3/apps/continuum/working-directory/1/modules/kernel/target/test-resources/InvalidDeployment/modules/serviceModule.jar
    [delete] Deleting directory /export/home/illsleyd/continuum/continuum-1.0.3/apps/continuum/working-directory/1/modules/kernel/test-resources/deployment/serviceModule/build
    [mkdir] Created dir: /export/home/illsleyd/continuum/continuum-1.0.3/apps/continuum/working-directory/1/modules/kernel/target/test-resources/java2sec/more
    [mkdir] Created dir: /export/home/illsleyd/continuum/continuum-1.0.3/apps/continuum/working-directory/1/modules/kernel/target/test-resources/java2sec/less
    [jar] Building jar: /export/home/illsleyd/continuum/continuum-1.0.3/apps/continuum/working-directory/1/modules/kernel/target/test-resources/java2sec/more/MorePermission.jar
    [delete] Deleting directory /export/home/illsleyd/continuum/continuum-1.0.3/apps/continuum/working-directory/1/modules/kernel/target/test-classes/org/apache/axis2/java/security/driver
    [delete] Deleting directory /export/home/illsleyd/continuum/continuum-1.0.3/apps/continuum/working-directory/1/modules/kernel/target/test-classes/org/apache/axis2/java/security/more
    [delete] Deleting directory /export/home/illsleyd/continuum/continuum-1.0.3/apps/continuum/working-directory/1/modules/kernel/target/test-classes/org/apache/axis2/java/security/action
    [delete] Deleting directory /export/home/illsleyd/continuum/continuum-1.0.3/apps/continuum/working-directory/1/modules/kernel/target/test-classes/org/apache/axis2/java/security/interf
    [jar] Building jar: /export/home/illsleyd/continuum/continuum-1.0.3/apps/continuum/working-directory/1/modules/kernel/target/test-resources/java2sec/less/LessPermission.jar
    [delete] Deleting directory /export/home/illsleyd/continuum/continuum-1.0.3/apps/continuum/working-directory/1/modules/kernel/target/test-classes/org/apache/axis2/java/security/less

    [junit] Running org.apache.axis2.addressing.AddressingHelperTest
    [junit] Tests run: 6, Failures: 0, Errors: 0, Time elapsed: 0.833 sec
    [junit] Running org.apache.axis2.addressing.EndpointReferenceHelperTest
    [junit] Tests run: 2, Failures: 0, Errors: 0, Time elapsed: 0.328 sec
    [junit] Running org.apache.axis2.addressing.EndpointReferenceTypeTest
    [junit] Tests run: 4, Failures: 0, Errors: 0, Time elapsed: 0.291 sec
    [junit] Running org.apache.axis2.addressing.miheaders.RelatesToTest
    [junit] Tests run: 3, Failures: 0, Errors: 0, Time elapsed: 0.289 sec
    [junit] Running org.apache.axis2.addressing.wsdl.WSDL11ActionHelperTest
    [junit] Tests run: 8, Failures: 0, Errors: 0, Time elapsed: 0.613 sec
    [junit] Running org.apache.axis2.context.ContextHierarchyTest
    [junit] Tests run: 2, Failures: 0, Errors: 0, Time elapsed: 0.658 sec
    [junit] Running org.apache.axis2.context.OperationContextTest
    [junit] Tests run: 1, Failures: 0, Errors: 0, Time elapsed: 0.575 sec
    [junit] Running org.apache.axis2.deployment.AddingObserverTest
    [junit] Tests run: 1, Failures: 0, Errors: 0, Time elapsed: 0.632 sec
    [junit] Running org.apache.axis2.deployment.AxisMessageTest
    [junit] Tests run: 1, Failures: 0, Errors: 0, Time elapsed: 1.11 sec
    [junit] Running org.apache.axis2.deployment.BadModuleTest
    [junit] Tests run: 1, Failures: 0, Errors: 0, Time elapsed: 0.634 sec
    [junit] Running org.apache.axis2.deployment.BuildERWithDeploymentTest
    [junit] Tests run: 1, Failures: 0, Errors: 0, Time elapsed: 1.09 sec
    [junit] Running org.apache.axis2.deployment.BuilderSelectorDeploymentTest
    [junit] Tests run: 2, Failures: 0, Errors: 0, Time elapsed: 0.892 sec
    [junit] Running org.apache.axis2.deployment.DeploymentTotalTest
    [junit] Tests run: 1, Failures: 0, Errors: 0, Time elapsed: 0.998 sec
    [junit] Running org.apache.axis2.deployment.MessageFormatterDeploymentTest
    [junit] Tests run: 2, Failures: 0, Errors: 0, Time elapsed: 1.029 sec
    [junit] Running org.apache.axis2.deployment.ModifiedConfigFileTest
    [junit] Tests run: 1, Failures: 0, Errors: 0, Time elapsed: 0.536 sec
    [junit] Running org.apache.axis2.deployment.ModuleDisengagementTest
    [junit] Tests run: 7, Failures: 0, Errors: 0, Time elapsed: 1.085 sec
    [junit] Running org.apache.axis2.deployment.ModuleversionTest
    [junit] Tests run: 2, Failures: 0, Errors: 0, Time elapsed: 0.784 sec
    [junit] Running org.apache.axis2.deployment.OperationExcludeTest
    [junit] Tests run: 1, Failures: 0, Errors: 0, Time elapsed: 1.061 sec
    [junit] Running org.apache.axis2.deployment.SameServiceAddingTest
    [junit] Tests run: 1, Failures: 0, Errors: 0, Time elapsed: 0.599 sec
    [junit] Running org.apache.axis2.deployment.ServiceGroupTest
    [junit] Tests run: 1, Failures: 0, Errors: 0, Time elapsed: 1.202 sec
    [junit] Running org.apache.axis2.deployment.SystemPhasesremovedTest
    [junit] Tests run: 1, Failures: 0, Errors: 0, Time elapsed: 0.536 sec
    [junit] Running org.apache.axis2.deployment.TransportDeploymentTest
    [junit] Tests run: 1, Failures: 0, Errors: 0, Time elapsed: 0.881 sec
    [junit] Running org.apache.axis2.description.RegistryTest
    [junit] Tests run: 5, Failures: 0, Errors: 0, Time elapsed: 0.514 sec
    [junit] Running org.apache.axis2.description.WSDLToAllServicesBuilderTest
    [junit] Tests run: 2, Failures: 0, Errors: 0, Time elapsed: 3.699 sec
    [junit] Running org.apache.axis2.dispatchers.ActionBasedOperationDispatchTest
    [junit] Tests run: 1, Failures: 0, Errors: 0, Time elapsed: 0.661 sec
    [junit] Running org.apache.axis2.dispatchers.RelatesToBasedOperationDispatcherTest
    [junit] Tests run: 1, Failures: 0, Errors: 0, Time elapsed: 0.617 sec
    [junit] Running org.apache.axis2.dispatchers.RelatesToBasedServiceDispatcherTest
    [junit] Tests run: 1, Failures: 0, Errors: 0, Time elapsed: 0.619 sec
    [junit] Running org.apache.axis2.dispatchers.RequestURIBasedOperationDispatcherTest
    [junit] Tests run: 1, Failures: 0, Errors: 0, Time elapsed: 0.69 sec
    [junit] Running org.apache.axis2.dispatchers.RequestURIBasedServiceDispatcherTest
    [junit] Tests run: 1, Failures: 0, Errors: 0, Time elapsed: 0.652 sec
    [junit] Running org.apache.axis2.dispatchers.SOAPMessageBodyBasedOperationDispatcherTest
    [junit] Tests run: 1, Failures: 0, Errors: 0, Time elapsed: 0.701 sec
    [junit] Running org.apache.axis2.dispatchers.SOAPMessageBodyBasedServiceDispatcherTest
    [junit] Tests run: 1, Failures: 0, Errors: 0, Time elapsed: 0.693 sec
    [junit] Running org.apache.axis2.engine.EnginePausingTest
    [junit] Tests run: 1, Failures: 0, Errors: 0, Time elapsed: 0.635 sec
    [junit] Running org.apache.axis2.engine.MessageContextChangeTest
    [junit] Tests run: 1, Failures: 0, Errors: 0, Time elapsed: 0.571 sec
    [junit] Running org.apache.axis2.engine.MessageContextSaveATest
    [junit] Tests run: 4, Failures: 0, Errors: 0, Time elapsed: 0.649 sec
    [junit] Running org.apache.axis2.engine.MessageContextSaveBTest
    [junit] Tests run: 1, Failures: 0, Errors: 0, Time elapsed: 0.488 sec
    [junit] Running org.apache.axis2.engine.MessageContextSaveCTest
    [junit] Tests run: 2, Failures: 0, Errors: 0, Time elapsed: 0.851 sec
    [junit] Running org.apache.axis2.engine.MessageContextSelfManagedDataTest
    [junit] Tests run: 10, Failures: 0, Errors: 0, Time elapsed: 1.499 sec
    [junit] Running org.apache.axis2.engine.MessageContextTest
    [junit] Tests run: 1, Failures: 0, Errors: 0, Time elapsed: 0.707 sec
    [junit] Running org.apache.axis2.engine.ModuleConfigTest
    [junit] Tests run: 2, Failures: 0, Errors: 0, Time elapsed: 0.858 sec
    [junit] Running org.apache.axis2.engine.ModuleEngageTest
    [junit] Tests run: 1, Failures: 0, Errors: 0, Time elapsed: 1.095 sec
    [junit] Running org.apache.axis2.engine.ObjectSaveTest
    [junit] Tests run: 5, Failures: 0, Errors: 0, Time elapsed: 0.642 sec
    [junit] Running org.apache.axis2.engine.OperationContextSaveTest
    [junit] Tests run: 1, Failures: 0, Errors: 0, Time elapsed: 0.625 sec
    [junit] Running org.apache.axis2.engine.OptionsSaveTest
    [junit] Tests run: 1, Failures: 0, Errors: 0, Time elapsed: 0.345 sec
    [junit] Running org.apache.axis2.engine.ParameterAddTest
    [junit] Tests run: 4, Failures: 0, Errors: 0, Time elapsed: 0.554 sec
    [junit] Running org.apache.axis2.java.security.driver.Java2SecTest
    [junit] Tests run: 9, Failures: 0, Errors: 0, Time elapsed: 0.67 sec
    [junit] Running org.apache.axis2.misc.MiscTest
    [junit] Tests run: 1, Failures: 0, Errors: 0, Time elapsed: 0.262 sec
    [junit] Running org.apache.axis2.phaserule.AddingHandlerToEachPhaseTest
    [junit] Tests run: 3, Failures: 0, Errors: 0, Time elapsed: 0.292 sec
    [junit] Running org.apache.axis2.phaserule.BeforeAfterTest
    [junit] Tests run: 1, Failures: 0, Errors: 0, Time elapsed: 0.279 sec
    [junit] Running org.apache.axis2.phaserule.BeforeTest
    [junit] Tests run: 1, Failures: 0, Errors: 0, Time elapsed: 0.633 sec
    [junit] Running org.apache.axis2.phaserule.BeforeWithNoFirstHandlerTest
    [junit] Tests run: 1, Failures: 0, Errors: 0, Time elapsed: 0.698 sec
    [junit] Running org.apache.axis2.phaserule.InvalidPhaseFirstRulesTest
    [junit] Tests run: 1, Failures: 0, Errors: 0, Time elapsed: 0.619 sec
    [junit] Running org.apache.axis2.phaserule.InvalidPhaseFirstTest
    [junit] Tests run: 1, Failures: 0, Errors: 0, Time elapsed: 0.611 sec
    [junit] Running org.apache.axis2.phaserule.InvalidPhaseLastRuleTest
    [junit] Tests run: 1, Failures: 0, Errors: 0, Time elapsed: 0.59 sec
    [junit] Running org.apache.axis2.phaserule.InvalidPhaseRuleTest
    [junit] Tests run: 2, Failures: 0, Errors: 0, Time elapsed: 0.308 sec
    [junit] Running org.apache.axis2.phaserule.InvalidPhaselastTest
    [junit] Tests run: 1, Failures: 0, Errors: 0, Time elapsed: 0.625 sec
    [junit] Running org.apache.axis2.phaserule.PhaseFirstTest
    [junit] Tests run: 1, Failures: 0, Errors: 0, Time elapsed: 0.341 sec
    [junit] Running org.apache.axis2.phaserule.PhaseLastTest
    [junit] Tests run: 1, Failures: 0, Errors: 0, Time elapsed: 0.283 sec
    [junit] Running org.apache.axis2.phaserule.PhaseRuleTest
    [junit] Tests run: 1, Failures: 0, Errors: 0, Time elapsed: 0.296 sec
    [junit] Running org.apache.axis2.phaserule.PreDispatchPhaseRuleTest
    [junit] Tests run: 1, Failures: 0, Errors: 0, Time elapsed: 0.286 sec
    [junit] Running org.apache.axis2.phaserule.SingleHandlerPhaseTest
    [junit] Tests run: 1, Failures: 0, Errors: 0, Time elapsed: 0.608 sec
    [junit] Running org.apache.axis2.transport.tcp.TCPTransportTest
    [junit] Tests run: 1, Failures: 0, Errors: 0, Time elapsed: 0.237 sec
    [junit] Running org.apache.axis2.util.ThreadContextMigratorTest
    [junit] Tests run: 2, Failures: 0, Errors: 0, Time elapsed: 0.604 sec

jar:jar:
    [copy] Copying 1 file to /export/home/illsleyd/continuum/continuum-1.0.3/apps/continuum/working-directory/1/modules/kernel/target/classes/org/apache/axis2/i18n
    [jar] Building jar: /export/home/illsleyd/continuum/continuum-1.0.3/apps/continuum/working-directory/1/modules/kernel/target/axis2-kernel-SNAPSHOT.jar

jar:install:
    [echo] Installing...
Uploading to org.apache.axis2/jars/axis2-kernel-SNAPSHOT.jar: 
.................... (766K)
Uploading to org.apache.axis2/poms/axis2-kernel-SNAPSHOT.pom: 
.................... (15K)

+----------------------------------------
| Executing multiproject:install-callback Apache Axis 2.0 - Data Binding
| Memory: 18M/34M
+----------------------------------------
DEPRECATED: the default goal should be specified in the <build> section of project.xml instead of maven.xml
DEPRECATED: the default goal should be specified in the <build> section of project.xml instead of maven.xml

build:end:

Trying to get missing/snapshot dependencies required by Apache Axis 2.0 - Data Binding:
Attempting to download axiom-dom-SNAPSHOT.jar.
4/130K
8/130K
12/130K
16/130K
20/130K
24/130K
28/130K
28/130K
29/130K
33/130K
36/130K
40/130K
43/130K
47/130K
51/130K
55/130K
58/130K
62/130K
65/130K
66/130K
70/130K
74/130K
78/130K
80/130K
84/130K
88/130K
92/130K
95/130K
99/130K
102/130K
106/130K
109/130K
113/130K
116/130K
120/130K
123/130K
127/130K
130/130K
130K downloaded
Error retrieving artifact from [http://people.apache.org/repo/m1-snapshot-repository/]: org.apache.maven.verifier.ChecksumVerificationException: Error retrieving checksum file for /org.apache.ws.commons.axiom/jars/axiom-dom-SNAPSHOT.jar
Skipping download as local copy is up to date!
Attempting to download axis2-kernel-SNAPSHOT.jar.
Skipping download as local copy is up to date!
build:start:

multiproject:install-callback:
    [echo] Running jar:install for Apache Axis 2.0 - Data Binding
java:prepare-filesystem:
    [mkdir] Created dir: /export/home/illsleyd/continuum/continuum-1.0.3/apps/continuum/working-directory/1/modules/adb/target/classes
Running post goal: java:prepare-filesystem

java:compile:
    [echo] Compiling to /export/home/illsleyd/continuum/continuum-1.0.3/apps/continuum/working-directory/1/modules/adb/target/classes
    [javac] Compiling 61 source files to /export/home/illsleyd/continuum/continuum-1.0.3/apps/continuum/working-directory/1/modules/adb/target/classes

java:jar-resources:
Copying 1 file to /export/home/illsleyd/continuum/continuum-1.0.3/apps/continuum/working-directory/1/modules/adb/target/classes
Copying 2 files to /export/home/illsleyd/continuum/continuum-1.0.3/apps/continuum/working-directory/1/modules/adb/target/classes/META-INF

test:test:
java:prepare-filesystem:
Running post goal: java:prepare-filesystem

java:compile:
    [echo] Compiling to /export/home/illsleyd/continuum/continuum-1.0.3/apps/continuum/working-directory/1/modules/adb/target/classes

java:jar-resources:

test:prepare-filesystem:
    [mkdir] Created dir: /export/home/illsleyd/continuum/continuum-1.0.3/apps/continuum/working-directory/1/modules/adb/target/test-classes
    [mkdir] Created dir: /export/home/illsleyd/continuum/continuum-1.0.3/apps/continuum/working-directory/1/modules/adb/target/test-reports

test:test-resources:
Copying 1 file to /export/home/illsleyd/continuum/continuum-1.0.3/apps/continuum/working-directory/1/modules/adb/target/test-classes
Copying 1 file to /export/home/illsleyd/continuum/continuum-1.0.3/apps/continuum/working-directory/1/modules/adb/target/test-classes

test:compile:
    [javac] Compiling 9 source files to /export/home/illsleyd/continuum/continuum-1.0.3/apps/continuum/working-directory/1/modules/adb/target/test-classes

    [junit] Running org.apache.axis2.databinding.ADBSOAPModelBuilderTest
    [junit] Tests run: 5, Failures: 0, Errors: 0, Time elapsed: 0.618 sec
    [junit] Running org.apache.axis2.databinding.utils.NamedStaxOMBuilderTest
    [junit] Tests run: 2, Failures: 0, Errors: 0, Time elapsed: 0.507 sec
    [junit] Running org.apache.axis2.databinding.utils.SimpleArrayReaderStateMachineTest
    [junit] Tests run: 4, Failures: 0, Errors: 0, Time elapsed: 0.762 sec
    [junit] Running org.apache.axis2.databinding.utils.SimpleElementReaderStateMachineTest
    [junit] Tests run: 3, Failures: 0, Errors: 0, Time elapsed: 0.436 sec
    [junit] Running org.apache.axis2.databinding.utils.reader.ADBXMLStreamReaderTest
    [junit] Tests run: 15, Failures: 0, Errors: 0, Time elapsed: 1.046 sec

jar:jar:
    [jar] Building jar: /export/home/illsleyd/continuum/continuum-1.0.3/apps/continuum/working-directory/1/modules/adb/target/axis2-adb-SNAPSHOT.jar

jar:install:
    [echo] Installing...
Uploading to org.apache.axis2/jars/axis2-adb-SNAPSHOT.jar: 
.................... (135K)
Uploading to org.apache.axis2/poms/axis2-adb-SNAPSHOT.pom: 
.................... (14K)

+----------------------------------------
| Executing multiproject:install-callback Apache Axis 2.0 - Code Generation
| Memory: 14M/32M
+----------------------------------------
DEPRECATED: the default goal should be specified in the <build> section of project.xml instead of maven.xml
DEPRECATED: the default goal should be specified in the <build> section of project.xml instead of maven.xml

build:end:

Trying to get missing/snapshot dependencies required by Apache Axis 2.0 - Code Generation:
Attempting to download axis2-adb-SNAPSHOT.jar.
Skipping download as local copy is up to date!
build:start:

multiproject:install-callback:
    [echo] Running jar:install for Apache Axis 2.0 - Code Generation
java:prepare-filesystem:
    [mkdir] Created dir: /export/home/illsleyd/continuum/continuum-1.0.3/apps/continuum/working-directory/1/modules/codegen/target/classes
Running post goal: java:prepare-filesystem

java:compile:
    [echo] Compiling to /export/home/illsleyd/continuum/continuum-1.0.3/apps/continuum/working-directory/1/modules/codegen/target/classes
    [javac] Compiling 69 source files to /export/home/illsleyd/continuum/continuum-1.0.3/apps/continuum/working-directory/1/modules/codegen/target/classes

java:jar-resources:
Copying 33 files to /export/home/illsleyd/continuum/continuum-1.0.3/apps/continuum/working-directory/1/modules/codegen/target/classes
Copying 2 files to /export/home/illsleyd/continuum/continuum-1.0.3/apps/continuum/working-directory/1/modules/codegen/target/classes/META-INF
Running post goal: java:jar-resources

test:test:
java:prepare-filesystem:
Running post goal: java:prepare-filesystem

java:compile:
    [echo] Compiling to /export/home/illsleyd/continuum/continuum-1.0.3/apps/continuum/working-directory/1/modules/codegen/target/classes

java:jar-resources:
Running post goal: java:jar-resources

test:prepare-filesystem:
    [mkdir] Created dir: /export/home/illsleyd/continuum/continuum-1.0.3/apps/continuum/working-directory/1/modules/codegen/target/test-classes
    [mkdir] Created dir: /export/home/illsleyd/continuum/continuum-1.0.3/apps/continuum/working-directory/1/modules/codegen/target/test-reports

test:test-resources:
Copying 6 files to /export/home/illsleyd/continuum/continuum-1.0.3/apps/continuum/working-directory/1/modules/codegen/target/test-classes
Copying 31 files to /export/home/illsleyd/continuum/continuum-1.0.3/apps/continuum/working-directory/1/modules/codegen/target/test-classes

test:compile:
    [javac] Compiling 2 source files to /export/home/illsleyd/continuum/continuum-1.0.3/apps/continuum/working-directory/1/modules/codegen/target/test-classes

    [junit] Running org.apache.axis2.wsdl.WSDLServiceBuilderTest
    [junit] Tests run: 1, Failures: 0, Errors: 0, Time elapsed: 4.125 sec
    [junit] Running org.apache.axis2.wsdl.codegen.extension.SchemaUnwrapperExtensionTest
    [junit] Tests run: 4, Failures: 0, Errors: 0, Time elapsed: 0.791 sec

jar:jar:
    [jar] Building jar: /export/home/illsleyd/continuum/continuum-1.0.3/apps/continuum/working-directory/1/modules/codegen/target/axis2-codegen-SNAPSHOT.jar

jar:install:
    [echo] Installing...
Uploading to org.apache.axis2/jars/axis2-codegen-SNAPSHOT.jar: 
.................... (174K)
Uploading to org.apache.axis2/poms/axis2-codegen-SNAPSHOT.pom: 
.................... (17K)

+----------------------------------------
| Executing multiproject:install-callback Apache Axis 2.0 - ADB Codegen
| Memory: 26M/30M
+----------------------------------------
DEPRECATED: the default goal should be specified in the <build> section of project.xml instead of maven.xml
DEPRECATED: the default goal should be specified in the <build> section of project.xml instead of maven.xml

build:end:

Trying to get missing/snapshot dependencies required by Apache Axis 2.0 - ADB Codegen:
Attempting to download axis2-codegen-SNAPSHOT.jar.
Skipping download as local copy is up to date!
build:start:

multiproject:install-callback:
    [echo] Running jar:install for Apache Axis 2.0 - ADB Codegen
java:prepare-filesystem:
    [mkdir] Created dir: /export/home/illsleyd/continuum/continuum-1.0.3/apps/continuum/working-directory/1/modules/adb-codegen/target/classes
Running post goal: java:prepare-filesystem

java:compile:
    [echo] Compiling to /export/home/illsleyd/continuum/continuum-1.0.3/apps/continuum/working-directory/1/modules/adb-codegen/target/classes
    [javac] Compiling 16 source files to /export/home/illsleyd/continuum/continuum-1.0.3/apps/continuum/working-directory/1/modules/adb-codegen/target/classes

java:jar-resources:
Copying 8 files to /export/home/illsleyd/continuum/continuum-1.0.3/apps/continuum/working-directory/1/modules/adb-codegen/target/classes
Copying 2 files to /export/home/illsleyd/continuum/continuum-1.0.3/apps/continuum/working-directory/1/modules/adb-codegen/target/classes/META-INF

test:test:
java:prepare-filesystem:
Running post goal: java:prepare-filesystem

java:compile:
    [echo] Compiling to /export/home/illsleyd/continuum/continuum-1.0.3/apps/continuum/working-directory/1/modules/adb-codegen/target/classes

java:jar-resources:

test:prepare-filesystem:
    [mkdir] Created dir: /export/home/illsleyd/continuum/continuum-1.0.3/apps/continuum/working-directory/1/modules/adb-codegen/target/test-classes
    [mkdir] Created dir: /export/home/illsleyd/continuum/continuum-1.0.3/apps/continuum/working-directory/1/modules/adb-codegen/target/test-reports

test:test-resources:
Copying 28 files to /export/home/illsleyd/continuum/continuum-1.0.3/apps/continuum/working-directory/1/modules/adb-codegen/target/test-classes
Copying 8 files to /export/home/illsleyd/continuum/continuum-1.0.3/apps/continuum/working-directory/1/modules/adb-codegen/target/test-classes

test:compile:
    [mkdir] Created dir: /export/home/illsleyd/continuum/continuum-1.0.3/apps/continuum/working-directory/1/modules/adb-codegen/target/schema
    [mkdir] Created dir: /export/home/illsleyd/continuum/continuum-1.0.3/apps/continuum/working-directory/1/modules/adb-codegen/target/schema/src
    [mkdir] Created dir: /export/home/illsleyd/continuum/continuum-1.0.3/apps/continuum/working-directory/1/modules/adb-codegen/target/schema/classes
    [echo] Compiling simple_maxOccurs2.xsd
    [echo] Compiling anonymous_complexType.xsd
    [echo] Compiling simple_choice.xsd
    [echo] Compiling simple_particle_all.xsd
    [echo] Compiling simple_maxOccurs.xsd
    [echo] Compiling simple_anytype.xsd
    [echo] Compiling simple-minoccurs0.xsd
    [echo] Compiling complex-minoccurs0.xsd
    [echo] Compiling simple-recursive-datatypes.xsd
    [echo] Compiling mixed_minoccus0.xsd
    [echo] Compiling complete.xsd
    [javac] Compiling 121 source files to /export/home/illsleyd/continuum/continuum-1.0.3/apps/continuum/working-directory/1/modules/adb-codegen/target/schema/classes
    [javac] /export/home/illsleyd/continuum/continuum-1.0.3/apps/continuum/working-directory/1/modules/adb-codegen/target/schema/src/org/recursion/ExtensionMapper.java:25: cannot find symbol
    [javac] symbol  : class TypeEHelper
    [javac] location: package org.recursion
    [javac]                             return  org.recursion.TypeEHelper.parse(reader);
    [javac]                                                  ^
    [javac] /export/home/illsleyd/continuum/continuum-1.0.3/apps/continuum/working-directory/1/modules/adb-codegen/target/schema/src/org/recursion1/ExtensionMapper.java:25: cannot find symbol
    [javac] symbol  : class StringListHelper
    [javac] location: package org.recursion1
    [javac]                             return  org.recursion1.StringListHelper.parse(reader);
    [javac]                                                   ^
    [javac] /export/home/illsleyd/continuum/continuum-1.0.3/apps/continuum/working-directory/1/modules/adb-codegen/target/schema/src/org/recursion1/ExtensionMapper.java:35: cannot find symbol
    [javac] symbol  : class ExceptionTypeHelper
    [javac] location: package org.recursion1
    [javac]                             return  org.recursion1.ExceptionTypeHelper.parse(reader);
    [javac]                                                   ^
    [javac] /export/home/illsleyd/continuum/continuum-1.0.3/apps/continuum/working-directory/1/modules/adb-codegen/target/schema/src/org/recursion1/ExtensionMapper.java:45: cannot find symbol
    [javac] symbol  : class StringListResponseTypeHelper
    [javac] location: package org.recursion1
    [javac]                             return  org.recursion1.StringListResponseTypeHelper.parse(reader);
    [javac]                                                   ^
    [javac] /export/home/illsleyd/continuum/continuum-1.0.3/apps/continuum/working-directory/1/modules/adb-codegen/target/schema/src/org/soapinterop/types/ExtensionMapper.java:25: cannot find symbol
    [javac] symbol  : class SimpleParticleAllStructHelper
    [javac] location: package org.soapinterop.types
    [javac]                             return  org.soapinterop.types.SimpleParticleAllStructHelper.parse(reader);
    [javac]                                                          ^
    [javac] /export/home/illsleyd/continuum/continuum-1.0.3/apps/continuum/working-directory/1/modules/adb-codegen/target/schema/src/org/test1/ExtensionMapper.java:25: cannot find symbol
    [javac] symbol  : class AddressTypeHelper
    [javac] location: package org.test1
    [javac]                             return  org.test1.AddressTypeHelper.parse(reader);
    [javac]                                              ^
    [javac] /export/home/illsleyd/continuum/continuum-1.0.3/apps/continuum/working-directory/1/modules/adb-codegen/target/schema/src/org/test1/ExtensionMapper.java:35: cannot find symbol
    [javac] symbol  : class PersonTypeHelper
    [javac] location: package org.test1
    [javac]                             return  org.test1.PersonTypeHelper.parse(reader);
    [javac]                                              ^
    [javac] /export/home/illsleyd/continuum/continuum-1.0.3/apps/continuum/working-directory/1/modules/adb-codegen/target/schema/src/org2/soapinterop/xsd/ExtensionMapper.java:25: cannot find symbol
    [javac] symbol  : class SOAPStructHelper
    [javac] location: package org2.soapinterop.xsd
    [javac]                             return  org2.soapinterop.xsd.SOAPStructHelper.parse(reader);
    [javac]                                                         ^
    [javac] /export/home/illsleyd/continuum/continuum-1.0.3/apps/continuum/working-directory/1/modules/adb-codegen/target/schema/src/services/echo/types/ExtensionMapper.java:25: cannot find symbol
    [javac] symbol  : class BookInformationHelper
    [javac] location: package services.echo.types
    [javac]                             return  services.echo.types.BookInformationHelper.parse(reader);
    [javac]                                                        ^
    [javac] Note: Some input files use unchecked or unsafe operations.
    [javac] Note: Recompile with -Xlint:unchecked for details.
    [javac] 9 errors

BUILD FAILED
File...... file:/export/home/illsleyd/.maven/cache/maven-multiproject-plugin-1.5-SNAPSHOT/plugin.jelly
Element... maven:reactor
Line...... 227
Column.... 64
Unable to obtain goal [multiproject:install-callback] -- file:/export/home/illsleyd/continuum/continuum-1.0.3/apps/continuum/working-directory/1/modules/adb-codegen/maven.xml:160:95: <javac> Compile failed; see the compiler error output for details.
Total time   : 6 minutes 23 seconds 
Finished at  : Friday, January 26, 2007 2:12:06 AM GMT+00:00


****************************************************************************



---------------------------------------------------------------------
To unsubscribe, e-mail: axis-dev-unsubscribe@ws.apache.org
For additional commands, e-mail: axis-dev-help@ws.apache.org


Mime
View raw message