axis-java-dev mailing list archives

Site index · List index
Message view « Date » · « Thread »
Top « Date » · « Thread »
From "Rich Scheuerle (JIRA)" <j...@apache.org>
Subject [jira] Resolved: (AXIS2-1722) JAXWSTest 4 failures with merged of 1.1 branch back into trunk
Date Thu, 16 Nov 2006 21:22:37 GMT
     [ http://issues.apache.org/jira/browse/AXIS2-1722?page=all ]

Rich Scheuerle resolved AXIS2-1722.
-----------------------------------

    Resolution: Fixed

Changed in rev 475930

I fixed the problem using the <excludeOperations> tag to exclude the invoke operations
on the two failing WebServiceProvider services.  This fixed the four tests.

> JAXWSTest 4 failures with merged of 1.1 branch back into trunk
> --------------------------------------------------------------
>
>                 Key: AXIS2-1722
>                 URL: http://issues.apache.org/jira/browse/AXIS2-1722
>             Project: Apache Axis 2.0 (Axis2)
>          Issue Type: Bug
>          Components: jaxws
>            Reporter: Jeff Barrett
>         Assigned To: Rich Scheuerle
>
> With the merge of the Axis2 1.1 branch back to trunk, JAXWSTest has 4 failures:
> test:test:
>     [junit] Running org.apache.axis2.jaxws.framework.JAXWSTest
>     [junit] Tests run: 243, Failures: 0, Errors: 4, Time elapsed: 42.821 sec
>     [junit] [ERROR] Test org.apache.axis2.jaxws.framework.JAXWSTest FAILED
>     [junit] Running org.apache.axis2.jaxws.jaxb.wrapper.WrapperToolTest
>     [junit] Tests run: 4, Failures: 0, Errors: 0, Time elapsed: 0.32 sec
> From STDERR in modules/jaxws/target/test-reports/TEST-org.apache.axis2.jaxws.framework.JAXWSTest.txt:
> ------------- Standard Error -----------------
> log4j:WARN No appenders could be found for logger (org.apache.axiom.om.util.StAXUtils).
> log4j:WARN Please initialize the log4j system properly.
> org.apache.axis2.deployment.DeploymentException: Processing Operations Modules Error
in schema generating  Sorry we don't support methods overloading !!!! ; nested exception is:

> 	java.lang.Exception:  Sorry we don't support methods overloading !!!! ; nested exception
is: 
> 	org.apache.axis2.deployment.DeploymentException: Error in schema generating  Sorry we
don't support methods overloading !!!! ; nested exception is: 
> 	java.lang.Exception:  Sorry we don't support methods overloading !!!! ; nested exception
is: 
> 	org.apache.axis2.deployment.DeploymentException: Processing Operations Modules Error
in schema generating  Sorry we don't support methods overloading !!!! ; nested exception is:

> 	java.lang.Exception:  Sorry we don't support methods overloading !!!! ; nested exception
is: 
> 	org.apache.axis2.deployment.DeploymentException: Error in schema generating  Sorry we
don't support methods overloading !!!! ; nested exception is: 
> 	java.lang.Exception:  Sorry we don't support methods overloading !!!! 
> 	at org.apache.axis2.deployment.ServiceGroupBuilder.populateServiceGroup(ServiceGroupBuilder.java:101)
> 	at org.apache.axis2.deployment.repository.util.ArchiveReader.buildServiceGroup(ArchiveReader.java:99)
> 	at org.apache.axis2.deployment.repository.util.ArchiveReader.processServiceGroup(ArchiveReader.java:167)
> 	at org.apache.axis2.deployment.DeploymentEngine.doDeploy(DeploymentEngine.java:528)
> 	at org.apache.axis2.deployment.repository.util.WSInfoList.update(WSInfoList.java:196)
> 	at org.apache.axis2.deployment.RepositoryListener.update(RepositoryListener.java:227)
> 	at org.apache.axis2.deployment.RepositoryListener.checkServices(RepositoryListener.java:174)
> 	at org.apache.axis2.deployment.DeploymentEngine.loadServices(DeploymentEngine.java:88)
> 	at org.apache.axis2.deployment.FileSystemConfigurator.loadServices(FileSystemConfigurator.java:129)
> 	at org.apache.axis2.context.ConfigurationContextFactory.createConfigurationContext(ConfigurationContextFactory.java:72)
> 	at org.apache.axis2.context.ConfigurationContextFactory.createConfigurationContextFromFileSystem(ConfigurationContextFactory.java:180)
> 	at org.apache.axis2.jaxws.util.SimpleServer.init(SimpleServer.java:41)
> 	at org.apache.axis2.jaxws.util.SimpleServer.start(SimpleServer.java:51)
> 	at org.apache.axis2.jaxws.framework.StartServer.testStartServer(StartServer.java:31)
> 	at org.apache.axis2.jaxws.framework.JAXWSTest$1.setUp(JAXWSTest.java:143)
> 	at junit.extensions.TestSetup$1.protect(TestSetup.java:20)
> 	at junit.framework.TestResult.runProtected(TestResult.java:124)
> 	at junit.extensions.TestSetup.run(TestSetup.java:25)
> 	at org.apache.tools.ant.taskdefs.optional.junit.JUnitTestRunner.run(JUnitTestRunner.java:297)
> 	at org.apache.tools.ant.taskdefs.optional.junit.JUnitTestRunner.launch(JUnitTestRunner.java:672)
> 	at org.apache.tools.ant.taskdefs.optional.junit.JUnitTestRunner.main(JUnitTestRunner.java:567)
> Caused by: org.apache.axis2.deployment.DeploymentException: Processing Operations Modules
Error in schema generating  Sorry we don't support methods overloading !!!! ; nested exception
is: 
> 	java.lang.Exception:  Sorry we don't support methods overloading !!!! ; nested exception
is: 
> 	org.apache.axis2.deployment.DeploymentException: Error in schema generating  Sorry we
don't support methods overloading !!!! ; nested exception is: 
> 	java.lang.Exception:  Sorry we don't support methods overloading !!!! 
> 	at org.apache.axis2.deployment.ServiceBuilder.populateService(ServiceBuilder.java:329)
> 	at org.apache.axis2.deployment.ServiceGroupBuilder.populateServiceGroup(ServiceGroupBuilder.java:96)
> 	... 20 more
> Caused by: org.apache.axis2.deployment.DeploymentException: Error in schema generating
 Sorry we don't support methods overloading !!!! ; nested exception is: 
> 	java.lang.Exception:  Sorry we don't support methods overloading !!!! 
> 	at org.apache.axis2.deployment.ServiceBuilder.populateService(ServiceBuilder.java:304)
> 	... 21 more
> Caused by: java.lang.Exception:  Sorry we don't support methods overloading !!!! 
> 	at org.apache.ws.java2wsdl.SchemaGenerator.generateSchema(SchemaGenerator.java:172)
> 	at org.apache.axis2.deployment.util.Utils.fillAxisService(Utils.java:281)
> 	at org.apache.axis2.deployment.ServiceBuilder.populateService(ServiceBuilder.java:300)
> 	... 21 more
> org.apache.axis2.deployment.DeploymentException: Processing Operations Modules Error
in schema generating  Sorry we don't support methods overloading !!!! ; nested exception is:

> 	java.lang.Exception:  Sorry we don't support methods overloading !!!! ; nested exception
is: 
> 	org.apache.axis2.deployment.DeploymentException: Error in schema generating  Sorry we
don't support methods overloading !!!! ; nested exception is: 
> 	java.lang.Exception:  Sorry we don't support methods overloading !!!! ; nested exception
is: 
> 	org.apache.axis2.deployment.DeploymentException: Processing Operations Modules Error
in schema generating  Sorry we don't support methods overloading !!!! ; nested exception is:

> 	java.lang.Exception:  Sorry we don't support methods overloading !!!! ; nested exception
is: 
> 	org.apache.axis2.deployment.DeploymentException: Error in schema generating  Sorry we
don't support methods overloading !!!! ; nested exception is: 
> 	java.lang.Exception:  Sorry we don't support methods overloading !!!! 
> 	at org.apache.axis2.deployment.ServiceGroupBuilder.populateServiceGroup(ServiceGroupBuilder.java:101)
> 	at org.apache.axis2.deployment.repository.util.ArchiveReader.buildServiceGroup(ArchiveReader.java:99)
> 	at org.apache.axis2.deployment.repository.util.ArchiveReader.processServiceGroup(ArchiveReader.java:167)
> 	at org.apache.axis2.deployment.DeploymentEngine.doDeploy(DeploymentEngine.java:528)
> 	at org.apache.axis2.deployment.repository.util.WSInfoList.update(WSInfoList.java:196)
> 	at org.apache.axis2.deployment.RepositoryListener.update(RepositoryListener.java:227)
> 	at org.apache.axis2.deployment.RepositoryListener.checkServices(RepositoryListener.java:174)
> 	at org.apache.axis2.deployment.DeploymentEngine.loadServices(DeploymentEngine.java:88)
> 	at org.apache.axis2.deployment.FileSystemConfigurator.loadServices(FileSystemConfigurator.java:129)
> 	at org.apache.axis2.context.ConfigurationContextFactory.createConfigurationContext(ConfigurationContextFactory.java:72)
> 	at org.apache.axis2.context.ConfigurationContextFactory.createConfigurationContextFromFileSystem(ConfigurationContextFactory.java:180)
> 	at org.apache.axis2.jaxws.util.SimpleServer.init(SimpleServer.java:41)
> 	at org.apache.axis2.jaxws.util.SimpleServer.start(SimpleServer.java:51)
> 	at org.apache.axis2.jaxws.framework.StartServer.testStartServer(StartServer.java:31)
> 	at org.apache.axis2.jaxws.framework.JAXWSTest$1.setUp(JAXWSTest.java:143)
> 	at junit.extensions.TestSetup$1.protect(TestSetup.java:20)
> 	at junit.framework.TestResult.runProtected(TestResult.java:124)
> 	at junit.extensions.TestSetup.run(TestSetup.java:25)
> 	at org.apache.tools.ant.taskdefs.optional.junit.JUnitTestRunner.run(JUnitTestRunner.java:297)
> 	at org.apache.tools.ant.taskdefs.optional.junit.JUnitTestRunner.launch(JUnitTestRunner.java:672)
> 	at org.apache.tools.ant.taskdefs.optional.junit.JUnitTestRunner.main(JUnitTestRunner.java:567)
> Caused by: org.apache.axis2.deployment.DeploymentException: Processing Operations Modules
Error in schema generating  Sorry we don't support methods overloading !!!! ; nested exception
is: 
> 	java.lang.Exception:  Sorry we don't support methods overloading !!!! ; nested exception
is: 
> 	org.apache.axis2.deployment.DeploymentException: Error in schema generating  Sorry we
don't support methods overloading !!!! ; nested exception is: 
> 	java.lang.Exception:  Sorry we don't support methods overloading !!!! 
> 	at org.apache.axis2.deployment.ServiceBuilder.populateService(ServiceBuilder.java:329)
> 	at org.apache.axis2.deployment.ServiceGroupBuilder.populateServiceGroup(ServiceGroupBuilder.java:96)
> 	... 20 more
> Caused by: org.apache.axis2.deployment.DeploymentException: Error in schema generating
 Sorry we don't support methods overloading !!!! ; nested exception is: 
> 	java.lang.Exception:  Sorry we don't support methods overloading !!!! 
> 	at org.apache.axis2.deployment.ServiceBuilder.populateService(ServiceBuilder.java:304)
> 	... 21 more
> Caused by: java.lang.Exception:  Sorry we don't support methods overloading !!!! 
> 	at org.apache.ws.java2wsdl.SchemaGenerator.generateSchema(SchemaGenerator.java:172)
> 	at org.apache.axis2.deployment.util.Utils.fillAxisService(Utils.java:281)
> 	at org.apache.axis2.deployment.ServiceBuilder.populateService(ServiceBuilder.java:300)
> 	... 21 more
> ------------- ---------------- ---------------
> Testcase: testSOAP12DispatchPayloadMode(org.apache.axis2.jaxws.dispatch.SOAP12Dispatch):
Caused an ERROR
> Service not found operation terminated !!
> javax.xml.ws.WebServiceException: Service not found operation terminated !!
> 	at org.apache.axis2.jaxws.ExceptionFactory.createWebServiceException(ExceptionFactory.java:220)
> 	at org.apache.axis2.jaxws.ExceptionFactory.makeWebServiceException(ExceptionFactory.java:81)
> 	at org.apache.axis2.jaxws.ExceptionFactory.makeWebServiceException(ExceptionFactory.java:176)
> 	at org.apache.axis2.jaxws.client.BaseDispatch.invoke(BaseDispatch.java:133)
> 	at org.apache.axis2.jaxws.dispatch.SOAP12Dispatch.testSOAP12DispatchPayloadMode(SOAP12Dispatch.java:84)
> 	at junit.extensions.TestDecorator.basicRun(TestDecorator.java:24)
> 	at junit.extensions.TestSetup$1.protect(TestSetup.java:21)
> 	at junit.extensions.TestSetup.run(TestSetup.java:25)
> Testcase: testSOAP12DispatchMessageMode(org.apache.axis2.jaxws.dispatch.SOAP12Dispatch):
Caused an ERROR
> Service not found operation terminated !!
> javax.xml.ws.WebServiceException: Service not found operation terminated !!
> 	at org.apache.axis2.jaxws.ExceptionFactory.createWebServiceException(ExceptionFactory.java:220)
> 	at org.apache.axis2.jaxws.ExceptionFactory.makeWebServiceException(ExceptionFactory.java:81)
> 	at org.apache.axis2.jaxws.ExceptionFactory.makeWebServiceException(ExceptionFactory.java:176)
> 	at org.apache.axis2.jaxws.client.BaseDispatch.invoke(BaseDispatch.java:133)
> 	at org.apache.axis2.jaxws.dispatch.SOAP12Dispatch.testSOAP12DispatchMessageMode(SOAP12Dispatch.java:121)
> 	at junit.extensions.TestDecorator.basicRun(TestDecorator.java:24)
> 	at junit.extensions.TestSetup$1.protect(TestSetup.java:21)
> 	at junit.extensions.TestSetup.run(TestSetup.java:25)
> Testcase: testMTOMAttachmentString(org.apache.axis2.jaxws.provider.JAXBProviderTests):
Caused an ERROR
> Service not found operation terminated !!
> javax.xml.ws.WebServiceException: Service not found operation terminated !!
> 	at org.apache.axis2.jaxws.ExceptionFactory.createWebServiceException(ExceptionFactory.java:220)
> 	at org.apache.axis2.jaxws.ExceptionFactory.makeWebServiceException(ExceptionFactory.java:81)
> 	at org.apache.axis2.jaxws.ExceptionFactory.makeWebServiceException(ExceptionFactory.java:176)
> 	at org.apache.axis2.jaxws.client.BaseDispatch.invoke(BaseDispatch.java:133)
> 	at org.apache.axis2.jaxws.provider.JAXBProviderTests.testMTOMAttachmentString(JAXBProviderTests.java:118)
> 	at junit.extensions.TestDecorator.basicRun(TestDecorator.java:24)
> 	at junit.extensions.TestSetup$1.protect(TestSetup.java:21)
> 	at junit.extensions.TestSetup.run(TestSetup.java:25)
> Testcase: testMTOMAttachmentImage(org.apache.axis2.jaxws.provider.JAXBProviderTests):
Caused an ERROR
> Service not found operation terminated !!
> javax.xml.ws.WebServiceException: Service not found operation terminated !!
> 	at org.apache.axis2.jaxws.ExceptionFactory.createWebServiceException(ExceptionFactory.java:220)
> 	at org.apache.axis2.jaxws.ExceptionFactory.makeWebServiceException(ExceptionFactory.java:81)
> 	at org.apache.axis2.jaxws.ExceptionFactory.makeWebServiceException(ExceptionFactory.java:176)
> 	at org.apache.axis2.jaxws.client.BaseDispatch.invoke(BaseDispatch.java:133)
> 	at org.apache.axis2.jaxws.provider.JAXBProviderTests.testMTOMAttachmentImage(JAXBProviderTests.java:153)
> 	at junit.extensions.TestDecorator.basicRun(TestDecorator.java:24)
> 	at junit.extensions.TestSetup$1.protect(TestSetup.java:21)
> 	at junit.extensions.TestSetup.run(TestSetup.java:25)

-- 
This message is automatically generated by JIRA.
-
If you think it was sent incorrectly contact one of the administrators: http://issues.apache.org/jira/secure/Administrators.jspa
-
For more information on JIRA, see: http://www.atlassian.com/software/jira

        

---------------------------------------------------------------------
To unsubscribe, e-mail: axis-dev-unsubscribe@ws.apache.org
For additional commands, e-mail: axis-dev-help@ws.apache.org


Mime
View raw message