axis-java-dev mailing list archives

Site index · List index
Message view « Date » · « Thread »
Top « Date » · « Thread »
From "lo ti (JIRA)" <j...@apache.org>
Subject [jira] Commented: (AXIS2-936) Maven build fail for org.apache.axis2.jibx.Test
Date Sat, 14 Oct 2006 02:49:38 GMT
    [ http://issues.apache.org/jira/browse/AXIS2-936?page=comments#action_12442185 ] 
            
lo ti commented on AXIS2-936:
-----------------------------


   [[ Old comment, sent by email on Thu, 27 Jul 2006 12:14:41 -0700 (PDT) ]]

Hi Davanum,
   
  Sorry I don't know how to reply back from JIRA forum.  It has not any options to reply back.
 Please direct me of how to reply back from your forum.
   
  Thanks a lot for your help on this.  I am NOT using JROCKET 1.5.  Looked into this folder
"axis2/modules/jibx/target/test-classes/org/apache/axis2/jibx" and all classes that you mentioned
are already compiled and existed.  Could you please advice for another solution, please?
   
  Thanks,
  Tilo

"Davanum Srinivas (JIRA)" <jira@apache.org> wrote:
  [ http://issues.apache.org/jira/browse/AXIS2-936?page=comments#action_12423820 ] 

Davanum Srinivas commented on AXIS2-936:
----------------------------------------

it fails for me 100% of the time when i use JROCKIT 1.5. Basically i need to run it twice,
first to compile the Customer/Person classes and then run maven again to run the tests. Otherwise
it fails. It somehow picks up a undecorated (jibx uses BCEL to decorate the classes) Customer/Person
in some jdk's.

-- dims


-- 
This message is automatically generated by JIRA.
-
If you think it was sent incorrectly contact one of the administrators: http://issues.apache.org/jira/secure/Administrators.jspa
-
For more information on JIRA, see: http://www.atlassian.com/software/jira




 		
---------------------------------
Do you Yahoo!?
 Everyone is raving about the  all-new Yahoo! Mail Beta.


> Maven build fail for org.apache.axis2.jibx.Test
> -----------------------------------------------
>
>                 Key: AXIS2-936
>                 URL: http://issues.apache.org/jira/browse/AXIS2-936
>             Project: Apache Axis 2.0 (Axis2)
>          Issue Type: Bug
>          Components: samples, build,site
>    Affects Versions: 1.0
>         Environment: HP-UX B.11.11 U 9000/800; JDK 1.5.0.02
>            Reporter: lo ti
>
> test:test:
>     [junit] Running org.apache.axis2.jibx.Test
>     [junit] Tests run: 1, Failures: 0, Errors: 1, Time elapsed: 1.178 sec
>     [junit] [ERROR] TEST org.apache.axis2.jibx.Test FAILED
> BUILD FAILED
> File...... /sis/.maven/cache/maven-multiproject-plugin-1.3.1/plugin.jelly
> Element... maven:reactor
> Line...... 217
> Column.... 9
> Unable to obtain goal [multiproject:install-callback] -- /sis/.maven/cache/maven-test-plugin-1.6.2/plugin.jelly:181:54:
<fail> There were test failures.
> Total time: 7 minutes 8 seconds
> Finished at: Wed Jul 26 17:16:28 CDT 2006 

-- 
This message is automatically generated by JIRA.
-
If you think it was sent incorrectly contact one of the administrators: http://issues.apache.org/jira/secure/Administrators.jspa
-
For more information on JIRA, see: http://www.atlassian.com/software/jira

        

---------------------------------------------------------------------
To unsubscribe, e-mail: axis-dev-unsubscribe@ws.apache.org
For additional commands, e-mail: axis-dev-help@ws.apache.org


Mime
View raw message