axis-java-dev mailing list archives

Site index · List index
Message view « Date » · « Thread »
Top « Date » · « Thread »
From "Ruchith Fernando" <ruchith.ferna...@gmail.com>
Subject Re: [Axis2] Build failing
Date Mon, 11 Sep 2006 12:58:55 GMT
Hi William,

Can you please send the test report (.txt) for those test that failed.
Test report of a maven module can be found in that module's
"target/test-reports" directory.

Thanks,
Ruchith

On 9/11/06, William Ferguson <wjrf@optusnet.com.au> wrote:
> While I'm not having the compilation fail like Bill is, I cannot get
> Axis2 to successfully build. It always fails during the integration tests
>
> test:test:
> ..
>     [junit] Running org.apache.axis2.rpc.MultirefTest
>     [junit] Tests run: 9, Failures: 0, Errors: 1, Time elapsed: 46.468 sec
>     [junit] [ERROR] TEST org.apache.axis2.rpc.MultirefTest FAILED
> ..
>     [junit] Running org.apache.rahas.RahasSAMLTokenCertForHoKTest
>     [junit] Tests run: 2, Failures: 1, Errors: 0, Time elapsed: 22.016 sec
>     [junit] [ERROR] TEST org.apache.rahas.RahasSAMLTokenCertForHoKTest
> FAILED
>     [junit] Running org.apache.rahas.RahasSAMLTokenCertForHoKV1205Test
>     [junit] Tests run: 2, Failures: 1, Errors: 0, Time elapsed: 22.203 sec
>     [junit] [ERROR] TEST
> org.apache.rahas.RahasSAMLTokenCertForHoKV1205Test FAILED
>     [junit] Running org.apache.rahas.RahasSAMLTokenTest
>     [junit] Tests run: 2, Failures: 1, Errors: 0, Time elapsed: 21.875 sec
>     [junit] [ERROR] TEST org.apache.rahas.RahasSAMLTokenTest FAILED
> ..
>
> BUILD FAILED
> File...... C:\Documents and
> Settings\william\.maven\cache\maven-multiproject-plugin-1.3.1\plugin.jelly
> Element... maven:reactor
> Line...... 217
> Column.... 9
> Unable to obtain goal [multiproject:install-callback] -- C:\Documents
> and
> Settings\william\.maven\cache\maven-test-plugin-1.6.2\plugin.jelly:181:54: <
> fail> There were test failures.
> Total time: 59 minutes 29 seconds
> Finished at: Mon Sep 11 18:59:02 EST 2006
>
> This was done with  the latest from SVN, "maven  clean", "maven"  after
> removing everything from my local maven repository (just to be sure).
>
> I'd really like to be able to build the project.
> Is this not happening for anyone else?
> Any ideas?
>
> William
>
>
> Bill Nagy wrote:
> > Still doesn't work.  This is all that I have in the repo (for XmlSchema
> > that is):
> >
> > ~> ls -lah .maven/repository/org.apache.ws.commons/jars
> > total 144K
> > drwxrwxr-x 2 nagy nagy 4.0K Sep  8 21:05 ./
> > drwxrwxr-x 3 nagy nagy 4.0K Jun 19 13:38 ../
> > -rw-rw-r-- 1 nagy nagy 120K Sep  8 21:05 XmlSchema-SNAPSHOT.jar
> >
> > -Bill
> >
> >
> > On Fri, 2006-09-08 at 19:05 -0400, Davanum Srinivas wrote:
> >
> >> Please cleanup your old Xmlschema jar from your maven repo...
> >>
> >> On 9/8/06, Bill Nagy <nagy@watson.ibm.com> wrote:
> >>
> >>> I just pulled from Subversion, did a full build (maven clean; maven),
> >>> and found that some of the codegen tests are failing:
> >>>
> >>> Testsuite:
> >>> org.apache.axis2.wsdl.codegen.extension.SchemaUnwrapperExtensionTest
> >>> Tests run: 4, Failures: 0, Errors: 4, Time elapsed: 0.397 sec
> >>>
> >>> Testcase:
> >>> testScenarioOne(org.apache.axis2.wsdl.codegen.extension.SchemaUnwrapperExtensionTest):
 Caused an ERROR
> >>> The prefix xs is not bound.
> >>> java.lang.IllegalStateException: The prefix xs is not bound.
> >>>         at
> >>> org.apache.ws.commons.schema.SchemaBuilder.getRefQName(SchemaBuilder.java:515)
> >>>         at
> >>> org.apache.ws.commons.schema.SchemaBuilder.getRefQName(SchemaBuilder.java:496)
> >>>         at
> >>> org.apache.ws.commons.schema.SchemaBuilder.handleElement(SchemaBuilder.java:1390)
> >>>         at
> >>> org.apache.ws.commons.schema.SchemaBuilder.handleSequence(SchemaBuilder.java:956)
> >>>         at
> >>> org.apache.ws.commons.schema.SchemaBuilder.handleComplexType(SchemaBuilder.java:584)
> >>>         at
> >>> org.apache.ws.commons.schema.SchemaBuilder.handleElement(SchemaBuilder.java:1417)
> >>>         at
> >>> org.apache.ws.commons.schema.SchemaBuilder.handleXmlSchemaElement(SchemaBuilder.java:143)
> >>>         at
> >>> org.apache.ws.commons.schema.SchemaBuilder.build(SchemaBuilder.java:67)
> >>>         at
> >>> org.apache.ws.commons.schema.XmlSchemaCollection.read(XmlSchemaCollection.java:294)
> >>>         at
> >>> org.apache.ws.commons.schema.XmlSchemaCollection.read(XmlSchemaCollection.java:286)
> >>>         at
> >>> org.apache.axis2.wsdl.codegen.extension.SchemaUnwrapperExtensionTest.loadSchema(SchemaUnwrapperExtensionTest.java:161)
> >>>         at
> >>> org.apache.axis2.wsdl.codegen.extension.SchemaUnwrapperExtensionTest.createAndWalkSchema(SchemaUnwrapperExtensionTest.java:147)
> >>>         at
> >>> org.apache.axis2.wsdl.codegen.extension.SchemaUnwrapperExtensionTest.testScenarioOne(SchemaUnwrapperExtensionTest.java:65)
> >>>
> >>>
> >>> Testcase:
> >>> testScenarioTwo(org.apache.axis2.wsdl.codegen.extension.SchemaUnwrapperExtensionTest):
 Caused an ERROR
> >>> The prefix xs is not bound.
> >>> java.lang.IllegalStateException: The prefix xs is not bound.
> >>>         at
> >>> org.apache.ws.commons.schema.SchemaBuilder.getRefQName(SchemaBuilder.java:515)
> >>>         at
> >>> org.apache.ws.commons.schema.SchemaBuilder.getRefQName(SchemaBuilder.java:496)
> >>>         at
> >>> org.apache.ws.commons.schema.SchemaBuilder.handleElement(SchemaBuilder.java:1390)
> >>>         at
> >>> org.apache.ws.commons.schema.SchemaBuilder.handleSequence(SchemaBuilder.java:956)
> >>>         at
> >>> org.apache.ws.commons.schema.SchemaBuilder.handleComplexType(SchemaBuilder.java:584)
> >>>         at
> >>> org.apache.ws.commons.schema.SchemaBuilder.handleXmlSchemaElement(SchemaBuilder.java:138)
> >>>         at
> >>> org.apache.ws.commons.schema.SchemaBuilder.build(SchemaBuilder.java:67)
> >>>         at
> >>> org.apache.ws.commons.schema.XmlSchemaCollection.read(XmlSchemaCollection.java:294)
> >>>         at
> >>> org.apache.ws.commons.schema.XmlSchemaCollection.read(XmlSchemaCollection.java:286)
> >>>         at
> >>> org.apache.axis2.wsdl.codegen.extension.SchemaUnwrapperExtensionTest.loadSchema(SchemaUnwrapperExtensionTest.java:161)
> >>>         at
> >>> org.apache.axis2.wsdl.codegen.extension.SchemaUnwrapperExtensionTest.createAndWalkSchema(SchemaUnwrapperExtensionTest.java:147)
> >>>         at
> >>> org.apache.axis2.wsdl.codegen.extension.SchemaUnwrapperExtensionTest.testScenarioTwo(SchemaUnwrapperExtensionTest.java:87)
> >>>
> >>>
> >>> Testcase:
> >>> testScenarioThree(org.apache.axis2.wsdl.codegen.extension.SchemaUnwrapperExtensionTest):
       Caused an ERROR
> >>> The prefix ns is not bound.
> >>> java.lang.IllegalStateException: The prefix ns is not bound.
> >>>         at
> >>> org.apache.ws.commons.schema.SchemaBuilder.getRefQName(SchemaBuilder.java:515)
> >>>         at
> >>> org.apache.ws.commons.schema.SchemaBuilder.getRefQName(SchemaBuilder.java:496)
> >>>         at
> >>> org.apache.ws.commons.schema.SchemaBuilder.handleComplexContentExtension(SchemaBuilder.java:875)
> >>>         at
> >>> org.apache.ws.commons.schema.SchemaBuilder.handleComplexContent(SchemaBuilder.java:713)
> >>>         at
> >>> org.apache.ws.commons.schema.SchemaBuilder.handleComplexType(SchemaBuilder.java:614)
> >>>         at
> >>> org.apache.ws.commons.schema.SchemaBuilder.handleXmlSchemaElement(SchemaBuilder.java:138)
> >>>         at
> >>> org.apache.ws.commons.schema.SchemaBuilder.build(SchemaBuilder.java:67)
> >>>         at
> >>> org.apache.ws.commons.schema.XmlSchemaCollection.read(XmlSchemaCollection.java:294)
> >>>         at
> >>> org.apache.ws.commons.schema.XmlSchemaCollection.read(XmlSchemaCollection.java:286)
> >>>         at
> >>> org.apache.axis2.wsdl.codegen.extension.SchemaUnwrapperExtensionTest.loadSchema(SchemaUnwrapperExtensionTest.java:161)
> >>>         at
> >>> org.apache.axis2.wsdl.codegen.extension.SchemaUnwrapperExtensionTest.createAndWalkSchema(SchemaUnwrapperExtensionTest.java:147)
> >>>         at
> >>> org.apache.axis2.wsdl.codegen.extension.SchemaUnwrapperExtensionTest.testScenarioThree(SchemaUnwrapperExtensionTest.java:108)
> >>>
> >>>
> >>> Testcase:
> >>> testScenarioFour(org.apache.axis2.wsdl.codegen.extension.SchemaUnwrapperExtensionTest):
Caused an ERROR
> >>> The prefix ns is not bound.
> >>> java.lang.IllegalStateException: The prefix ns is not bound.
> >>>         at
> >>> org.apache.ws.commons.schema.SchemaBuilder.getRefQName(SchemaBuilder.java:515)
> >>>         at
> >>> org.apache.ws.commons.schema.SchemaBuilder.getRefQName(SchemaBuilder.java:496)
> >>>         at
> >>> org.apache.ws.commons.schema.SchemaBuilder.handleComplexContentExtension(SchemaBuilder.java:875)
> >>>         at
> >>> org.apache.ws.commons.schema.SchemaBuilder.handleComplexContent(SchemaBuilder.java:713)
> >>>         at
> >>> org.apache.ws.commons.schema.SchemaBuilder.handleComplexType(SchemaBuilder.java:614)
> >>>         at
> >>> org.apache.ws.commons.schema.SchemaBuilder.handleXmlSchemaElement(SchemaBuilder.java:138)
> >>>         at
> >>> org.apache.ws.commons.schema.SchemaBuilder.build(SchemaBuilder.java:67)
> >>>         at
> >>> org.apache.ws.commons.schema.XmlSchemaCollection.read(XmlSchemaCollection.java:294)
> >>>         at
> >>> org.apache.ws.commons.schema.XmlSchemaCollection.read(XmlSchemaCollection.java:286)
> >>>         at
> >>> org.apache.axis2.wsdl.codegen.extension.SchemaUnwrapperExtensionTest.loadSchema(SchemaUnwrapperExtensionTest.java:161)
> >>>         at
> >>> org.apache.axis2.wsdl.codegen.extension.SchemaUnwrapperExtensionTest.createAndWalkSchema(SchemaUnwrapperExtensionTest.java:147)
> >>>         at
> >>> org.apache.axis2.wsdl.codegen.extension.SchemaUnwrapperExtensionTest.testScenarioFour(SchemaUnwrapperExtensionTest.java:130)
> >>>
> >>>
> >>>
> >>> ---------------------------------------------------------------------
> >>> To unsubscribe, e-mail: axis-dev-unsubscribe@ws.apache.org
> >>> For additional commands, e-mail: axis-dev-help@ws.apache.org
> >>>
> >>>
> >>>
> >>
> >
> >
> > ---------------------------------------------------------------------
> > To unsubscribe, e-mail: axis-dev-unsubscribe@ws.apache.org
> > For additional commands, e-mail: axis-dev-help@ws.apache.org
> >
> >
> >
> >
>
> ---------------------------------------------------------------------
> To unsubscribe, e-mail: axis-dev-unsubscribe@ws.apache.org
> For additional commands, e-mail: axis-dev-help@ws.apache.org
>
>


-- 
www.ruchith.org

---------------------------------------------------------------------
To unsubscribe, e-mail: axis-dev-unsubscribe@ws.apache.org
For additional commands, e-mail: axis-dev-help@ws.apache.org


Mime
View raw message