axis-java-dev mailing list archives

Site index · List index
Message view « Date » · « Thread »
Top « Date » · « Thread »
From Tim Oertel <...@samasher.com>
Subject Re: [axis2] magic to build axis2 from svn? missing axiom-api-SNAPSHOT.jar
Date Thu, 29 Jun 2006 13:16:00 GMT
I didn't explicitly set it offline, and trying to deliberately set it
online didn't help.  This is a partial dump of the output from maven.
I'm not familiar with maven so most of this is pretty cryptic to me...
hopefully it'll be useful to someone here:

+----------------------------------------
| Executing multiproject:install-callback Apache Axis 2.0 - Common
| Memory: 12M/17M
+----------------------------------------
[MethodExpression] Cannot evaluate expression
java.lang.reflect.InvocationTargetException
         at sun.reflect.GeneratedMethodAccessor113.invoke(Unknown Source)
         at sun.reflect.DelegatingMethodAccessorImpl.invoke(DelegatingMethodAccessorImpl.java:25)
         at java.lang.reflect.Method.invoke(Method.java:324)
         at org.apache.commons.betwixt.expression.MethodExpression.evaluate(MethodExpression.java:96)
         at org.apache.commons.betwixt.io.AbstractBeanWriter.writeContent(AbstractBeanWriter.java:658)
         at org.apache.commons.betwixt.io.AbstractBeanWriter.writeRestOfElement(AbstractBeanWriter.java:539)
         at org.apache.commons.betwixt.io.AbstractBeanWriter.write(AbstractBeanWriter.java:481)
         at org.apache.commons.betwixt.io.AbstractBeanWriter.writeContent(AbstractBeanWriter.java:643)
         at org.apache.commons.betwixt.io.AbstractBeanWriter.writeRestOfElement(AbstractBeanWriter.java:539)
         at org.apache.commons.betwixt.io.AbstractBeanWriter.write(AbstractBeanWriter.java:513)
         at org.apache.commons.betwixt.io.AbstractBeanWriter.write(AbstractBeanWriter.java:233)
         at org.apache.commons.betwixt.io.AbstractBeanWriter.writeContent(AbstractBeanWriter.java:630)
         at org.apache.commons.betwixt.io.AbstractBeanWriter.writeRestOfElement(AbstractBeanWriter.java:539)
         at org.apache.commons.betwixt.io.AbstractBeanWriter.write(AbstractBeanWriter.java:513)
         at org.apache.commons.betwixt.io.AbstractBeanWriter.write(AbstractBeanWriter.java:233)
         at org.apache.commons.betwixt.io.AbstractBeanWriter.write(AbstractBeanWriter.java:162)
         at org.apache.commons.betwixt.io.BeanWriter.write(BeanWriter.java:217)
         at org.apache.maven.MavenUtils.getProjectString(MavenUtils.java:421)
         at org.apache.maven.MavenUtils.getInterpolatedPOM(MavenUtils.java:372)
         at org.apache.maven.MavenUtils.getJellyProject(MavenUtils.java:349)
         at org.apache.maven.MavenUtils.getProject(MavenUtils.java:144)
         at org.apache.maven.plugin.JellyScriptHousing.getProject(JellyScriptHousing.java:105)
         at org.apache.maven.plugin.PluginManager.createPluginHousing(PluginManager.java:288)
         at org.apache.maven.plugin.PluginManager.installPlugin(PluginManager.java:777)
         at org.apache.maven.plugin.PluginManager.installPlugin(PluginManager.java:745)
         at org.apache.maven.plugin.PluginManager.processDependencies(PluginManager.java:390)
         at org.apache.maven.plugin.PluginManager.attainGoals(PluginManager.java:586)
         at org.apache.maven.MavenSession.attainGoals(MavenSession.java:266)
         at org.apache.maven.jelly.tags.maven.ReactorTag.doTag(ReactorTag.java:342)
         at org.apache.commons.jelly.impl.TagScript.run(TagScript.java:279)
         at org.apache.commons.jelly.impl.ScriptBlock.run(ScriptBlock.java:135)
         at org.apache.maven.jelly.tags.werkz.MavenGoalTag.runBodyTag(MavenGoalTag.java:79)
         at org.apache.maven.jelly.tags.werkz.MavenGoalTag$MavenGoalAction.performAction(MavenGoalTag.java:110)
         at com.werken.werkz.Goal.fire(Goal.java:639)
         at com.werken.werkz.Goal.attain(Goal.java:575)
         at com.werken.werkz.WerkzProject.attainGoal(WerkzProject.java:193)
         at org.apache.maven.jelly.tags.werkz.MavenAttainGoalTag.doTag(MavenAttainGoalTag.java:126)
         at org.apache.commons.jelly.impl.TagScript.run(TagScript.java:279)
         at org.apache.commons.jelly.impl.ScriptBlock.run(ScriptBlock.java:135)
         at org.apache.maven.jelly.tags.werkz.MavenGoalTag.runBodyTag(MavenGoalTag.java:79)
         at org.apache.maven.jelly.tags.werkz.MavenGoalTag$MavenGoalAction.performAction(MavenGoalTag.java:110)
         at com.werken.werkz.Goal.fire(Goal.java:639)
         at com.werken.werkz.Goal.attain(Goal.java:575)
         at com.werken.werkz.WerkzProject.attainGoal(WerkzProject.java:193)
         at org.apache.maven.jelly.tags.werkz.MavenAttainGoalTag.doTag(MavenAttainGoalTag.java:126)
         at org.apache.commons.jelly.impl.TagScript.run(TagScript.java:279)
         at org.apache.commons.jelly.impl.ScriptBlock.run(ScriptBlock.java:135)
         at org.apache.maven.jelly.tags.werkz.MavenGoalTag.runBodyTag(MavenGoalTag.java:79)
         at org.apache.maven.jelly.tags.werkz.MavenGoalTag$MavenGoalAction.performAction(MavenGoalTag.java:110)
         at com.werken.werkz.Goal.fire(Goal.java:639)
         at com.werken.werkz.Goal.attain(Goal.java:575)
         at com.werken.werkz.WerkzProject.attainGoal(WerkzProject.java:193)
         at org.apache.maven.plugin.PluginManager.attainGoals(PluginManager.java:610)
         at org.apache.maven.MavenSession.attainGoals(MavenSession.java:266)
         at org.apache.maven.cli.App.doMain(App.java:485)
         at org.apache.maven.cli.App.main(App.java:1214)
         at sun.reflect.NativeMethodAccessorImpl.invoke0(Native Method)
         at sun.reflect.NativeMethodAccessorImpl.invoke(NativeMethodAccessorImpl.java:39)
         at sun.reflect.DelegatingMethodAccessorImpl.invoke(DelegatingMethodAccessorImpl.java:25)
         at java.lang.reflect.Method.invoke(Method.java:324)
         at com.werken.forehead.Forehead.run(Forehead.java:551)
         at com.werken.forehead.Forehead.main(Forehead.java:581)
Caused by: java.lang.IllegalArgumentException: repository connection string contains less
than six tokens
         at org.apache.maven.project.Repository.splitSCMConnection(Repository.java:240)
         at org.apache.maven.project.Repository.getCvsModule(Repository.java:205)
         at org.apache.maven.project.Repository.getCvsModule(Repository.java:144)
         ... 62 more
[MethodExpression] Cannot evaluate expression
java.lang.reflect.InvocationTargetException
         at sun.reflect.GeneratedMethodAccessor114.invoke(Unknown Source)
         at sun.reflect.DelegatingMethodAccessorImpl.invoke(DelegatingMethodAccessorImpl.java:25)
         at java.lang.reflect.Method.invoke(Method.java:324)
         at org.apache.commons.betwixt.expression.MethodExpression.evaluate(MethodExpression.java:96)
         at org.apache.commons.betwixt.io.AbstractBeanWriter.writeContent(AbstractBeanWriter.java:658)
         at org.apache.commons.betwixt.io.AbstractBeanWriter.writeRestOfElement(AbstractBeanWriter.java:539)
         at org.apache.commons.betwixt.io.AbstractBeanWriter.write(AbstractBeanWriter.java:481)
         at org.apache.commons.betwixt.io.AbstractBeanWriter.writeContent(AbstractBeanWriter.java:643)
         at org.apache.commons.betwixt.io.AbstractBeanWriter.writeRestOfElement(AbstractBeanWriter.java:539)
         at org.apache.commons.betwixt.io.AbstractBeanWriter.write(AbstractBeanWriter.java:513)
         at org.apache.commons.betwixt.io.AbstractBeanWriter.write(AbstractBeanWriter.java:233)
         at org.apache.commons.betwixt.io.AbstractBeanWriter.writeContent(AbstractBeanWriter.java:630)
         at org.apache.commons.betwixt.io.AbstractBeanWriter.writeRestOfElement(AbstractBeanWriter.java:539)
         at org.apache.commons.betwixt.io.AbstractBeanWriter.write(AbstractBeanWriter.java:513)
         at org.apache.commons.betwixt.io.AbstractBeanWriter.write(AbstractBeanWriter.java:233)
         at org.apache.commons.betwixt.io.AbstractBeanWriter.write(AbstractBeanWriter.java:162)
         at org.apache.commons.betwixt.io.BeanWriter.write(BeanWriter.java:217)
         at org.apache.maven.MavenUtils.getProjectString(MavenUtils.java:421)
         at org.apache.maven.MavenUtils.getInterpolatedPOM(MavenUtils.java:372)
         at org.apache.maven.MavenUtils.getJellyProject(MavenUtils.java:349)
         at org.apache.maven.MavenUtils.getProject(MavenUtils.java:144)
         at org.apache.maven.plugin.JellyScriptHousing.getProject(JellyScriptHousing.java:105)
         at org.apache.maven.plugin.PluginManager.createPluginHousing(PluginManager.java:288)
         at org.apache.maven.plugin.PluginManager.installPlugin(PluginManager.java:777)
         at org.apache.maven.plugin.PluginManager.installPlugin(PluginManager.java:745)
         at org.apache.maven.plugin.PluginManager.processDependencies(PluginManager.java:390)
         at org.apache.maven.plugin.PluginManager.attainGoals(PluginManager.java:586)
         at org.apache.maven.MavenSession.attainGoals(MavenSession.java:266)
         at org.apache.maven.jelly.tags.maven.ReactorTag.doTag(ReactorTag.java:342)
         at org.apache.commons.jelly.impl.TagScript.run(TagScript.java:279)
         at org.apache.commons.jelly.impl.ScriptBlock.run(ScriptBlock.java:135)
         at org.apache.maven.jelly.tags.werkz.MavenGoalTag.runBodyTag(MavenGoalTag.java:79)
         at org.apache.maven.jelly.tags.werkz.MavenGoalTag$MavenGoalAction.performAction(MavenGoalTag.java:110)
         at com.werken.werkz.Goal.fire(Goal.java:639)
         at com.werken.werkz.Goal.attain(Goal.java:575)
         at com.werken.werkz.WerkzProject.attainGoal(WerkzProject.java:193)
         at org.apache.maven.jelly.tags.werkz.MavenAttainGoalTag.doTag(MavenAttainGoalTag.java:126)
         at org.apache.commons.jelly.impl.TagScript.run(TagScript.java:279)
         at org.apache.commons.jelly.impl.ScriptBlock.run(ScriptBlock.java:135)
         at org.apache.maven.jelly.tags.werkz.MavenGoalTag.runBodyTag(MavenGoalTag.java:79)
         at org.apache.maven.jelly.tags.werkz.MavenGoalTag$MavenGoalAction.performAction(MavenGoalTag.java:110)
         at com.werken.werkz.Goal.fire(Goal.java:639)
         at com.werken.werkz.Goal.attain(Goal.java:575)
         at com.werken.werkz.WerkzProject.attainGoal(WerkzProject.java:193)
         at org.apache.maven.jelly.tags.werkz.MavenAttainGoalTag.doTag(MavenAttainGoalTag.java:126)
         at org.apache.commons.jelly.impl.TagScript.run(TagScript.java:279)
         at org.apache.commons.jelly.impl.ScriptBlock.run(ScriptBlock.java:135)
         at org.apache.maven.jelly.tags.werkz.MavenGoalTag.runBodyTag(MavenGoalTag.java:79)
         at org.apache.maven.jelly.tags.werkz.MavenGoalTag$MavenGoalAction.performAction(MavenGoalTag.java:110)
         at com.werken.werkz.Goal.fire(Goal.java:639)
         at com.werken.werkz.Goal.attain(Goal.java:575)
         at com.werken.werkz.WerkzProject.attainGoal(WerkzProject.java:193)
         at org.apache.maven.plugin.PluginManager.attainGoals(PluginManager.java:610)
         at org.apache.maven.MavenSession.attainGoals(MavenSession.java:266)
         at org.apache.maven.cli.App.doMain(App.java:485)
         at org.apache.maven.cli.App.main(App.java:1214)
         at sun.reflect.NativeMethodAccessorImpl.invoke0(Native Method)
         at sun.reflect.NativeMethodAccessorImpl.invoke(NativeMethodAccessorImpl.java:39)
         at sun.reflect.DelegatingMethodAccessorImpl.invoke(DelegatingMethodAccessorImpl.java:25)
         at java.lang.reflect.Method.invoke(Method.java:324)
         at com.werken.forehead.Forehead.run(Forehead.java:551)
         at com.werken.forehead.Forehead.main(Forehead.java:581)
Caused by: java.lang.IllegalArgumentException: repository connection string contains less
than six tokens
         at org.apache.maven.project.Repository.splitSCMConnection(Repository.java:240)
         at org.apache.maven.project.Repository.getCvsRoot(Repository.java:182)
         at org.apache.maven.project.Repository.getCvsRoot(Repository.java:129)
         ... 62 more
[MethodExpression] Cannot evaluate expression
java.lang.reflect.InvocationTargetException
         at sun.reflect.GeneratedMethodAccessor116.invoke(Unknown Source)
         at sun.reflect.DelegatingMethodAccessorImpl.invoke(DelegatingMethodAccessorImpl.java:25)
         at java.lang.reflect.Method.invoke(Method.java:324)
         at org.apache.commons.betwixt.expression.MethodExpression.evaluate(MethodExpression.java:96)
         at org.apache.commons.betwixt.io.AbstractBeanWriter.writeContent(AbstractBeanWriter.java:658)
         at org.apache.commons.betwixt.io.AbstractBeanWriter.writeRestOfElement(AbstractBeanWriter.java:539)
         at org.apache.commons.betwixt.io.AbstractBeanWriter.write(AbstractBeanWriter.java:481)
         at org.apache.commons.betwixt.io.AbstractBeanWriter.writeContent(AbstractBeanWriter.java:643)
         at org.apache.commons.betwixt.io.AbstractBeanWriter.writeRestOfElement(AbstractBeanWriter.java:539)
         at org.apache.commons.betwixt.io.AbstractBeanWriter.write(AbstractBeanWriter.java:513)
         at org.apache.commons.betwixt.io.AbstractBeanWriter.write(AbstractBeanWriter.java:233)
         at org.apache.commons.betwixt.io.AbstractBeanWriter.writeContent(AbstractBeanWriter.java:630)
         at org.apache.commons.betwixt.io.AbstractBeanWriter.writeRestOfElement(AbstractBeanWriter.java:539)
         at org.apache.commons.betwixt.io.AbstractBeanWriter.write(AbstractBeanWriter.java:513)
         at org.apache.commons.betwixt.io.AbstractBeanWriter.write(AbstractBeanWriter.java:233)
         at org.apache.commons.betwixt.io.AbstractBeanWriter.write(AbstractBeanWriter.java:162)
         at org.apache.commons.betwixt.io.BeanWriter.write(BeanWriter.java:217)
         at org.apache.maven.MavenUtils.getProjectString(MavenUtils.java:421)
         at org.apache.maven.MavenUtils.getInterpolatedPOM(MavenUtils.java:372)
         at org.apache.maven.MavenUtils.getJellyProject(MavenUtils.java:349)
         at org.apache.maven.MavenUtils.getProject(MavenUtils.java:144)
         at org.apache.maven.plugin.JellyScriptHousing.getProject(JellyScriptHousing.java:105)
         at org.apache.maven.plugin.PluginManager.createPluginHousing(PluginManager.java:288)
         at org.apache.maven.plugin.PluginManager.installPlugin(PluginManager.java:777)
         at org.apache.maven.plugin.PluginManager.installPlugin(PluginManager.java:745)
         at org.apache.maven.plugin.PluginManager.processDependencies(PluginManager.java:390)
         at org.apache.maven.plugin.PluginManager.attainGoals(PluginManager.java:586)
         at org.apache.maven.MavenSession.attainGoals(MavenSession.java:266)
         at org.apache.maven.jelly.tags.maven.ReactorTag.doTag(ReactorTag.java:342)
         at org.apache.commons.jelly.impl.TagScript.run(TagScript.java:279)
         at org.apache.commons.jelly.impl.ScriptBlock.run(ScriptBlock.java:135)
         at org.apache.maven.jelly.tags.werkz.MavenGoalTag.runBodyTag(MavenGoalTag.java:79)
         at org.apache.maven.jelly.tags.werkz.MavenGoalTag$MavenGoalAction.performAction(MavenGoalTag.java:110)
         at com.werken.werkz.Goal.fire(Goal.java:639)
         at com.werken.werkz.Goal.attain(Goal.java:575)
         at com.werken.werkz.WerkzProject.attainGoal(WerkzProject.java:193)
         at org.apache.maven.jelly.tags.werkz.MavenAttainGoalTag.doTag(MavenAttainGoalTag.java:126)
         at org.apache.commons.jelly.impl.TagScript.run(TagScript.java:279)
         at org.apache.commons.jelly.impl.ScriptBlock.run(ScriptBlock.java:135)
         at org.apache.maven.jelly.tags.werkz.MavenGoalTag.runBodyTag(MavenGoalTag.java:79)
         at org.apache.maven.jelly.tags.werkz.MavenGoalTag$MavenGoalAction.performAction(MavenGoalTag.java:110)
         at com.werken.werkz.Goal.fire(Goal.java:639)
         at com.werken.werkz.Goal.attain(Goal.java:575)
         at com.werken.werkz.WerkzProject.attainGoal(WerkzProject.java:193)
         at org.apache.maven.jelly.tags.werkz.MavenAttainGoalTag.doTag(MavenAttainGoalTag.java:126)
         at org.apache.commons.jelly.impl.TagScript.run(TagScript.java:279)
         at org.apache.commons.jelly.impl.ScriptBlock.run(ScriptBlock.java:135)
         at org.apache.maven.jelly.tags.werkz.MavenGoalTag.runBodyTag(MavenGoalTag.java:79)
         at org.apache.maven.jelly.tags.werkz.MavenGoalTag$MavenGoalAction.performAction(MavenGoalTag.java:110)
         at com.werken.werkz.Goal.fire(Goal.java:639)
         at com.werken.werkz.Goal.attain(Goal.java:575)
         at com.werken.werkz.WerkzProject.attainGoal(WerkzProject.java:193)
         at org.apache.maven.plugin.PluginManager.attainGoals(PluginManager.java:610)
         at org.apache.maven.MavenSession.attainGoals(MavenSession.java:266)
         at org.apache.maven.cli.App.doMain(App.java:485)
         at org.apache.maven.cli.App.main(App.java:1214)
         at sun.reflect.NativeMethodAccessorImpl.invoke0(Native Method)
         at sun.reflect.NativeMethodAccessorImpl.invoke(NativeMethodAccessorImpl.java:39)
         at sun.reflect.DelegatingMethodAccessorImpl.invoke(DelegatingMethodAccessorImpl.java:25)
         at java.lang.reflect.Method.invoke(Method.java:324)
         at com.werken.forehead.Forehead.run(Forehead.java:551)
         at com.werken.forehead.Forehead.main(Forehead.java:581)
Caused by: java.lang.IllegalArgumentException: repository connection string contains less
than six tokens
         at org.apache.maven.project.Repository.splitSCMConnection(Repository.java:240)
         at org.apache.maven.project.Repository.getScmType(Repository.java:115)
         ... 62 more

multiproject:goal:
build:start:

multiproject:install-callback:
     [echo] Running jar:install for Apache Axis 2.0 - Common
java:prepare-filesystem:

java:compile:
     [echo] Compiling to /home/manax/work/axis2/java/modules/common/target/classes

java:jar-resources:

test:prepare-filesystem:

test:test-resources:

test:compile:
     [echo] No test source files to compile.

test:test:
     [echo] No tests to run.

jar:jar:
     [jar] Building jar: /home/manax/work/axis2/java/modules/common/target/axis2-common-SNAPSHOT.jar

jar:install:
     [echo]
     id = 'axis2-common'
     groupId = 'axis2'
     artifactDirectory = 'axis2'

     [copy] Copying 1 file to /home/manax/.maven/repository/axis2/jars
+----------------------------------------
| Executing multiproject:install-callback Apache Axis 2.0 - Java2WSDL
| Memory: 19M/28M
+----------------------------------------
Attempting to download axiom-api-SNAPSHOT.jar.
WARNING: Failed to download axiom-api-SNAPSHOT.jar.
Attempting to download axiom-impl-SNAPSHOT.jar.
WARNING: Failed to download axiom-impl-SNAPSHOT.jar.

BUILD FAILED
File...... /home/manax/.maven/plugins/maven-multiproject-plugin-1.3/plugin.jelly
Element... maven:reactor
Line...... 216
Column.... 9
The build cannot continue because of the following unsatisfied dependencies:

axiom-api-SNAPSHOT.jar
axiom-impl-SNAPSHOT.jar


Maybe I've got mixed versions of something?

- Tim

Ajith Ranabahu wrote, on or about 6/29/2006 2:47 AM:
> Hi,
> Are you running maven in offline mode ? If so please run it in the
> online mode and maven will download the necessary jars.
> 
> Ajith
> 
> On 6/29/06, Tim Oertel <tox@samasher.com> wrote:
>> I'm trying to build axis2 from svn, and once I dealt with the
>> problem of the missing maven-itest, I'm apparently also
>> missing axiom-api-SNAPSHOT.jar and axiom-impl-SNAPSHOT.jar.
>>
>> I haven't been as successful sorting that out, yet.
>>
>> Any assistance?
>>
>> ---------------------------------------------------------------------
>> To unsubscribe, e-mail: axis-dev-unsubscribe@ws.apache.org
>> For additional commands, e-mail: axis-dev-help@ws.apache.org
>>
>>
> 
> 


-- 
Tim Oertel       |"Why should I be content to simply
VP Engineering   | live in this world, when I, as a
Ashergroup, Inc. | human being, can CREATE it?!"
IM via jabber: toertel@jabber.com

---------------------------------------------------------------------
To unsubscribe, e-mail: axis-dev-unsubscribe@ws.apache.org
For additional commands, e-mail: axis-dev-help@ws.apache.org


Mime
View raw message