axis-java-dev mailing list archives

Site index · List index
Message view « Date » · « Thread »
Top « Date » · « Thread »
From Deepal Jayasinghe <dee...@opensource.lk>
Subject Re: [Axis2] Build for SVN snapshot at the revision 414289 fails
Date Thu, 29 Jun 2006 10:35:04 GMT
Well , there were few changes in AXIOM , so u need to get update of that
and try .

Xinjun Chen wrote:

> I get the following error when compiling today's (29 Jun 2006) source
> code.
>
>
>    [delete] Deleting directory
> C:\axis2\modules\integration\test-resources\SOAP
> 12Testing\SOAP12TestServiceC\build
>
> test:test:
>    [junit] Running org.apache.axis2.async.AsyncServiceTest
>    [junit] Tests run: 1, Failures: 0, Errors: 0, Time elapsed: 11.937 sec
>    [junit] Running org.apache.axis2.engine.CallUnregisteredServiceTest
>    [junit] Tests run: 1, Failures: 0, Errors: 0, Time elapsed: 4.828 sec
>    [junit] Running org.apache.axis2.engine.CharactersetEncodingTest
>    [junit] Tests run: 11, Failures: 0, Errors: 0, Time elapsed: 8.25 sec
>    [junit] Running org.apache.axis2.engine.CommonsHTTPEchoRawXMLTest
>    [junit] Tests run: 2, Failures: 0, Errors: 0, Time elapsed: 8.453 sec
>    [junit] Running org.apache.axis2.engine.EchoRawRuntimeProxyTest
>    [junit] Tests run: 1, Failures: 0, Errors: 0, Time elapsed: 7.656 sec
>    [junit] Running org.apache.axis2.engine.EchoRawXMLChunkedTest
>    [junit] Tests run: 1, Failures: 0, Errors: 0, Time elapsed: 4.703 sec
>    [junit] Running org.apache.axis2.engine.EchoRawXMLLoadTest
>    [junit] Tests run: 1, Failures: 0, Errors: 0, Time elapsed: 4.844 sec
>    [junit] Running org.apache.axis2.engine.EchoRawXMLMultipleTest
>    [junit] Tests run: 4, Failures: 0, Errors: 0, Time elapsed: 16.375 sec
>    [junit] Running
> org.apache.axis2.engine.EchoRawXMLOnTwoChannelsSyncTest
>    [junit] Tests run: 2, Failures: 0, Errors: 0, Time elapsed: 11.094 sec
>    [junit] Running org.apache.axis2.engine.EchoRawXMLOnTwoChannelsTest
>    [junit] Tests run: 1, Failures: 0, Errors: 0, Time elapsed: 11.484 sec
>    [junit] Running org.apache.axis2.engine.EchoRawXMLTest
>    [junit] Tests run: 4, Failures: 0, Errors: 0, Time elapsed: 8.594 sec
>    [junit] Running org.apache.axis2.engine.FaultHandlingTest
>    [junit] Tests run: 4, Failures: 0, Errors: 0, Time elapsed: 5.187 sec
>    [junit] Running org.apache.axis2.engine.HandlerFailureTest
>    [junit] Tests run: 1, Failures: 0, Errors: 0, Time elapsed: 4.703 sec
>    [junit] Running org.apache.axis2.engine.MessageContextInjectionTest
>    [junit] Tests run: 1, Failures: 0, Errors: 0, Time elapsed: 1.422 sec
>    [junit] Running org.apache.axis2.engine.MessageWithServerTest
>    [junit] Tests run: 1, Failures: 0, Errors: 0, Time elapsed: 3.609 sec
>    [junit] Running org.apache.axis2.engine.OneWayRawXMLTest
>    [junit] Tests run: 1, Failures: 0, Errors: 0, Time elapsed: 8.5 sec
>    [junit] Running org.apache.axis2.engine.ServiceCreateTest
>    [junit] Tests run: 1, Failures: 0, Errors: 0, Time elapsed: 5.387 sec
>    [junit] Running org.apache.axis2.engine.ServiceDispatchingTest
>    [junit] Tests run: 3, Failures: 0, Errors: 0, Time elapsed: 7.923 sec
>    [junit] Running org.apache.axis2.engine.ServiceFaultTest
>    [junit] Tests run: 2, Failures: 0, Errors: 0, Time elapsed: 6.974 sec
>    [junit] Running org.apache.axis2.engine.ServiceGroupContextTest
>    [junit] Tests run: 1, Failures: 0, Errors: 0, Time elapsed: 7.783 sec
>    [junit] Running org.apache.axis2.engine.SOAPversionTest
>    [junit] Tests run: 3, Failures: 0, Errors: 0, Time elapsed: 7.908 sec
>    [junit] Running org.apache.axis2.engine.ThreadingTest
>    [junit] Tests run: 1, Failures: 0, Errors: 0, Time elapsed: 8.142 sec
>    [junit] Running org.apache.axis2.engine.WSDLClientTest
>    [junit] Tests run: 1, Failures: 0, Errors: 0, Time elapsed: 8.998 sec
>    [junit] Running org.apache.axis2.groovy.GroovyServiceTest
>    [junit] Tests run: 2, Failures: 0, Errors: 0, Time elapsed: 11.457 sec
>    [junit] Running org.apache.axis2.mtom.EchoRawMTOMCommonsChunkingTest
>    [junit] Tests run: 1, Failures: 0, Errors: 0, Time elapsed: 9.45 sec
>    [junit] Running org.apache.axis2.mtom.EchoRawMTOMFaultReportTest
>    [junit] Tests run: 1, Failures: 0, Errors: 0, Time elapsed: 4.328 sec
>    [junit] Running org.apache.axis2.mtom.EchoRawMTOMFileCacheLoadTest
>    [junit] Tests run: 1, Failures: 0, Errors: 0, Time elapsed: 8.686 sec
>    [junit] Running org.apache.axis2.mtom.EchoRawMTOMFileCacheTest
>    [junit] Tests run: 2, Failures: 0, Errors: 0, Time elapsed: 10.305 sec
>    [junit] Running org.apache.axis2.mtom.EchoRawMTOMLoadTest
>    [junit] Tests run: 1, Failures: 0, Errors: 0, Time elapsed: 8.655 sec
>    [junit] Running org.apache.axis2.mtom.EchoRawMTOMStreamingTest
>    [junit] Tests run: 1, Failures: 0, Errors: 0, Time elapsed: 7.705 sec
>    [junit] Running org.apache.axis2.mtom.EchoRawMTOMTest
>    [junit] Tests run: 2, Failures: 0, Errors: 0, Time elapsed: 10.057 sec
>    [junit] Running org.apache.axis2.mtom.EchoRawMTOMToBase64Test
>    [junit] Tests run: 2, Failures: 0, Errors: 0, Time elapsed: 9.107 sec
>    [junit] Running org.apache.axis2.om.OMAttributeTest
>    [junit] Tests run: 1, Failures: 0, Errors: 0, Time elapsed: 1.853 sec
>    [junit] Running
> org.apache.axis2.processingModel.SoapProcessingModelTest
>    [junit] Tests run: 1, Failures: 0, Errors: 0, Time elapsed: 4.732 sec
>    [junit] Running org.apache.axis2.rpc.MultirefTest
>    [junit] Tests run: 9, Failures: 0, Errors: 0, Time elapsed: 25.468 sec
>    [junit] Running org.apache.axis2.rpc.RPCCallTest
>    [junit] Tests run: 21, Failures: 0, Errors: 0, Time elapsed: 49.27 sec
>    [junit] Running org.apache.axis2.security.AddressingMTOMSecurityTest
>    [junit] Tests run: 2, Failures: 2, Errors: 0, Time elapsed: 11.753 sec
>    [junit] [ERROR] TEST
> org.apache.axis2.security.AddressingMTOMSecurityTest FA
> ILED
>    [junit] Running org.apache.axis2.security.MTOMOptimizedSecurityTest
>    [junit] Tests run: 2, Failures: 2, Errors: 0, Time elapsed: 11.131 sec
>    [junit] [ERROR] TEST
> org.apache.axis2.security.MTOMOptimizedSecurityTest FAI
> LED
>    [junit] Running org.apache.axis2.security.sc.ConversationScenario1Test
>    [junit] Tests run: 1, Failures: 1, Errors: 0, Time elapsed: 9.122 sec
>    [junit] [ERROR] TEST
> org.apache.axis2.security.sc.ConversationScenario1Test
> FAILED
>    [junit] Running org.apache.axis2.security.sc.ConversationScenario2Test
>    [junit] Tests run: 1, Failures: 1, Errors: 0, Time elapsed: 11.581 sec
>    [junit] [ERROR] TEST
> org.apache.axis2.security.sc.ConversationScenario2Test
> FAILED
>    [junit] Running org.apache.axis2.security.sc.ConversationScenario3Test
>    [junit] Tests run: 1, Failures: 1, Errors: 0, Time elapsed: 6.834 sec
>    [junit] [ERROR] TEST
> org.apache.axis2.security.sc.ConversationScenario3Test
> FAILED
>    [junit] Running org.apache.axis2.security.sc.ConversationScenario4Test
>    [junit] Tests run: 1, Failures: 1, Errors: 0, Time elapsed: 8.982 sec
>    [junit] [ERROR] TEST
> org.apache.axis2.security.sc.ConversationScenario4Test
> FAILED
>    [junit] Running org.apache.axis2.security.Scenario1Test
>    [junit] Tests run: 2, Failures: 0, Errors: 0, Time elapsed: 14.269 sec
>    [junit] Running org.apache.axis2.security.Scenario2aTest
>    [junit] Tests run: 2, Failures: 2, Errors: 0, Time elapsed: 12.728 sec
>    [junit] [ERROR] TEST org.apache.axis2.security.Scenario2aTest FAILED
>    [junit] Running org.apache.axis2.security.Scenario2Test
>    [junit] Tests run: 2, Failures: 2, Errors: 0, Time elapsed: 13.305 sec
>    [junit] [ERROR] TEST org.apache.axis2.security.Scenario2Test FAILED
>    [junit] Running org.apache.axis2.security.Scenario3Test
>    [junit] Tests run: 2, Failures: 2, Errors: 0, Time elapsed: 15.703 sec
>    [junit] [ERROR] TEST org.apache.axis2.security.Scenario3Test FAILED
>    [junit] Running org.apache.axis2.security.Scenario4Test
>    [junit] Tests run: 2, Failures: 2, Errors: 0, Time elapsed: 13.819 sec
>    [junit] [ERROR] TEST org.apache.axis2.security.Scenario4Test FAILED
>    [junit] Running org.apache.axis2.security.Scenario5Test
>    [junit] Tests run: 2, Failures: 0, Errors: 0, Time elapsed: 15.377 sec
>    [junit] Running org.apache.axis2.security.Scenario6Test
>    [junit] Tests run: 2, Failures: 2, Errors: 0, Time elapsed: 12.385 sec
>    [junit] [ERROR] TEST org.apache.axis2.security.Scenario6Test FAILED
>    [junit] Running org.apache.axis2.security.Scenario7Test
>    [junit] Tests run: 2, Failures: 2, Errors: 0, Time elapsed: 12.869 sec
>    [junit] [ERROR] TEST org.apache.axis2.security.Scenario7Test FAILED
>    [junit] Running org.apache.axis2.swa.EchoRawSwATest
>    [junit] Tests run: 1, Failures: 0, Errors: 0, Time elapsed: 4.082 sec
>    [junit] Running org.apache.axis2.tcp.TCPEchoRawXMLTest
>    [junit] Tests run: 4, Failures: 0, Errors: 0, Time elapsed: 8.756 sec
>    [junit] Running org.apache.axis2.tcp.TCPTwoChannelEchoRawXMLTest
>    [junit] Tests run: 1, Failures: 0, Errors: 0, Time elapsed: 3.459 sec
>    [junit] Running org.apache.rahas.RahasSAMLTokenTest
>    [junit] Tests run: 1, Failures: 1, Errors: 0, Time elapsed: 12.962 sec
>    [junit] [ERROR] TEST org.apache.rahas.RahasSAMLTokenTest FAILED
>    [junit] Running samples.wsdl.perf.PerfPortTypeTest
>    [junit] Tests run: 1, Failures: 0, Errors: 0, Time elapsed: 17.34 sec
>
> BUILD FAILED
> File...... C:\Documents and
> Settings\xinjun\.maven\cache\maven-multiproject-plug
> in-1.3.1\plugin.jelly
> Element... maven:reactor
> Line...... 217
> Column.... 9
> Unable to obtain goal [multiproject:install-callback] -- C:\Documents
> and Settin
> gs\xinjun\.maven\cache\maven-test-plugin-1.6.2\plugin.jelly:181:54:
> <fail> There
> were test failures.
> Total time: 27 minutes 59 seconds
> Finished at: Thu Jun 29 17:43:19 SGT 2006
>
>
> Anyone else has the same problem?
>
>
> Regards,
> Xinjun
>
> On 6/19/06, Mike_McAngus@wendys.com <Mike_McAngus@wendys.com> wrote:
>
>>
>> Chinthaka,
>>
>> I was less complete than I could have been with regard to the "Response
>> content length is not know" message.
>>
>> For each attempted download, this message occurred 3 times.
>>
>>
>>
>> Mike McAngus
>> Associate Chief Engineer, Enterprise Architecture
>> Wendy's International, Inc.
>> One Dave Thomas Boulevard
>> Dublin, OH 43017
>>
>>
>>
>>
>> Eran Chinthaka wrote:
>>
>> Hi Mike,
>>
>> Mike_McAngus wrote:
>> [snip]
>>
>> > III.  Regardless of whether or not a successful download occurred, the
>> > message "Response content length is not known" for each attempt.
>>
>> Sorry I do not know anything about this.
>>
>>
>> > III.  Regardless of whether or not a successful download occurred, the
>> > message "Response content length is not known" for each attempt.
>>
>> Sorry I do not know anything about this.
>>
>>
>
> ---------------------------------------------------------------------
> To unsubscribe, e-mail: axis-dev-unsubscribe@ws.apache.org
> For additional commands, e-mail: axis-dev-help@ws.apache.org
>
>
>

-- 
Thanks,
Deepal
................................................................
~Future is Open~ 



---------------------------------------------------------------------
To unsubscribe, e-mail: axis-dev-unsubscribe@ws.apache.org
For additional commands, e-mail: axis-dev-help@ws.apache.org


Mime
View raw message