axis-java-dev mailing list archives

Site index · List index
Message view « Date » · « Thread »
Top « Date » · « Thread »
From "Venkata Krishnan" <for.svkr...@gmail.com>
Subject Build failure!
Date Wed, 26 Apr 2006 12:24:30 GMT
Hello... I have been trying to build Axis2... can somebody help me in
identifying the problem...  thanks.

- I am using Java 1.5 and have made the relevant changes to the security
providers list as mentioned in the FAQ
- The build fails and here is a section of the the trace that I got....

+----------------------------------------
| Executing multiproject:install-callback Apache Axis 2.0 - SAAJ
| Memory: 26M/103M
+----------------------------------------
Attempting to download axiom-api-SNAPSHOT.jar.
234K downloaded
Attempting to download axis2-java2wsdl-SNAPSHOT.jar.
39K downloaded
Attempting to download axiom-impl-SNAPSHOT.jar.
Error retrieving artifact from [
http://cvs.apache.org/repository/ws-commons/jars
/axiom-impl-SNAPSHOT.jar]: java.net.ConnectException: Connection timed out:
conn
ect
Error retrieving artifact from [
http://www.apache.org/dist/java-repository/ws-co
mmons/jars/axiom-impl-SNAPSHOT.jar]: java.net.ConnectException: Connection
timed
 out: connect
Artifact /ws-commons/jars/axiom-impl-SNAPSHOT.jar doesn't exists in remote
repos
itory, but it exists locally
Attempting to download axiom-dom-SNAPSHOT.jar.
Error retrieving artifact from [
http://cvs.apache.org/repository/ws-commons/jars
/axiom-dom-SNAPSHOT.jar]: java.net.ConnectException: Connection timed out:
conne
ct
Error retrieving artifact from [
http://www.apache.org/dist/java-repository/ws-co
mmons/jars/axiom-dom-SNAPSHOT.jar]: java.net.ConnectException: Connection
timed
out: connect
Artifact /ws-commons/jars/axiom-dom-SNAPSHOT.jar doesn't exists in remote
reposi
tory, but it exists locally
Attempting to download axis2-core-SNAPSHOT.jar.
Error retrieving artifact from [
http://people.apache.org/~chinthaka/maven/axis2/
jars/axis2-core-SNAPSHOT.jar]: java.net.ConnectException: Connection timed
out:
connect
Error retrieving artifact from [
http://cvs.apache.org/repository/axis2/jars/axis
2-core-SNAPSHOT.jar]: java.net.ConnectException: Connection timed out:
connect
Error retrieving artifact from [
http://www.apache.org/dist/java-repository/axis2
/jars/axis2-core-SNAPSHOT.jar]: java.net.ConnectException: Connection timed
out:
 connect
Artifact /axis2/jars/axis2-core-SNAPSHOT.jar doesn't exists in remote
repository
, but it exists locally
Attempting to download axis2-adb-SNAPSHOT.jar.
107K downloaded
Error retrieving artifact from [
http://www.apache.org/dist/java-repository/axis2
/jars/axis2-adb-SNAPSHOT.jar]: java.net.ConnectException: Connection timed
out:
connect
Attempting to download axis2-addressing-SNAPSHOT.jar.
15K downloaded
Attempting to download axis2-common-SNAPSHOT.jar.
42K downloaded
Attempting to download policy-SNAPSHOT.jar.
42K downloaded
Error retrieving artifact from [
http://www.apache.org/dist/java-repository/ws-co
mmons/jars/policy-SNAPSHOT.jar]: java.net.ConnectException: Connection timed
out
: connect
Attempting to download XmlSchema-SNAPSHOT.jar.
Error retrieving artifact from [
http://people.apache.org/~chinthaka/maven/ws-com
mons/jars/XmlSchema-SNAPSHOT.jar]: java.net.ConnectException: Connection
timed o
ut: connect
Error retrieving artifact from [
http://cvs.apache.org/repository/ws-commons/jars
/XmlSchema-SNAPSHOT.jar]: java.net.ConnectException: Connection timed out:
conne
ct
Error retrieving artifact from [
http://www.apache.org/dist/java-repository/ws-co
mmons/jars/XmlSchema-SNAPSHOT.jar]: java.net.ConnectException: Connection
timed
out: connect
Artifact /ws-commons/jars/XmlSchema-SNAPSHOT.jar doesn't exists in remote
reposi
tory, but it exists locally

jar:install:


build:end:

build:start:

multiproject:install-callback:
    [echo] Running jar:install for Apache Axis 2.0 - SAAJ
java:prepare-filesystem:

java:compile:
    [echo] Compiling to F:\Axis2Latest\modules\saaj/target/classes

java:jar-resources:

test:prepare-filesystem:

test:test-resources:

test:compile:

test:test:
    [junit] Running org.apache.axis2.saaj.AttachmentSerializationTest
    [junit] Tests run: 1, Failures: 0, Errors: 0, Time elapsed: 3.715 sec
    [junit] Running org.apache.axis2.saaj.AttachmentTest
    [junit] Tests run: 3, Failures: 0, Errors: 0, Time elapsed: 12.248 sec
    [junit] Running org.apache.axis2.saaj.integration.IntegrationTest
    [junit] Tests run: 3, Failures: 0, Errors: 1, Time elapsed: 18.783 sec
    [junit] [ERROR] TEST org.apache.axis2.saaj.integration.IntegrationTestFAILE
D
    [junit] Running org.apache.axis2.saaj.MessageFactoryTest
    [junit] Tests run: 2, Failures: 0, Errors: 0, Time elapsed: 4.177 sec
    [junit] Running org.apache.axis2.saaj.NodeTest
    [junit] Tests run: 5, Failures: 0, Errors: 0, Time elapsed: 2.841 sec
    [junit] Running org.apache.axis2.saaj.PrefixesTest
    [junit] Tests run: 2, Failures: 0, Errors: 0, Time elapsed: 4.106 sec
    [junit] Running org.apache.axis2.saaj.SOAPBodyTest
    [junit] Tests run: 2, Failures: 0, Errors: 0, Time elapsed: 3.374 sec
    [junit] Running org.apache.axis2.saaj.SOAPConnectionTest
    [junit] Tests run: 3, Failures: 0, Errors: 0, Time elapsed: 1.777 sec
    [junit] Running org.apache.axis2.saaj.SOAPElementTest
    [junit] Tests run: 11, Failures: 0, Errors: 0, Time elapsed: 2.921 sec
    [junit] Running org.apache.axis2.saaj.SOAPEnvelopeTest
    [junit] Tests run: 17, Failures: 0, Errors: 0, Time elapsed: 4.478 sec
    [junit] Running org.apache.axis2.saaj.SOAPFactoryTest
    [junit] Tests run: 1, Failures: 0, Errors: 0, Time elapsed: 2.058 sec
    [junit] Running org.apache.axis2.saaj.SOAPFaultDetailTest
    [junit] Tests run: 1, Failures: 0, Errors: 0, Time elapsed: 4.016 sec
    [junit] Running org.apache.axis2.saaj.SOAPFaultTest
    [junit] Tests run: 6, Failures: 0, Errors: 0, Time elapsed: 3.474 sec
    [junit] Running org.apache.axis2.saaj.SOAPHeaderTest
    [junit] Tests run: 3, Failures: 0, Errors: 0, Time elapsed: 3.483 sec
    [junit] Running org.apache.axis2.saaj.SOAPMessageTest
    [junit] Tests run: 2, Failures: 0, Errors: 0, Time elapsed: 2.68 sec
    [junit] Running org.apache.axis2.saaj.SOAPNamespaceTest
    [junit] Tests run: 1, Failures: 0, Errors: 0, Time elapsed: 3.965 sec
    [junit] Running org.apache.axis2.saaj.SOAPPartTest
    [junit] Tests run: 2, Failures: 0, Errors: 0, Time elapsed: 3.453 sec
    [junit] Running org.apache.axis2.saaj.TextTest
    [junit] Tests run: 2, Failures: 0, Errors: 0, Time elapsed: 4.277 sec

BUILD FAILED
com.werken.werkz.UnattainableGoalException: Unable to obtain goal
[multiproject:
install-callback] -- C:\Documents and
Settings\Administrator\.maven\cache\maven-
test-plugin-1.6.2\plugin.jelly:181:54: <fail> There were test failures.
        at com.werken.werkz.Goal.fire(Goal.java:646)
        at com.werken.werkz.Goal.attain(Goal.java:575)
        at org.apache.maven.plugin.PluginManager.attainGoals(
PluginManager.java:
671)
        at org.apache.maven.MavenSession.attainGoals(MavenSession.java:263)
        at org.apache.maven.jelly.tags.maven.ReactorTag.doTag(
ReactorTag.java:36
8)
        at org.apache.commons.jelly.impl.TagScript.run(TagScript.java:279)
        at org.apache.commons.jelly.impl.ScriptBlock.run(ScriptBlock.java
:135)
        at org.apache.maven.jelly.tags.werkz.MavenGoalTag.runBodyTag
(MavenGoalTa
g.java:79)
        at
org.apache.maven.jelly.tags.werkz.MavenGoalTag$MavenGoalAction.perfor
mAction(MavenGoalTag.java:110)
        at com.werken.werkz.Goal.fire(Goal.java:639)
        at com.werken.werkz.Goal.attain(Goal.java:575)
        at com.werken.werkz.WerkzProject.attainGoal(WerkzProject.java:193)
        at org.apache.maven.jelly.tags.werkz.MavenAttainGoalTag.doTag
(MavenAttai
nGoalTag.java:127)
        at org.apache.commons.jelly.impl.TagScript.run(TagScript.java:279)
        at org.apache.commons.jelly.impl.ScriptBlock.run(ScriptBlock.java
:135)
        at org.apache.maven.jelly.tags.werkz.MavenGoalTag.runBodyTag
(MavenGoalTa
g.java:79)
        at
org.apache.maven.jelly.tags.werkz.MavenGoalTag$MavenGoalAction.perfor
mAction(MavenGoalTag.java:110)
        at com.werken.werkz.Goal.fire(Goal.java:639)
        at com.werken.werkz.Goal.attain(Goal.java:575)
        at com.werken.werkz.WerkzProject.attainGoal(WerkzProject.java:193)
        at org.apache.maven.jelly.tags.werkz.MavenAttainGoalTag.doTag
(MavenAttai
nGoalTag.java:127)
        at org.apache.commons.jelly.impl.TagScript.run(TagScript.java:279)
        at org.apache.commons.jelly.impl.ScriptBlock.run(ScriptBlock.java
:135)
        at org.apache.maven.jelly.tags.werkz.MavenGoalTag.runBodyTag
(MavenGoalTa
g.java:79)
        at
org.apache.maven.jelly.tags.werkz.MavenGoalTag$MavenGoalAction.perfor
mAction(MavenGoalTag.java:110)
        at com.werken.werkz.Goal.fire(Goal.java:639)
        at com.werken.werkz.Goal.attain(Goal.java:575)
        at com.werken.werkz.Goal.attainPrecursors(Goal.java:488)
        at com.werken.werkz.Goal.attain(Goal.java:573)
        at org.apache.maven.plugin.PluginManager.attainGoals(
PluginManager.java:
671)
        at org.apache.maven.MavenSession.attainGoals(MavenSession.java:263)
        at org.apache.maven.cli.App.doMain(App.java:488)
        at org.apache.maven.cli.App.main(App.java:1239)
        at sun.reflect.NativeMethodAccessorImpl.invoke0(Native Method)
        at sun.reflect.NativeMethodAccessorImpl.invoke
(NativeMethodAccessorImpl.
java:39)
        at sun.reflect.DelegatingMethodAccessorImpl.invoke
(DelegatingMethodAcces
sorImpl.java:25)
        at java.lang.reflect.Method.invoke(Method.java:585)
        at com.werken.forehead.Forehead.run(Forehead.java:551)
        at com.werken.forehead.Forehead.main(Forehead.java:581)
org.apache.commons.jelly.JellyTagException: C:\Documents and
Settings\Administra
tor\.maven\cache\maven-test-plugin-1.6.2\plugin.jelly:181:54: <fail> There
were
test failures.
        at org.apache.commons.jelly.impl.TagScript.handleException(
TagScript.jav
a:683)
        at org.apache.commons.jelly.impl.TagScript.run(TagScript.java:288)
        at org.apache.commons.jelly.impl.ScriptBlock.run(ScriptBlock.java
:135)
        at org.apache.commons.jelly.TagSupport.invokeBody(TagSupport.java
:233)
        at org.apache.commons.jelly.tags.core.IfTag.doTag(IfTag.java:88)
        at org.apache.commons.jelly.impl.TagScript.run(TagScript.java:279)
        at org.apache.commons.jelly.impl.ScriptBlock.run(ScriptBlock.java
:135)
        at org.apache.commons.jelly.TagSupport.invokeBody(TagSupport.java
:233)
        at org.apache.commons.jelly.tags.core.IfTag.doTag(IfTag.java:88)
        at org.apache.commons.jelly.impl.TagScript.run(TagScript.java:279)
        at org.apache.commons.jelly.impl.ScriptBlock.run(ScriptBlock.java
:135)
        at org.apache.commons.jelly.TagSupport.invokeBody(TagSupport.java
:233)
        at org.apache.commons.jelly.tags.core.IfTag.doTag(IfTag.java:88)
        at org.apache.commons.jelly.impl.TagScript.run(TagScript.java:279)
        at org.apache.commons.jelly.impl.ScriptBlock.run(ScriptBlock.java
:135)
        at org.apache.maven.jelly.tags.werkz.MavenGoalTag.runBodyTag
(MavenGoalTa
g.java:79)
        at
org.apache.maven.jelly.tags.werkz.MavenGoalTag$MavenGoalAction.perfor
mAction(MavenGoalTag.java:110)
        at com.werken.werkz.Goal.fire(Goal.java:639)
        at com.werken.werkz.Goal.attain(Goal.java:575)
        at com.werken.werkz.Goal.attainPrecursors(Goal.java:488)
        at com.werken.werkz.Goal.attain(Goal.java:573)
        at com.werken.werkz.Goal.attainPrecursors(Goal.java:488)
        at com.werken.werkz.Goal.attain(Goal.java:573)
        at com.werken.werkz.WerkzProject.attainGoal(WerkzProject.java:193)
        at org.apache.maven.jelly.tags.werkz.MavenAttainGoalTag.doTag
(MavenAttai
nGoalTag.java:127)
        at org.apache.commons.jelly.impl.TagScript.run(TagScript.java:279)
        at org.apache.commons.jelly.impl.ScriptBlock.run(ScriptBlock.java
:135)
        at org.apache.maven.jelly.tags.werkz.MavenGoalTag.runBodyTag
(MavenGoalTa
g.java:79)
        at
org.apache.maven.jelly.tags.werkz.MavenGoalTag$MavenGoalAction.perfor
mAction(MavenGoalTag.java:110)
        at com.werken.werkz.Goal.fire(Goal.java:639)
        at com.werken.werkz.Goal.attain(Goal.java:575)
        at org.apache.maven.plugin.PluginManager.attainGoals(
PluginManager.java:
671)
        at org.apache.maven.MavenSession.attainGoals(MavenSession.java:263)
        at org.apache.maven.jelly.tags.maven.ReactorTag.doTag(
ReactorTag.java:36
8)
        at org.apache.commons.jelly.impl.TagScript.run(TagScript.java:279)
        at org.apache.commons.jelly.impl.ScriptBlock.run(ScriptBlock.java
:135)
        at org.apache.maven.jelly.tags.werkz.MavenGoalTag.runBodyTag
(MavenGoalTa
g.java:79)
        at
org.apache.maven.jelly.tags.werkz.MavenGoalTag$MavenGoalAction.perfor
mAction(MavenGoalTag.java:110)
        at com.werken.werkz.Goal.fire(Goal.java:639)
        at com.werken.werkz.Goal.attain(Goal.java:575)
        at com.werken.werkz.WerkzProject.attainGoal(WerkzProject.java:193)
        at org.apache.maven.jelly.tags.werkz.MavenAttainGoalTag.doTag
(MavenAttai
nGoalTag.java:127)
        at org.apache.commons.jelly.impl.TagScript.run(TagScript.java:279)
        at org.apache.commons.jelly.impl.ScriptBlock.run(ScriptBlock.java
:135)
        at org.apache.maven.jelly.tags.werkz.MavenGoalTag.runBodyTag
(MavenGoalTa
g.java:79)
        at
org.apache.maven.jelly.tags.werkz.MavenGoalTag$MavenGoalAction.perfor
mAction(MavenGoalTag.java:110)
        at com.werken.werkz.Goal.fire(Goal.java:639)
        at com.werken.werkz.Goal.attain(Goal.java:575)
        at com.werken.werkz.WerkzProject.attainGoal(WerkzProject.java:193)
        at org.apache.maven.jelly.tags.werkz.MavenAttainGoalTag.doTag
(MavenAttai
nGoalTag.java:127)
        at org.apache.commons.jelly.impl.TagScript.run(TagScript.java:279)
        at org.apache.commons.jelly.impl.ScriptBlock.run(ScriptBlock.java
:135)
        at org.apache.maven.jelly.tags.werkz.MavenGoalTag.runBodyTag
(MavenGoalTa
g.java:79)
        at
org.apache.maven.jelly.tags.werkz.MavenGoalTag$MavenGoalAction.perfor
mAction(MavenGoalTag.java:110)
        at com.werken.werkz.Goal.fire(Goal.java:639)
        at com.werken.werkz.Goal.attain(Goal.java:575)
        at com.werken.werkz.Goal.attainPrecursors(Goal.java:488)
        at com.werken.werkz.Goal.attain(Goal.java:573)
        at org.apache.maven.plugin.PluginManager.attainGoals(
PluginManager.java:
671)
        at org.apache.maven.MavenSession.attainGoals(MavenSession.java:263)
        at org.apache.maven.cli.App.doMain(App.java:488)
        at org.apache.maven.cli.App.main(App.java:1239)
        at sun.reflect.NativeMethodAccessorImpl.invoke0(Native Method)
        at sun.reflect.NativeMethodAccessorImpl.invoke
(NativeMethodAccessorImpl.
java:39)
        at sun.reflect.DelegatingMethodAccessorImpl.invoke
(DelegatingMethodAcces
sorImpl.java:25)
        at java.lang.reflect.Method.invoke(Method.java:585)
        at com.werken.forehead.Forehead.run(Forehead.java:551)
        at com.werken.forehead.Forehead.main(Forehead.java:581)
Caused by: There were test failures.
        at org.apache.tools.ant.taskdefs.Exit.execute(Exit.java:104)
        at org.apache.tools.ant.Task.perform(Task.java:341)
        at org.apache.commons.jelly.tags.ant.AntTag.doTag(AntTag.java:185)
        at org.apache.commons.jelly.impl.TagScript.run(TagScript.java:279)
        ... 66 more
Root cause
There were test failures.
        at org.apache.tools.ant.taskdefs.Exit.execute(Exit.java:104)
        at org.apache.tools.ant.Task.perform(Task.java:341)
        at org.apache.commons.jelly.tags.ant.AntTag.doTag(AntTag.java:185)
        at org.apache.commons.jelly.impl.TagScript.run(TagScript.java:279)
        at org.apache.commons.jelly.impl.ScriptBlock.run(ScriptBlock.java
:135)
        at org.apache.commons.jelly.TagSupport.invokeBody(TagSupport.java
:233)
        at org.apache.commons.jelly.tags.core.IfTag.doTag(IfTag.java:88)
        at org.apache.commons.jelly.impl.TagScript.run(TagScript.java:279)
        at org.apache.commons.jelly.impl.ScriptBlock.run(ScriptBlock.java
:135)
        at org.apache.commons.jelly.TagSupport.invokeBody(TagSupport.java
:233)
        at org.apache.commons.jelly.tags.core.IfTag.doTag(IfTag.java:88)
        at org.apache.commons.jelly.impl.TagScript.run(TagScript.java:279)
        at org.apache.commons.jelly.impl.ScriptBlock.run(ScriptBlock.java
:135)
        at org.apache.commons.jelly.TagSupport.invokeBody(TagSupport.java
:233)
        at org.apache.commons.jelly.tags.core.IfTag.doTag(IfTag.java:88)
        at org.apache.commons.jelly.impl.TagScript.run(TagScript.java:279)
        at org.apache.commons.jelly.impl.ScriptBlock.run(ScriptBlock.java
:135)
        at org.apache.maven.jelly.tags.werkz.MavenGoalTag.runBodyTag
(MavenGoalTa
g.java:79)
        at
org.apache.maven.jelly.tags.werkz.MavenGoalTag$MavenGoalAction.perfor
mAction(MavenGoalTag.java:110)
        at com.werken.werkz.Goal.fire(Goal.java:639)
        at com.werken.werkz.Goal.attain(Goal.java:575)
        at com.werken.werkz.Goal.attainPrecursors(Goal.java:488)
        at com.werken.werkz.Goal.attain(Goal.java:573)
        at com.werken.werkz.Goal.attainPrecursors(Goal.java:488)
        at com.werken.werkz.Goal.attain(Goal.java:573)
        at com.werken.werkz.WerkzProject.attainGoal(WerkzProject.java:193)
        at org.apache.maven.jelly.tags.werkz.MavenAttainGoalTag.doTag
(MavenAttai
nGoalTag.java:127)
        at org.apache.commons.jelly.impl.TagScript.run(TagScript.java:279)
        at org.apache.commons.jelly.impl.ScriptBlock.run(ScriptBlock.java
:135)
        at org.apache.maven.jelly.tags.werkz.MavenGoalTag.runBodyTag
(MavenGoalTa
g.java:79)
        at
org.apache.maven.jelly.tags.werkz.MavenGoalTag$MavenGoalAction.perfor
mAction(MavenGoalTag.java:110)
        at com.werken.werkz.Goal.fire(Goal.java:639)
        at com.werken.werkz.Goal.attain(Goal.java:575)
        at org.apache.maven.plugin.PluginManager.attainGoals(
PluginManager.java:
671)
        at org.apache.maven.MavenSession.attainGoals(MavenSession.java:263)
        at org.apache.maven.jelly.tags.maven.ReactorTag.doTag(
ReactorTag.java:36
8)
        at org.apache.commons.jelly.impl.TagScript.run(TagScript.java:279)
        at org.apache.commons.jelly.impl.ScriptBlock.run(ScriptBlock.java
:135)
        at org.apache.maven.jelly.tags.werkz.MavenGoalTag.runBodyTag
(MavenGoalTa
g.java:79)
        at
org.apache.maven.jelly.tags.werkz.MavenGoalTag$MavenGoalAction.perfor
mAction(MavenGoalTag.java:110)
        at com.werken.werkz.Goal.fire(Goal.java:639)
        at com.werken.werkz.Goal.attain(Goal.java:575)
        at com.werken.werkz.WerkzProject.attainGoal(WerkzProject.java:193)
        at org.apache.maven.jelly.tags.werkz.MavenAttainGoalTag.doTag
(MavenAttai
nGoalTag.java:127)
        at org.apache.commons.jelly.impl.TagScript.run(TagScript.java:279)
        at org.apache.commons.jelly.impl.ScriptBlock.run(ScriptBlock.java
:135)
        at org.apache.maven.jelly.tags.werkz.MavenGoalTag.runBodyTag
(MavenGoalTa
g.java:79)
        at
org.apache.maven.jelly.tags.werkz.MavenGoalTag$MavenGoalAction.perfor
mAction(MavenGoalTag.java:110)
        at com.werken.werkz.Goal.fire(Goal.java:639)
        at com.werken.werkz.Goal.attain(Goal.java:575)
        at com.werken.werkz.WerkzProject.attainGoal(WerkzProject.java:193)
        at org.apache.maven.jelly.tags.werkz.MavenAttainGoalTag.doTag
(MavenAttai
nGoalTag.java:127)
        at org.apache.commons.jelly.impl.TagScript.run(TagScript.java:279)
        at org.apache.commons.jelly.impl.ScriptBlock.run(ScriptBlock.java
:135)
        at org.apache.maven.jelly.tags.werkz.MavenGoalTag.runBodyTag
(MavenGoalTa
g.java:79)
        at
org.apache.maven.jelly.tags.werkz.MavenGoalTag$MavenGoalAction.perfor
mAction(MavenGoalTag.java:110)
        at com.werken.werkz.Goal.fire(Goal.java:639)
        at com.werken.werkz.Goal.attain(Goal.java:575)
        at com.werken.werkz.Goal.attainPrecursors(Goal.java:488)
        at com.werken.werkz.Goal.attain(Goal.java:573)
        at org.apache.maven.plugin.PluginManager.attainGoals(
PluginManager.java:
671)
        at org.apache.maven.MavenSession.attainGoals(MavenSession.java:263)
        at org.apache.maven.cli.App.doMain(App.java:488)
        at org.apache.maven.cli.App.main(App.java:1239)
        at sun.reflect.NativeMethodAccessorImpl.invoke0(Native Method)
        at sun.reflect.NativeMethodAccessorImpl.invoke
(NativeMethodAccessorImpl.
java:39)
        at sun.reflect.DelegatingMethodAccessorImpl.invoke
(DelegatingMethodAcces
sorImpl.java:25)
        at java.lang.reflect.Method.invoke(Method.java:585)
        at com.werken.forehead.Forehead.run(Forehead.java:551)
        at com.werken.forehead.Forehead.main(Forehead.java:581)
Root cause
There were test failures.
        at org.apache.tools.ant.taskdefs.Exit.execute(Exit.java:104)
        at org.apache.tools.ant.Task.perform(Task.java:341)
        at org.apache.commons.jelly.tags.ant.AntTag.doTag(AntTag.java:185)
        at org.apache.commons.jelly.impl.TagScript.run(TagScript.java:279)
        at org.apache.commons.jelly.impl.ScriptBlock.run(ScriptBlock.java
:135)
        at org.apache.commons.jelly.TagSupport.invokeBody(TagSupport.java
:233)
        at org.apache.commons.jelly.tags.core.IfTag.doTag(IfTag.java:88)
        at org.apache.commons.jelly.impl.TagScript.run(TagScript.java:279)
        at org.apache.commons.jelly.impl.ScriptBlock.run(ScriptBlock.java
:135)
        at org.apache.commons.jelly.TagSupport.invokeBody(TagSupport.java
:233)
        at org.apache.commons.jelly.tags.core.IfTag.doTag(IfTag.java:88)
        at org.apache.commons.jelly.impl.TagScript.run(TagScript.java:279)
        at org.apache.commons.jelly.impl.ScriptBlock.run(ScriptBlock.java
:135)
        at org.apache.commons.jelly.TagSupport.invokeBody(TagSupport.java
:233)
        at org.apache.commons.jelly.tags.core.IfTag.doTag(IfTag.java:88)
        at org.apache.commons.jelly.impl.TagScript.run(TagScript.java:279)
        at org.apache.commons.jelly.impl.ScriptBlock.run(ScriptBlock.java
:135)
        at org.apache.maven.jelly.tags.werkz.MavenGoalTag.runBodyTag
(MavenGoalTa
g.java:79)
        at
org.apache.maven.jelly.tags.werkz.MavenGoalTag$MavenGoalAction.perfor
mAction(MavenGoalTag.java:110)
        at com.werken.werkz.Goal.fire(Goal.java:639)
        at com.werken.werkz.Goal.attain(Goal.java:575)
        at com.werken.werkz.Goal.attainPrecursors(Goal.java:488)
        at com.werken.werkz.Goal.attain(Goal.java:573)
        at com.werken.werkz.Goal.attainPrecursors(Goal.java:488)
        at com.werken.werkz.Goal.attain(Goal.java:573)
        at com.werken.werkz.WerkzProject.attainGoal(WerkzProject.java:193)
        at org.apache.maven.jelly.tags.werkz.MavenAttainGoalTag.doTag
(MavenAttai
nGoalTag.java:127)
        at org.apache.commons.jelly.impl.TagScript.run(TagScript.java:279)
        at org.apache.commons.jelly.impl.ScriptBlock.run(ScriptBlock.java
:135)
        at org.apache.maven.jelly.tags.werkz.MavenGoalTag.runBodyTag
(MavenGoalTa
g.java:79)
        at
org.apache.maven.jelly.tags.werkz.MavenGoalTag$MavenGoalAction.perfor
mAction(MavenGoalTag.java:110)
        at com.werken.werkz.Goal.fire(Goal.java:639)
        at com.werken.werkz.Goal.attain(Goal.java:575)
        at org.apache.maven.plugin.PluginManager.attainGoals(
PluginManager.java:
671)
        at org.apache.maven.MavenSession.attainGoals(MavenSession.java:263)
        at org.apache.maven.jelly.tags.maven.ReactorTag.doTag(
ReactorTag.java:36
8)
        at org.apache.commons.jelly.impl.TagScript.run(TagScript.java:279)
        at org.apache.commons.jelly.impl.ScriptBlock.run(ScriptBlock.java
:135)
        at org.apache.maven.jelly.tags.werkz.MavenGoalTag.runBodyTag
(MavenGoalTa
g.java:79)
        at
org.apache.maven.jelly.tags.werkz.MavenGoalTag$MavenGoalAction.perfor
mAction(MavenGoalTag.java:110)
        at com.werken.werkz.Goal.fire(Goal.java:639)
        at com.werken.werkz.Goal.attain(Goal.java:575)
        at com.werken.werkz.WerkzProject.attainGoal(WerkzProject.java:193)
        at org.apache.maven.jelly.tags.werkz.MavenAttainGoalTag.doTag
(MavenAttai
nGoalTag.java:127)
        at org.apache.commons.jelly.impl.TagScript.run(TagScript.java:279)
        at org.apache.commons.jelly.impl.ScriptBlock.run(ScriptBlock.java
:135)
        at org.apache.maven.jelly.tags.werkz.MavenGoalTag.runBodyTag
(MavenGoalTa
g.java:79)
        at
org.apache.maven.jelly.tags.werkz.MavenGoalTag$MavenGoalAction.perfor
mAction(MavenGoalTag.java:110)
        at com.werken.werkz.Goal.fire(Goal.java:639)
        at com.werken.werkz.Goal.attain(Goal.java:575)
        at com.werken.werkz.WerkzProject.attainGoal(WerkzProject.java:193)
        at org.apache.maven.jelly.tags.werkz.MavenAttainGoalTag.doTag
(MavenAttai
nGoalTag.java:127)
        at org.apache.commons.jelly.impl.TagScript.run(TagScript.java:279)
        at org.apache.commons.jelly.impl.ScriptBlock.run(ScriptBlock.java
:135)
        at org.apache.maven.jelly.tags.werkz.MavenGoalTag.runBodyTag
(MavenGoalTa
g.java:79)
        at
org.apache.maven.jelly.tags.werkz.MavenGoalTag$MavenGoalAction.perfor
mAction(MavenGoalTag.java:110)
        at com.werken.werkz.Goal.fire(Goal.java:639)
        at com.werken.werkz.Goal.attain(Goal.java:575)
        at com.werken.werkz.Goal.attainPrecursors(Goal.java:488)
        at com.werken.werkz.Goal.attain(Goal.java:573)
        at org.apache.maven.plugin.PluginManager.attainGoals(
PluginManager.java:
671)
        at org.apache.maven.MavenSession.attainGoals(MavenSession.java:263)
        at org.apache.maven.cli.App.doMain(App.java:488)
        at org.apache.maven.cli.App.main(App.java:1239)
        at sun.reflect.NativeMethodAccessorImpl.invoke0(Native Method)
        at sun.reflect.NativeMethodAccessorImpl.invoke
(NativeMethodAccessorImpl.
java:39)
        at sun.reflect.DelegatingMethodAccessorImpl.invoke
(DelegatingMethodAcces
sorImpl.java:25)
        at java.lang.reflect.Method.invoke(Method.java:585)
        at com.werken.forehead.Forehead.run(Forehead.java:551)
        at com.werken.forehead.Forehead.main(Forehead.java:581)
File...... C:\Documents and
Settings\Administrator\.maven\cache\maven-multiproje
ct-plugin-1.3.1\plugin.jelly
Element... maven:reactor
Line...... 217
Column.... 9
Unable to obtain goal [multiproject:install-callback] -- C:\Documents and
Settin
gs\Administrator\.maven\cache\maven-test-plugin-1.6.2\plugin.jelly:181:54:<fail
> There were test failures.
Total time: 105 minutes 51 seconds
Finished at: Wed Apr 26 17:44:46 IST 2006

Mime
View raw message