axis-java-dev mailing list archives

Site index · List index
Message view « Date » · « Thread »
Top « Date » · « Thread »
From "Srinath Perera" <hemap...@gmail.com>
Subject [Axis2]Axis2 build fail
Date Sat, 04 Mar 2006 14:22:51 GMT
I am getting following errors on the build? Please put  a note to the
list when it is fixed (got a bug fix to check in)
Srinath

[junit] [ERROR] Test org.apache.axis2.security.AddressingMTOMSecurityTest FAILED
    [junit] Running org.apache.axis2.security.MTOMOptimizedSecurityTest
    [junit] Tests run: 2, Failures: 2, Errors: 0, Time elapsed: 9.936 sec
    [junit] [ERROR] Test
org.apache.axis2.security.MTOMOptimizedSecurityTest FAILED
    [junit] Running org.apache.axis2.security.Scenario1Test
    [junit] Tests run: 2, Failures: 0, Errors: 0, Time elapsed: 7.116 sec
    [junit] Running org.apache.axis2.security.Scenario2Test
    [junit] Tests run: 2, Failures: 2, Errors: 0, Time elapsed: 9.788 sec
    [junit] [ERROR] Test org.apache.axis2.security.Scenario2Test FAILED
    [junit] Running org.apache.axis2.security.Scenario2aTest
    [junit] Tests run: 2, Failures: 2, Errors: 0, Time elapsed: 9.988 sec
    [junit] [ERROR] Test org.apache.axis2.security.Scenario2aTest FAILED
    [junit] Running org.apache.axis2.security.Scenario3Test
    [junit] Tests run: 2, Failures: 2, Errors: 0, Time elapsed: 9.902 sec
    [junit] [ERROR] Test org.apache.axis2.security.Scenario3Test FAILED
    [junit] Running org.apache.axis2.security.Scenario4Test
    [junit] Tests run: 2, Failures: 2, Errors: 0, Time elapsed: 9.774 sec
    [junit] [ERROR] Test org.apache.axis2.security.Scenario4Test FAILED
    [junit] Running org.apache.axis2.security.Scenario5Test
    [junit] Tests run: 2, Failures: 0, Errors: 0, Time elapsed: 7.659 sec
    [junit] Running org.apache.axis2.security.Scenario6Test
    [junit] Tests run: 2, Failures: 2, Errors: 0, Time elapsed: 10.15 sec
    [junit] [ERROR] Test org.apache.axis2.security.Scenario6Test FAILED
    [junit] Running org.apache.axis2.security.Scenario7Test
    [junit] Tests run: 2, Failures: 2, Errors: 0, Time elapsed: 10.037 sec
    [junit] [ERROR] Test org.apache.axis2.security.Scenario7Test FAILED

--
============================
Srinath Perera:
   http://www.cs.indiana.edu/~hperera/
   http://www.bloglines.com/blog/hemapani

Mime
View raw message