axis-java-dev mailing list archives

Site index · List index
Message view « Date » · « Thread »
Top « Date » · « Thread »
From Davanum Srinivas <dava...@gmail.com>
Subject [Axis2] Test Failures
Date Fri, 14 Oct 2005 12:00:26 GMT
Fresh from SVN...any ideas?

test:test:
    [junit] Running org.apache.axis2.handlers.addressing.AddressingInHandlerTest
    [junit] Tests run: 2, Failures: 1, Errors: 0, Time elapsed: 0.438 sec
    [junit] [ERROR] Test
org.apache.axis2.handlers.addressing.AddressingInHandlerTest FAILED
    [junit] Running org.apache.axis2.handlers.addressing.AddressingModuleTest
    [junit] Tests run: 1, Failures: 0, Errors: 0, Time elapsed: 0.688 sec
    [junit] Running
org.apache.axis2.handlers.addressing.AddressingOutHandlerTest
    [junit] Tests run: 2, Failures: 0, Errors: 0, Time elapsed: 0.36 sec

BUILD FAILED
File...... C:\Documents and
Settings\dims\.maven\cache\maven-multiproject-plugin-1.4.1\plugin.jelly
Element... maven:reactor
Line...... 218
Column.... -1
Unable to obtain goal [multiproject:install-callback] -- C:\Documents
and Settings\dims\.maven\cache\maven-test-plugin-1.7\plugin.jelly:183:-1:
<fail> There were test failures.
Total time   : 1 minutes 38 seconds
Finished at  : Friday, October 14, 2005 7:59:52 AM EDT


--
Davanum Srinivas : http://wso2.com/blogs/

Mime
View raw message