axis-java-dev mailing list archives

Site index · List index
Message view « Date » · « Thread »
Top « Date » · « Thread »
From Robert Koberg <...@koberg.com>
Subject maven build fails
Date Sat, 06 Aug 2005 09:38:47 GMT
Hi,

I just checked out the latest axis from subversion. (I am new to maven 
and re-new to axis...). I did:

$ cd $AXIS_HOME/java
$ maven war

I get a build fails with the following information:

BUILD FAILED
File...... 
C:\path\to\.maven\cache\maven-multiproject-plugin-1.3.1\plugin.jelly
Element... maven:reactor
Line...... 217
Column.... 9
Unable to obtain goal [multiproject:install-callback] -- 
C:\path\to\.maven\cache
maven-test-plugin-1.6.2\plugin.jelly:181:54: <fail> There were test 
failures.



     [junit] Running org.apache.axis2.engine.FaultHandlingTest
     [junit] org.apache.axis2.AxisFault: Multiple headers encountered!; 
nested exception is:
     [junit] 
org.apache.axis2.soap.impl.llom.SOAPProcessingException: Multiple 
headers encountered!
     [junit] Tests run: 1, Failures: 0, Errors: 0, Time elapsed: 5.125 sec
     [junit]     at 
org.apache.axis2.transport.http.HTTPTransportUtils.processHTTPPostRequest(HTTPTransportUtil
s.java:190)
     [junit]     at 
org.apache.axis2.transport.http.HTTPWorker.doWork(HTTPWorker.java:125)
     [junit]     at 
org.apache.axis2.util.threadpool.ThreadWorker.run(ThreadWorker.java:34)
     [junit] Caused by: 
org.apache.axis2.soap.impl.llom.SOAPProcessingException: Multiple 
headers encountered!
     [junit]     at 
org.apache.axis2.soap.impl.llom.builder.StAXSOAPModelBuilder.constructNode(StAXSOAPModelBui
lder.java:235)
     [junit]     at 
org.apache.axis2.soap.impl.llom.builder.StAXSOAPModelBuilder.createOMElement(StAXSOAPModelB
uilder.java:189)
     [junit]     at 
org.apache.axis2.om.impl.llom.builder.StAXOMBuilder.next(StAXOMBuilder.java:176)
     [junit]     at 
org.apache.axis2.om.impl.llom.OMElementImpl.buildNext(OMElementImpl.java:478)
     [junit]     at 
org.apache.axis2.om.impl.llom.OMNodeImpl.getNextSibling(OMNodeImpl.java:121)
     [junit]     at 
org.apache.axis2.om.impl.llom.OMElementImpl.getNextSibling(OMElementImpl.java:260)
     [junit]     at 
org.apache.axis2.om.impl.llom.traverse.OMChildrenQNameIterator.next(OMChildrenQNameIterator
.java:100)
     [junit]     at 
org.apache.axis2.om.impl.llom.OMElementImpl.getFirstChildWithName(OMElementImpl.java:221)
     [junit]     at 
org.apache.axis2.soap.impl.llom.SOAPEnvelopeImpl.getHeader(SOAPEnvelopeImpl.java:62)
     [junit]     at 
org.apache.axis2.soap.impl.llom.builder.StAXSOAPModelBuilder.parseHeaders(StAXSOAPModelBuil
der.java:151)
     [junit]     at 
org.apache.axis2.soap.impl.llom.builder.StAXSOAPModelBuilder.<init>(StAXSOAPModelBuilder.ja
va:99)
     [junit] Running org.apache.axis2.engine.HandlerFailureTest
     [junit] Tests run: 1, Failures: 0, Errors: 0, Time elapsed: 4.234 sec
     [junit] org.apache.axis2.AxisFault: Intentional Faliure; nested 
exception is:
     [junit]     org.apache.axis2.AxisFault: Intentional Faliure
     [junit]     at 
org.apache.axis2.transport.http.HTTPTransportUtils.processHTTPPostRequest(HTTPTransportUtil
s.java:193)
     [junit]     at 
org.apache.axis2.transport.http.HTTPWorker.doWork(HTTPWorker.java:125)
     [junit]     at 
org.apache.axis2.util.threadpool.ThreadWorker.run(ThreadWorker.java:34)
     [junit] Caused by: org.apache.axis2.AxisFault: Intentional Faliure
     [junit]     at 
org.apache.axis2.engine.HandlerFailureTest$1.invoke(HandlerFailureTest.java:185)
     [junit]     at org.apache.axis2.engine.Phase.invoke(Phase.java:165)
     [junit]     at 
org.apache.axis2.engine.AxisEngine.invokePhases(AxisEngine.java:423)
     [junit]     at 
org.apache.axis2.engine.AxisEngine.receive(AxisEngine.java:138)
     [junit]     at 
org.apache.axis2.transport.http.HTTPTransportUtils.processHTTPPostRequest(HTTPTransportUtil
s.java:187)
     [junit]     ... 2 more
----------------------------------------------------
and
----------------------------------------------------
     [junit] Running 
org.apache.axis2.processingModel.SoapProcessingModelTest
     [junit] org.apache.axis2.AxisFault: Must Understand check failed; 
nested exception is:
     [junit]     org.apache.axis2.AxisFault: Must Understand check failed
     [junit]     at 
org.apache.axis2.transport.http.HTTPTransportUtils.processHTTPPostRequest(HTTPTransportUtil
s.java:193)
     [junit]     at 
org.apache.axis2.transport.http.HTTPWorker.doWork(HTTPWorker.java:125)
     [junit] Tests run: 1, Failures: 0, Errors: 0, Time elapsed: 3.328 sec
     [junit]     at 
org.apache.axis2.util.threadpool.ThreadWorker.run(ThreadWorker.java:34)
     [junit] Caused by: org.apache.axis2.AxisFault: Must Understand 
check failed
     [junit]     at 
org.apache.axis2.engine.SOAPProcessingModelChecker.invoke(SOAPProcessingModelChecker.java:6
3)
     [junit]     at org.apache.axis2.engine.Phase.invoke(Phase.java:165)
     [junit]     at 
org.apache.axis2.engine.AxisEngine.invokePhases(AxisEngine.java:423)
     [junit]     at 
org.apache.axis2.engine.AxisEngine.receive(AxisEngine.java:138)
     [junit]     at 
org.apache.axis2.transport.http.HTTPTransportUtils.processHTTPPostRequest(HTTPTransportUtil
s.java:187)
     [junit]     ... 2 more


Mime
View raw message