axis-java-dev mailing list archives

Site index · List index
Message view « Date » · « Thread »
Top « Date » · « Thread »
From "Ivo Iken (JIRA)" <j...@apache.org>
Subject [jira] Created: (AXIS2-193) Build problem: 2 tests fails on JDK 1.5 x32
Date Tue, 30 Aug 2005 16:06:07 GMT
Build problem: 2 tests fails on JDK 1.5 x32
-------------------------------------------

         Key: AXIS2-193
         URL: http://issues.apache.org/jira/browse/AXIS2-193
     Project: Apache Axis 2.0 (Axis2)
        Type: Bug
  Components: samples, build,site  & docs  
    Versions: 0.92    
 Environment: Java(TM) 2 Runtime Environment, Standard Edition (build 1.5.0_04-b05)
Java HotSpot(TM) Client VM (build 1.5.0_04-b05, mixed mode, sharing), Maven 1.1, Athlon XP
 Reporter: Ivo Iken
    Priority: Minor


    [junit] Running org.apache.axis2.groovy.GroovyServiceTest
    [junit] Tests run: 2, Failures: 0, Errors: 1, Time elapsed: 9,514 sec
    [junit] [ERROR] Test org.apache.axis2.groovy.GroovyServiceTest FAILED
    
    [junit] Running org.apache.axis2.security.Scenario1Test
    [junit] Tests run: 1, Failures: 0, Errors: 1, Time elapsed: 1,041 sec
    [junit] [ERROR] Test org.apache.axis2.security.Scenario1Test FAILED

BUILD FAILED
File...... C:\Dokumente und Einstellungen\Stormrage\.maven\cache\maven-multiproject-plugin-1.4.1\plugin.jelly
Element... maven:reactor
Line...... 218
Column.... 9
Unable to obtain goal [multiproject:install-callback] -- C:\Dokumente und Einstellungen\Stormrage\.maven\cache
\maven-test-plugin-1.6.2\plugin.jelly:181:54: <fail> There were test failures.
Total time   : 7 minutes 17 seconds
Finished at  : Dienstag, 30. August 2005 16:08:53 CEST

-- 
This message is automatically generated by JIRA.
-
If you think it was sent incorrectly contact one of the administrators:
   http://issues.apache.org/jira/secure/Administrators.jspa
-
For more information on JIRA, see:
   http://www.atlassian.com/software/jira


Mime
View raw message