axis-java-dev mailing list archives

Site index · List index
Message view « Date » · « Thread »
Top « Date » · « Thread »
From "Dennis Sosnoski (JIRA)" <j...@apache.org>
Subject [jira] Created: (AXIS2-159) GroovyServiceTest fails on JDK 1.5 x64
Date Thu, 18 Aug 2005 22:41:54 GMT
GroovyServiceTest fails on JDK 1.5 x64
--------------------------------------

         Key: AXIS2-159
         URL: http://issues.apache.org/jira/browse/AXIS2-159
     Project: Apache Axis 2.0 (Axis2)
        Type: Bug
  Components: samples, build,site  & docs  
    Versions: 0.92    
 Environment: Mandriva64 2005LE, Sun 1.5 JDK (Java HotSpot(TM) 64-Bit Server VM (build 1.5.0_04-b05,
mixed mode)), Maven 1.0.2
    Reporter: Dennis Sosnoski
    Priority: Minor


Build consistently fails on GroovyServiceTest:
    ....
    [junit] Running org.apache.axis2.engine.OneWayRawXMLTest
    [junit] Tests run: 1, Failures: 0, Errors: 0, Time elapsed: 4.778 sec
    [junit] Running org.apache.axis2.groovy.GroovyServiceTest
    [junit] Tests run: 2, Failures: 0, Errors: 1, Time elapsed: 12.458 sec
    [junit] [ERROR] TEST org.apache.axis2.groovy.GroovyServiceTest FAILED
    ....
BUILD FAILED
File...... /home/dennis/.maven/cache/maven-multiproject-plugin-1.3.1/plugin.jelly
Element... maven:reactor
Line...... 217
Column.... 9
Unable to obtain goal [multiproject:install-callback] -- /home/dennis/.maven/cache/maven-test-plugin-1.6.2/plugin.jelly:181:54:
<fail> There were test failures.
Total time: 9 minutes 28 seconds
Finished at: Thu Aug 18 14:22:11 PDT 2005

-- 
This message is automatically generated by JIRA.
-
If you think it was sent incorrectly contact one of the administrators:
   http://issues.apache.org/jira/secure/Administrators.jspa
-
For more information on JIRA, see:
   http://www.atlassian.com/software/jira


Mime
View raw message