axis-java-dev mailing list archives

Site index · List index
Message view « Date » · « Thread »
Top « Date » · « Thread »
From Tom Jordahl <t...@macromedia.com>
Subject RE: [GUMP@lsd]: ws-axis/ws-axis-test failed
Date Fri, 02 Apr 2004 14:44:39 GMT
The error here is:
<testcase classname="test.functional.TestStockSample"
name="testStockService" time="0.131">
    <error message="Fault returned from test: java.io.FileNotFoundException:
jwsClasses/jws/StockQuoteService.java (No such file or directory)"
type="java.lang.Exception">java.lang.Exception: Fault returned from test:
java.io.FileNotFoundException: jwsClasses/jws/StockQuoteService.java (No
such file or directory)
	

Which is a bit confusing.....

Anyone know why 1) it's looking for a .java file or 2) why it can't find it?

--
Tom Jordahl
Macromedia Server Development

-----Original Message-----
From: Davanum Srinivas [mailto:dims@yahoo.com] 
Sent: Friday, April 02, 2004 12:43 AM
To: axis-dev@ws.apache.org
Subject: [GUMP@lsd]: ws-axis/ws-axis-test failed

To whom it may engage...
        
This is an automated request, but not an unsolicited one. For help 
understanding the request please visit 
http://gump.apache.org/nagged.html, 
and/or contact general@gump.apache.org.

Project ws-axis-test has an issue affecting its community integration, and
has been outstanding for 2 runs. The current state is 'Failed', for reason
'Build Failed'

Full details are available at:
http://lsd.student.utwente.nl/gump/ws-axis/ws-axis-test.html, however some
snippets follow:

-  -  -  -  - -- -- ------------------------------------ G U M P

Gump provided these annotations:

 - Info - Dependency on xml-xerces exists, no need to add for property
xercesImpl.jar.
 - Info - Dependency on xml-xerces exists, no need to add for property
xmlParserAPIs.jar.
 - Info - Enable "verbose" output, due to 1 previous error(s).
 - Info - Failed with reason build failed
 - Info - Enable "debug" output, due to build failure.
 - Info - Project Reports in: /data3/gump/ws-axis/java/test-reports


-  -  -  -  - -- -- ------------------------------------ G U M P
Gump performed this work:

Work Name: build_ws-axis_ws-axis-test (Type: Build)
State: Failed
Elapsed: 0 hours, 11 minutes, 35 seconds
Command Line: java -Dbuild.clonevm=true
-Xbootclasspath/p:/data3/gump/xml-xerces2/java/build/xercesImpl.jar:/data3/g
ump/xml-xerces2/java/build/xml-apis.jar:/data3/gump/xml-xalan/java/build/xal
an-unbundled.jar:/data3/gump/xml-commons/java/external/build/xml-apis.jar
org.apache.tools.ant.Main -debug -verbose
-Dgump.merge=/data3/gump/gump-install/work/merge.xml
-Dbuild.sysclasspath=only
-DxercesImpl.jar=/data3/gump/xml-xerces2/java/build/xercesImpl.jar
-Dwsdl4j.jar=/data3/gump/wsdl4j/build/lib/wsdl4j.jar
-Dxalan.jar=/data3/gump/xml-xalan/java/build/xalan-unbundled.jar
-DxmlParserAPIs.jar=/data3/gump/xml-xerces2/java/build/xercesImpl.jar
-Denv.ANT_HOME=/data3/gump/ant/dist
-Dlog4j-core.jar=/data3/gump/logging-log4j/log4j-20040402.jar
-Daxis.lib.dir=lib all-tests 
[Working Directory: /data3/gump/ws-axis/java]
---------------------------------------------
	at org.apache.tools.ant.Target.execute(Target.java:301)
	at org.apache.tools.ant.Target.performTasks(Target.java:328)
	at org.apache.tools.ant.Project.executeTarget(Project.java:1214)
	at org.apache.tools.ant.Project.executeTargets(Project.java:1062)
	at org.apache.tools.ant.Main.runBuild(Main.java:667)
	at org.apache.tools.ant.Main.startAnt(Main.java:187)
	at org.apache.tools.ant.Main.start(Main.java:151)
	at org.apache.tools.ant.Main.main(Main.java:234)
Caused by: /data3/gump/ws-axis/java/buildTest.xml:174: Test
test.functional.FunctionalTests failed
	at
org.apache.tools.ant.taskdefs.optional.junit.JUnitTask.execute(JUnitTask.jav
a:651)
	at
org.apache.tools.ant.taskdefs.optional.junit.JUnitTask.execute(JUnitTask.jav
a:606)
	at
org.apache.tools.ant.UnknownElement.execute(UnknownElement.java:268)
	at org.apache.tools.ant.Task.perform(Task.java:363)
	at org.apache.tools.ant.Target.execute(Target.java:301)
	at org.apache.tools.ant.Target.performTasks(Target.java:328)
	at org.apache.tools.ant.Project.executeTarget(Project.java:1214)
	at org.apache.tools.ant.taskdefs.Ant.execute(Ant.java:381)
	... 20 more
--- Nested Exception ---
/data3/gump/ws-axis/java/buildTest.xml:174: Test
test.functional.FunctionalTests failed
	at
org.apache.tools.ant.taskdefs.optional.junit.JUnitTask.execute(JUnitTask.jav
a:651)
	at
org.apache.tools.ant.taskdefs.optional.junit.JUnitTask.execute(JUnitTask.jav
a:606)
	at
org.apache.tools.ant.UnknownElement.execute(UnknownElement.java:268)
	at org.apache.tools.ant.Task.perform(Task.java:363)
	at org.apache.tools.ant.Target.execute(Target.java:301)
	at org.apache.tools.ant.Target.performTasks(Target.java:328)
	at org.apache.tools.ant.Project.executeTarget(Project.java:1214)
	at org.apache.tools.ant.taskdefs.Ant.execute(Ant.java:381)
	at
org.apache.tools.ant.taskdefs.CallTarget.execute(CallTarget.java:105)
	at
org.apache.axis.tools.ant.axis.RunAxisFunctionalTestsTask.antcall(RunAxisFun
ctionalTestsTask.java:188)
	at
org.apache.axis.tools.ant.axis.RunAxisFunctionalTestsTask.callTests(RunAxisF
unctionalTestsTask.java:101)
	at
org.apache.axis.tools.ant.axis.RunAxisFunctionalTestsTask.execute(RunAxisFun
ctionalTestsTask.java:55)
	at
org.apache.tools.ant.UnknownElement.execute(UnknownElement.java:268)
	at org.apache.tools.ant.Task.perform(Task.java:363)
	at org.apache.tools.ant.Target.execute(Target.java:301)
	at org.apache.tools.ant.Target.performTasks(Target.java:328)
	at org.apache.tools.ant.Project.executeTarget(Project.java:1214)
	at org.apache.tools.ant.taskdefs.Ant.execute(Ant.java:381)
	at
org.apache.tools.ant.UnknownElement.execute(UnknownElement.java:268)
	at org.apache.tools.ant.Task.perform(Task.java:363)
	at org.apache.tools.ant.Target.execute(Target.java:301)
	at org.apache.tools.ant.Target.performTasks(Target.java:328)
	at org.apache.tools.ant.Project.executeTarget(Project.java:1214)
	at org.apache.tools.ant.Project.executeTargets(Project.java:1062)
	at org.apache.tools.ant.Main.runBuild(Main.java:667)
	at org.apache.tools.ant.Main.startAnt(Main.java:187)
	at org.apache.tools.ant.Main.start(Main.java:151)
	at org.apache.tools.ant.Main.main(Main.java:234)

Total time: 11 minutes 33 seconds
---------------------------------------------




To subscribe to this information via syndicated feeds:
RSS: http://lsd.student.utwente.nl/gump/ws-axis/ws-axis-test.rss | Atom:
http://lsd.student.utwente.nl/gump/ws-axis/ws-axis-test.atom

--
Gump http://gump.apache.org/
[lsd]

Mime
View raw message