axis-java-dev mailing list archives

Site index · List index
Message view « Date » · « Thread »
Top « Date » · « Thread »
From Russell Butek <bu...@us.ibm.com>
Subject RE: [GUMP] Build Failure - Axis
Date Mon, 16 Sep 2002 11:37:14 GMT




I just did a fresh update and I'm not seeing any problems this morning
(except slowness).

Russell Butek
butek@us.ibm.com


Glen Daniels <gdaniels@macromedia.com> on 09/16/2002 06:16:13 AM

Please respond to axis-dev@xml.apache.org

To:    "'axis-dev@xml.apache.org'" <axis-dev@xml.apache.org>
cc:
Subject:    RE: [GUMP] Build Failure - Axis




Hi Matt!

I'm not seeing this particular failure - compilation works for me
(although, as noted by others, it's waaaaaaaay slow at present), but the
func tests fail with a rather weird error:

AxisFault
 faultCode: {http://xml.apache.org/axis/}Server.userException
 faultString: java.lang.IllegalArgumentException: Local part not allowed to
 be null
 faultActor: null
 faultDetail:
 stackTrace: java.lang.IllegalArgumentException: Local part not allowed to
 be null
 at javax.xml.namespace.QName.&lt;init&gt;(QName.java:48)
 at
 org.apache.axis.description.ParameterDesc.setName(ParameterDesc.java:192)
 at
 org.apache.axis.description.ServiceDesc.createOperationForMethod(ServiceDesc.java:971)

 at
 org.apache.axis.description.ServiceDesc.createOperationsForName(ServiceDesc.java:890)

 at
 org.apache.axis.description.ServiceDesc.getSyncedOperationsForName(ServiceDesc.java:870)

 at
 org.apache.axis.description.ServiceDesc.loadServiceDescByIntrospectionRecursive(ServiceDesc.java:738)

 at
 org.apache.axis.description.ServiceDesc.loadServiceDescByIntrospection(ServiceDesc.java:721)

 at
 org.apache.axis.providers.java.JavaProvider.initServiceDesc(JavaProvider.java:549)

 at
 org.apache.axis.handlers.soap.SOAPService.getInitializedServiceDesc(SOAPService.java:317)

 at org.apache.axis.transport.java.JavaSender.invoke(JavaSender.java:102)
 at
 org.apache.axis.strategies.InvocationStrategy.visit(InvocationStrategy.java:71)

 at org.apache.axis.SimpleChain.doVisiting(SimpleChain.java:153)
      ....

I'm going to get ready to go and head into work, so will try again with a
fresh checkout from there and see what happens.

--Glen

P.S.  Nice work on the build changes - don't stress about the perf
problems, we'll nail them!


> -----Original Message-----
> From: Matt Seibert [mailto:mseibert@us.ibm.com]
> Sent: Monday, September 16, 2002 12:02 AM
> To: axis-dev@xml.apache.org
> Subject: Re: [GUMP] Build Failure - Axis
>
>
>
>
>
>
> Is anyone looking at this?  The last build I tried on Friday
> worked fine,
> and I was seeing this break in my sandbox while working on
> the performance
> problems, and thought it was me......  But I never committed
> my stuff.....
>
> Anyone?
>
> Matt Seibert
> mseibert@us.ibm.com
> IBM        External:    (512) 838-3656      Internal:   678-3656
>
>
>
>
>                       Sam
>
>                       Ruby/Raleigh/IBM@        To:
> axis-dev@xml.apache.org
>                       IBMUS                    cc:
>
>                                                Subject:
> [GUMP] Build Failure - Axis
>                       09/15/2002 06:49
>
>                       Please respond to
>
>                       axis-dev
>
>
>
>
>
>
> ----------------------------------------------------
> This email is autogenerated from the output from:
> <http://jakarta.apache.org/builds/gump/2002-09-15/xml-axis.html>
> ----------------------------------------------------
>
> Build results exceed maximum length.
> Please see URL above for details.
> Last 50 lines of build output follows.
>
>   [foreach] Interop3GroupE.main:
>   [foreach]      [copy] Copying 10 files to
> /home/rubys/jakarta/xml-axis/java/build/work/test/wsdl/interop3/groupE
>   [foreach]     [javac] Compiling 5 source files to
> /home/rubys/jakarta/xml-axis/java/build/classes
>   [foreach]      [echo]
> /home/rubys/jakarta/xml-axis/java/test/wsdl/interop3/groupE/In
> teropTestDocLit
>  is rpc/enc and should be doc/lit
>   [foreach] [java2wsdl] Java2WSDL
> test.wsdl.interop3.groupE.InteropTestDocLit
>   [foreach] [java2wsdl] Java2WSDL
> test.wsdl.interop3.groupE.InteropTestRpcEnc
>   [foreach] [java2wsdl] Java2WSDL
> test.wsdl.interop3.groupE.InteropTestList
>   [foreach] [wsdl2java] WSDL2Java
> /home/rubys/jakarta/xml-axis/java/build/work/test/wsdl/interop
> 3/groupE/InteropTestDocLit.wsdl
>
>   [foreach] [wsdl2java] WSDL2Java
> /home/rubys/jakarta/xml-axis/java/build/work/test/wsdl/interop
> 3/groupE/InteropTestRpcEnc.wsdl
>
>   [foreach] [wsdl2java] WSDL2Java
> /home/rubys/jakarta/xml-axis/java/build/work/test/wsdl/interop
> 3/groupE/InteropTestList.wsdl
>
>   [foreach]      [copy] Copying 4 files to
> /home/rubys/jakarta/xml-axis/java/build/work/test/wsdl/interop
> 3/groupE/client
>
>   [foreach]     [javac] Compiling 21 source files to
> /home/rubys/jakarta/xml-axis/java/build/classes
>   [foreach]      [echo] end of InteropTestSuite.main
>
>   [foreach] [wsdl2java] WSDL2Java
> http://services.xmethods.net/soap/urn:xmethods-delayed-quotes.wsdl
>   [foreach] [wsdl2java] WSDL2Java
> http://www.perfectxml.net/WebServices/SalesRankNPrice/BookServ
> ice.asmx?WSDL
>   [foreach] [wsdl2java] WSDL2Java
> /home/rubys/jakarta/xml-axis/java/samples/jaxrpc/hello/HelloWorld.wsdl
>   [foreach] HelloBindingImpl.java already exists, WSDL2Java will not
> overwrite it.
>   [foreach] [wsdl2java] WSDL2Java
> /home/rubys/jakarta/xml-axis/java/samples/jaxrpc/hello/HelloWorld.wsdl
>   [foreach] HelloBindingImpl.java already exists, WSDL2Java will not
> overwrite it.
>   [foreach] [wsdl2java] WSDL2Java
> /home/rubys/jakarta/xml-axis/java/test/wsdl/import3/MultiImpIn
> cl/wsdl/MultiImp.wsdl
>
>   [foreach]      [copy] Copying 7 files to
> /home/rubys/jakarta/xml-axis/java/build/work/samples
>   [foreach]     [javac] Compiling 141 source files to
> /home/rubys/jakarta/xml-axis/java/build/classes
>   [foreach]     [javac]
> /home/rubys/jakarta/xml-axis/java/build/work/samples/userguide
> /example6/Main.java:81:
>  exception java.rmi.RemoteException is never thrown in body of
> corresponding try statement
>   [foreach]     [javac]         } catch
> (java.rmi.RemoteException re) {
>   [foreach]     [javac]           ^
>   [foreach]     [javac]
> /home/rubys/jakarta/xml-axis/java/build/work/samples/userguide
> /example6/WidgetPriceSoapBindingImpl.java:66:
>  getWidgetPrice(java.lang.String) in
> samples.userguide.example6.WidgetPriceSoapBindingImpl cannot implement
> getWidgetPrice(java.lang.String) in
> samples.userguide.example6.WidgetPrice;
> overridden method does not throw java.rmi.RemoteException
>   [foreach]     [javac] public class
> WidgetPriceSoapBindingImpl implements
> samples.userguide.example6.WidgetPrice {
>   [foreach]     [javac]        ^
>   [foreach]     [javac]
> /home/rubys/jakarta/xml-axis/java/build/work/samples/userguide
> /example6/WidgetPriceServiceLocator.java:62:
>  incompatible types
>   [foreach]     [javac] found   :
> samples.userguide.example6.WidgetPriceSoapBindingStub
>   [foreach]     [javac] required: java.rmi.Remote
>   [foreach]     [javac]                 return _stub;
>   [foreach]     [javac]                        ^
>   [foreach]     [javac]
> /home/rubys/jakarta/xml-axis/java/build/work/samples/userguide
> /example6/WidgetPriceSoapBindingStub.java:10:
>  getWidgetPrice(java.lang.String) in
> samples.userguide.example6.WidgetPriceSoapBindingStub cannot implement
> getWidgetPrice(java.lang.String) in
> samples.userguide.example6.WidgetPrice;
> overridden method does not throw java.rmi.RemoteException
>   [foreach]     [javac] public class
> WidgetPriceSoapBindingStub extends
> org.apache.axis.client.Stub implements
> samples.userguide.example6.WidgetPrice {
>   [foreach]     [javac]        ^
>   [foreach]     [javac]
> /home/rubys/jakarta/xml-axis/java/build/work/samples/userguide
> /example6/WidgetPriceSoapBindingSkeleton.java:10:
>  getWidgetPrice(java.lang.String) in
> samples.userguide.example6.WidgetPriceSoapBindingSkeleton
> cannot implement
> getWidgetPrice(java.lang.String) in
> samples.userguide.example6.WidgetPrice;
> overridden method does not throw java.rmi.RemoteException
>   [foreach]     [javac] public class WidgetPriceSoapBindingSkeleton
> implements samples.userguide.example6.WidgetPrice,
> org.apache.axis.wsdl.Skeleton {
>   [foreach]     [javac]        ^
>   [foreach]     [javac] 5 errors
>
>   [foreach] BUILD FAILED
>   [foreach]
> file:/home/rubys/jakarta/xml-axis/java/test/wsdl/interop/build
.xml:565:
Compile failed; see the compiler error output for details.

  [foreach] Total time: 36 seconds

BUILD FAILED
file:/home/rubys/jakarta/xml-axis/java/buildTest.xml:63: Execution of ANT
Task failed

Total time: 8 minutes 10 seconds




Mime
View raw message