axis-java-dev mailing list archives

Site index · List index
Message view « Date » · « Thread »
Top « Date » · « Thread »
From Sam Ruby <ru...@us.ibm.com>
Subject [GUMP] Build Failure - Axis Security
Date Thu, 12 Sep 2002 10:31:42 GMT
----------------------------------------------------
This email is autogenerated from the output from:
<http://jakarta.apache.org/builds/gump/2002-09-12/xml-axis-security.html>
----------------------------------------------------

Buildfile: build.xml

setenv:

printEnv:
     [echo] -----------------------------------------------------------------
     [echo]        Build environment for Axis 1.0rc1 [2002]   
     [echo] -----------------------------------------------------------------
     [echo] Building with Apache Ant version 1.6alpha compiled on September 12 2002
     [echo] using build file /home/rubys/jakarta/xml-axis/java/build.xml
     [echo] Java 1.3.1_04 located at /usr/java/jdk1.3.1_04/jre 
     [echo] -----------------------------------------------------------------
     [echo] --- Flags (Note: If the {property name} is displayed, 
     [echo]            then the component is not present)

     [echo] build.dir = /home/rubys/jakarta/xml-axis/java/build
     [echo] build.dest = /home/rubys/jakarta/xml-axis/java/build/classes

     [echo] === Required Libraries ===
     [echo] wsdl4j.present=true
     [echo] commons-logging.present=true
     [echo] commons-discovery.present=true
     [echo] log4j.present=true
     [echo] activation.present=true

     [echo] --- Optional Libraries ---
     [echo] servlet.present=true
     [echo] regexp.present=true
     [echo] junit.present=true
     [echo] mailapi.present=true
     [echo] attachments.present=true
     [echo] jimi.present=true
     [echo] security.present=true
     [echo] jsse.present=true
     [echo] commons-httpclient.present=${commons-httpclient.present}
     [echo] axis-ant.present=true
     [echo] httpunit.present=true

     [echo] --- Property values ---
     [echo] debug=on
     [echo] deprecation=true
     [echo] build.compiler=${build.compiler}
     [echo] javac.fork=no
     [echo] axis_nojavadocs=${env.axis_nojavadocs}

     [echo] -- Test Environment for AXIS ---

     [echo] test.functional.remote = no
     [echo] test.functional.local = yes
     [echo] test.functional.both = no
     [echo] test.functional.reportdir = /home/rubys/jakarta/xml-axis/java/test-reports
     [echo] test.functional.SimpleAxisPort = 8080
     [echo] test.functional.TCPListenerPort = 8088
     [echo] test.functional.fail = yes


compile:
      [jar] Building jar: /home/rubys/jakarta/xml-axis/java/build/lib/axis.jar

compile:

setenv:

copy:

compile:

test:

post-compile:
     [echo] Compile property set yes

buildTest:
     [echo] junit package found ...

setenv:

printEnv:
     [echo] -----------------------------------------------------------------
     [echo]        Build environment for Axis 1.0rc1 [2002]   
     [echo] -----------------------------------------------------------------
     [echo] Building with Apache Ant version 1.6alpha compiled on September 12 2002
     [echo] using build file /home/rubys/jakarta/xml-axis/java/buildTest.xml
     [echo] Java 1.3.1_04 located at /usr/java/jdk1.3.1_04/jre 
     [echo] -----------------------------------------------------------------
     [echo] --- Flags (Note: If the {property name} is displayed, 
     [echo]            then the component is not present)

     [echo] build.dir = /home/rubys/jakarta/xml-axis/java/build
     [echo] build.dest = /home/rubys/jakarta/xml-axis/java/build/classes

     [echo] === Required Libraries ===
     [echo] wsdl4j.present=true
     [echo] commons-logging.present=true
     [echo] commons-discovery.present=true
     [echo] log4j.present=true
     [echo] activation.present=true

     [echo] --- Optional Libraries ---
     [echo] servlet.present=true
     [echo] regexp.present=true
     [echo] junit.present=true
     [echo] mailapi.present=true
     [echo] attachments.present=true
     [echo] jimi.present=true
     [echo] security.present=true
     [echo] jsse.present=true
     [echo] commons-httpclient.present=${commons-httpclient.present}
     [echo] axis-ant.present=true
     [echo] httpunit.present=true

     [echo] --- Property values ---
     [echo] debug=on
     [echo] deprecation=true
     [echo] build.compiler=${build.compiler}
     [echo] javac.fork=no
     [echo] axis_nojavadocs=${env.axis_nojavadocs}

     [echo] -- Test Environment for AXIS ---

     [echo] test.functional.remote = no
     [echo] test.functional.local = yes
     [echo] test.functional.both = no
     [echo] test.functional.reportdir = /home/rubys/jakarta/xml-axis/java/test-reports
     [echo] test.functional.SimpleAxisPort = 8080
     [echo] test.functional.TCPListenerPort = 8088
     [echo] test.functional.fail = yes


copy:

compile:
  [foreach] Buildfile: test/RPCDispatch/build.xml

  [foreach] setenv:

  [foreach] copy:

  [foreach] compile:
  [foreach]      [echo] Compiling test.RPCDispatch
  [foreach]     [javac] Compiling 5 source files to /home/rubys/jakarta/xml-axis/java/build/classes

  [foreach] BUILD SUCCESSFUL
  [foreach] Total time: 5 seconds
  [foreach] Buildfile: test/chains/build.xml

  [foreach] setenv:

  [foreach] copy:

  [foreach] compile:
  [foreach]      [echo] Compiling test.chains
  [foreach]     [javac] Compiling 3 source files to /home/rubys/jakarta/xml-axis/java/build/classes

  [foreach] BUILD SUCCESSFUL
  [foreach] Total time: 4 seconds
  [foreach] Buildfile: test/concurrency/build.xml

  [foreach] setenv:

  [foreach] copy:

  [foreach] compile:
  [foreach]      [echo] Compiling test.concurrency
  [foreach]     [javac] Compiling 3 source files to /home/rubys/jakarta/xml-axis/java/build/classes

  [foreach] BUILD SUCCESSFUL
  [foreach] Total time: 4 seconds
  [foreach] Buildfile: test/dynamic/build.xml

  [foreach] setenv:

  [foreach] copy:

  [foreach] compile:
  [foreach]      [echo] Compiling test.dynamic
  [foreach]     [javac] Compiling 2 source files to /home/rubys/jakarta/xml-axis/java/build/classes

  [foreach] BUILD SUCCESSFUL
  [foreach] Total time: 4 seconds
  [foreach] Buildfile: test/encoding/build.xml

  [foreach] setenv:

  [foreach] copy:
  [foreach]      [echo] Compiling samples.echo

  [foreach] setenv:

  [foreach] copy:

  [foreach] compile:
  [foreach] [wsdl2java] WSDL2Java /home/rubys/jakarta/xml-axis/java/samples/echo/InteropTest.wsdl
  [foreach]     [javac] Compiling 7 source files to /home/rubys/jakarta/xml-axis/java/build/classes

  [foreach] compile:
  [foreach]      [echo] Compiling test.encoding.*
  [foreach]     [javac] Compiling 28 source files to /home/rubys/jakarta/xml-axis/java/build/classes

  [foreach] BUILD SUCCESSFUL
  [foreach] Total time: 20 seconds
  [foreach] Buildfile: test/faults/build.xml

  [foreach] setenv:

  [foreach] copy:

  [foreach] compile:
  [foreach]      [echo] Compiling test.faults
  [foreach]     [javac] Compiling 3 source files to /home/rubys/jakarta/xml-axis/java/build/classes

  [foreach] BUILD SUCCESSFUL
  [foreach] Total time: 4 seconds
  [foreach] Buildfile: test/functional/build.xml

  [foreach] setenv:

  [foreach] copy:

  [foreach] setenv:

  [foreach] printEnv:
  [foreach]      [echo] -----------------------------------------------------------------
  [foreach]      [echo]        Build environment for Axis 1.0rc1 [2002]   
  [foreach]      [echo] -----------------------------------------------------------------
  [foreach]      [echo] Building with Apache Ant version 1.6alpha compiled on September 12
2002
  [foreach]      [echo] using build file /home/rubys/jakarta/xml-axis/java/buildSamples.xml
  [foreach]      [echo] Java 1.3.1_04 located at /usr/java/jdk1.3.1_04/jre 
  [foreach]      [echo] -----------------------------------------------------------------
  [foreach]      [echo] --- Flags (Note: If the {property name} is displayed, 
  [foreach]      [echo]            then the component is not present)

  [foreach]      [echo] build.dir = /home/rubys/jakarta/xml-axis/java/build
  [foreach]      [echo] build.dest = /home/rubys/jakarta/xml-axis/java/build/classes

  [foreach]      [echo] === Required Libraries ===
  [foreach]      [echo] wsdl4j.present=true
  [foreach]      [echo] commons-logging.present=true
  [foreach]      [echo] commons-discovery.present=true
  [foreach]      [echo] log4j.present=true
  [foreach]      [echo] activation.present=true

  [foreach]      [echo] --- Optional Libraries ---
  [foreach]      [echo] servlet.present=true
  [foreach]      [echo] regexp.present=true
  [foreach]      [echo] junit.present=true
  [foreach]      [echo] mailapi.present=true
  [foreach]      [echo] attachments.present=true
  [foreach]      [echo] jimi.present=true
  [foreach]      [echo] security.present=true
  [foreach]      [echo] jsse.present=true
  [foreach]      [echo] commons-httpclient.present=${commons-httpclient.present}
  [foreach]      [echo] axis-ant.present=true
  [foreach]      [echo] httpunit.present=true

  [foreach]      [echo] --- Property values ---
  [foreach]      [echo] debug=on
  [foreach]      [echo] deprecation=true
  [foreach]      [echo] build.compiler=${build.compiler}
  [foreach]      [echo] javac.fork=no
  [foreach]      [echo] axis_nojavadocs=${env.axis_nojavadocs}

  [foreach]      [echo] -- Test Environment for AXIS ---

  [foreach]      [echo] test.functional.remote = no
  [foreach]      [echo] test.functional.local = yes
  [foreach]      [echo] test.functional.both = no
  [foreach]      [echo] test.functional.reportdir = /home/rubys/jakarta/xml-axis/java/test-reports
  [foreach]      [echo] test.functional.SimpleAxisPort = 8080
  [foreach]      [echo] test.functional.TCPListenerPort = 8088
  [foreach]      [echo] test.functional.fail = yes


  [foreach] copy:

  [foreach] compile:
  [foreach]   [foreach] Buildfile: samples/addr/build.xml

  [foreach]   [foreach] setenv:

  [foreach]   [foreach] copy:

  [foreach]   [foreach] compile:
  [foreach]   [foreach] [wsdl2java] WSDL2Java /home/rubys/jakarta/xml-axis/java/samples/addr/AddressBook.wsdl
  [foreach]   [foreach] AddressBookSOAPBindingImpl.java already exists, WSDL2Java will not
overwrite it.
  [foreach]   [foreach]      [copy] Copying 2 files to /home/rubys/jakarta/xml-axis/java/build/work/samples/addr
  [foreach]   [foreach]     [javac] Compiling 10 source files to /home/rubys/jakarta/xml-axis/java/build/classes

  [foreach]   [foreach] BUILD SUCCESSFUL
  [foreach]   [foreach] Total time: 5 seconds
  [foreach]   [foreach] Buildfile: samples/attachments/build.xml

  [foreach]   [foreach] setenv:

  [foreach]   [foreach] copy:

  [foreach]   [foreach] compile:

  [foreach]   [foreach] BUILD SUCCESSFUL
  [foreach]   [foreach] Total time: 3 seconds
  [foreach]   [foreach] Buildfile: samples/bidbuy/build.xml

  [foreach]   [foreach] setenv:

  [foreach]   [foreach] copy:

  [foreach]   [foreach] compile:

  [foreach]   [foreach] BUILD SUCCESSFUL
  [foreach]   [foreach] Total time: 3 seconds
  [foreach]   [foreach] Buildfile: samples/echo/build.xml

  [foreach]   [foreach] setenv:

  [foreach]   [foreach] copy:

  [foreach]   [foreach] compile:
  [foreach]   [foreach] [wsdl2java] WSDL2Java /home/rubys/jakarta/xml-axis/java/samples/echo/InteropTest.wsdl
  [foreach]   [foreach]     [javac] Compiling 7 source files to /home/rubys/jakarta/xml-axis/java/build/classes

  [foreach]   [foreach] BUILD SUCCESSFUL
  [foreach]   [foreach] Total time: 6 seconds
  [foreach]   [foreach] Buildfile: samples/encoding/build.xml

  [foreach]   [foreach] setenv:

  [foreach]   [foreach] copy:

  [foreach]   [foreach] compile:

  [foreach]   [foreach] BUILD SUCCESSFUL
  [foreach]   [foreach] Total time: 3 seconds
  [foreach]   [foreach] Buildfile: samples/integrationGuide/build.xml

  [foreach]   [foreach] setenv:

  [foreach]   [foreach] copy:

  [foreach]   [foreach] compile:

  [foreach]   [foreach] BUILD SUCCESSFUL
  [foreach]   [foreach] Total time: 3 seconds
  [foreach]   [foreach] Buildfile: samples/jaxrpc/build.xml

  [foreach]   [foreach] BUILD FAILED
  [foreach]   [foreach] java.lang.ArrayIndexOutOfBoundsException
  [foreach]   [foreach] 	at org.apache.xerces.impl.XMLEntityManager$EntityScanner.scanData(Unknown
Source)
  [foreach]   [foreach] 	at org.apache.xerces.impl.XMLScanner.scanComment(Unknown Source)
  [foreach]   [foreach] 	at org.apache.xerces.impl.XMLDocumentFragmentScannerImpl.scanComment(Unknown
Source)
  [foreach]   [foreach] 	at org.apache.xerces.impl.XMLDocumentFragmentScannerImpl$FragmentContentDispatcher.dispatch(Unknown
Source)
  [foreach]   [foreach] 	at org.apache.xerces.impl.XMLDocumentFragmentScannerImpl.scanDocument(Unknown
Source)
  [foreach]   [foreach] 	at org.apache.xerces.parsers.DTDConfiguration.parse(Unknown Source)
  [foreach]   [foreach] 	at org.apache.xerces.parsers.DTDConfiguration.parse(Unknown Source)
  [foreach]   [foreach] 	at org.apache.xerces.parsers.XMLParser.parse(Unknown Source)
  [foreach]   [foreach] 	at org.apache.xerces.parsers.AbstractSAXParser.parse(Unknown Source)
  [foreach]   [foreach] 	at org.apache.tools.ant.helper.ProjectHelperImpl.parse(ProjectHelperImpl.java:166)
  [foreach]   [foreach] 	at org.apache.tools.ant.ProjectHelper.configureProject(ProjectHelper.java:116)
  [foreach]   [foreach] 	at org.apache.tools.ant.Main.runBuild(Main.java:597)
  [foreach]   [foreach] 	at org.apache.tools.ant.Main.start(Main.java:197)
  [foreach]   [foreach] 	at org.apache.tools.ant.Main.main(Main.java:235)

  [foreach]   [foreach] Total time: 1 second
  [foreach]   [foreach] java.lang.ArrayIndexOutOfBoundsException
  [foreach]   [foreach] 	at org.apache.xerces.impl.XMLEntityManager$EntityScanner.scanData(Unknown
Source)
  [foreach]   [foreach] 	at org.apache.xerces.impl.XMLScanner.scanComment(Unknown Source)
  [foreach]   [foreach] 	at org.apache.xerces.impl.XMLDocumentFragmentScannerImpl.scanComment(Unknown
Source)
  [foreach]   [foreach] 	at org.apache.xerces.impl.XMLDocumentFragmentScannerImpl$FragmentContentDispatcher.dispatch(Unknown
Source)
  [foreach]   [foreach] 	at org.apache.xerces.impl.XMLDocumentFragmentScannerImpl.scanDocument(Unknown
Source)
  [foreach]   [foreach] 	at org.apache.xerces.parsers.DTDConfiguration.parse(Unknown Source)
  [foreach]   [foreach] 	at org.apache.xerces.parsers.DTDConfiguration.parse(Unknown Source)
  [foreach]   [foreach] 	at org.apache.xerces.parsers.XMLParser.parse(Unknown Source)

  [foreach] BUILD FAILED
  [foreach] file:/home/rubys/jakarta/xml-axis/java/buildSamples.xml:113: Execution of ANT
Task failed

  [foreach] Total time: 34 seconds
  [foreach]   [foreach] 	at org.apache.xerces.parsers.AbstractSAXParser.parse(Unknown Source)
  [foreach]   [foreach] 	at org.apache.tools.ant.helper.ProjectHelperImpl.parse(ProjectHelperImpl.java:166)
  [foreach]   [foreach] 	at org.apache.tools.ant.ProjectHelper.configureProject(ProjectHelper.java:116)
  [foreach]   [foreach] 	at org.apache.tools.ant.Main.runBuild(Main.java:597)
  [foreach]   [foreach] 	at org.apache.tools.ant.Main.start(Main.java:197)
  [foreach]   [foreach] 	at org.apache.tools.ant.Main.main(Main.java:235)

BUILD FAILED
file:/home/rubys/jakarta/xml-axis/java/buildTest.xml:63: Execution of ANT Task failed

Total time: 1 minute 43 seconds

Mime
View raw message