axis-java-dev mailing list archives

Site index · List index
Message view « Date » · « Thread »
Top « Date » · « Thread »
From Sam Ruby <ru...@us.ibm.com>
Subject [GUMP] Build Failure - Axis
Date Thu, 13 Jun 2002 13:17:22 GMT
----------------------------------------------------
This email is autogenerated from the output from:
<http://jakarta.apache.org/builds/gump/2002-06-13/xml-axis.html>
----------------------------------------------------

Buildfile: build.xml

setenv:
    [mkdir] Created dir: /home/rubys/jakarta/xml-axis/java/build/classes
    [mkdir] Created dir: /home/rubys/jakarta/xml-axis/java/build/lib
     [echo] -----------------------------------------------------------------
     [echo]        Build environment for Axis beta2+ [2002]   
     [echo] -----------------------------------------------------------------
     [echo] Building with Apache Ant version 1.6alpha compiled on June 13 2002
     [echo] using build file /home/rubys/jakarta/xml-axis/java/build.xml
     [echo] Java 1.3.1_02 located at /usr/java/jdk1.3.1_02/jre 
     [echo] -----------------------------------------------------------------
     [echo] --- Flags (Note: If the {property name} is displayed, 
     [echo]            then the component is not present)

     [echo] === Required Libraries ===
     [echo] wsdl4j.present=true
     [echo] commons-logging.present=true
     [echo] log4j.present=true
     [echo] tt-bytecode.present=true

     [echo] --- Optional Libraries ---
     [echo] servlet.present=true
     [echo] regexp.present=true
     [echo] junit.present=true
     [echo] activation.present=true
     [echo] mailapi.present=true
     [echo] attachments.present=true
     [echo] security.present=true
     [echo] jsse.present=${jsse.present}

     [echo] --- Property values ---
     [echo] debug=on
     [echo] deprecation=true
     [echo] axis_nojavadocs=${env.axis_nojavadocs}

compile:
    [javac] Compiling 443 source files to /home/rubys/jakarta/xml-axis/java/build/classes
     [copy] Copying 1 file to /home/rubys/jakarta/xml-axis/java/build/classes/org/apache/axis/server
     [copy] Copying 1 file to /home/rubys/jakarta/xml-axis/java/build/classes/org/apache/axis/client
     [copy] Copying 1 file to /home/rubys/jakarta/xml-axis/java/build/classes
     [copy] Copying 1 file to /home/rubys/jakarta/xml-axis/java/build/classes/org/apache/axis/utils
      [jar] Building jar: /home/rubys/jakarta/xml-axis/java/build/lib/axis.jar
      [jar] Building jar: /home/rubys/jakarta/xml-axis/java/build/lib/jaxrpc.jar
      [jar] Building jar: /home/rubys/jakarta/xml-axis/java/build/lib/saaj.jar
     [copy] Copying 1 file to /home/rubys/jakarta/xml-axis/java/build/lib
     [copy] Copying 1 file to /home/rubys/jakarta/xml-axis/java/build/lib
     [copy] Copying 1 file to /home/rubys/jakarta/xml-axis/java/build/lib
     [copy] Copying 1 file to /home/rubys/jakarta/xml-axis/java/build/lib

post-compile:

javadocs:
    [mkdir] Created dir: /home/rubys/jakarta/xml-axis/java/build/javadocs
  [javadoc] Generating Javadoc
  [javadoc] Javadoc execution
  [javadoc] Loading source files for package org.apache.axis...
  [javadoc] Loading source files for package org.apache.axis.client...
  [javadoc] Loading source files for package org.apache.axis.configuration...
  [javadoc] Loading source files for package org.apache.axis.deployment...
  [javadoc] Loading source files for package org.apache.axis.deployment.wsdd...
  [javadoc] Loading source files for package org.apache.axis.deployment.wsdd.providers...
  [javadoc] Loading source files for package org.apache.axis.encoding...
  [javadoc] Loading source files for package org.apache.axis.encoding.ser...
  [javadoc] Loading source files for package org.apache.axis.handlers...
  [javadoc] Loading source files for package org.apache.axis.handlers.http...
  [javadoc] Loading source files for package org.apache.axis.handlers.soap...
  [javadoc] Loading source files for package org.apache.axis.message...
  [javadoc] Loading source files for package org.apache.axis.providers...
  [javadoc] Loading source files for package org.apache.axis.providers.java...
  [javadoc] Loading source files for package org.apache.axis.security...
  [javadoc] Loading source files for package org.apache.axis.security.simple...
  [javadoc] Loading source files for package org.apache.axis.security.servlet...
  [javadoc] Loading source files for package org.apache.axis.server...
  [javadoc] Loading source files for package org.apache.axis.session...
  [javadoc] Loading source files for package org.apache.axis.strategies...
  [javadoc] Loading source files for package org.apache.axis.description...
  [javadoc] Loading source files for package org.apache.axis.transport.http...
  [javadoc] Loading source files for package org.apache.axis.transport.local...
  [javadoc] Loading source files for package org.apache.axis.utils...
  [javadoc] Loading source files for package org.apache.axis.utils.cache...
  [javadoc] Loading source files for package org.apache.axis.utils.compiler...
  [javadoc] Loading source files for package org.apache.axis.utils.bytecode...
  [javadoc] Loading source files for package org.apache.axis.attachments...
  [javadoc] Loading source files for package org.apache.axis.wsdl...
  [javadoc] Loading source files for package org.apache.axis.wsdl.fromJava...
  [javadoc] Loading source files for package org.apache.axis.wsdl.toJava...
  [javadoc] Loading source files for package org.apache.axis.wsdl.gen...
  [javadoc] Loading source files for package org.apache.axis.wsdl.symbolTable...
  [javadoc] Loading source files for package org.apache.axis.soap...
  [javadoc] Loading source files for package org.apache.axis.enum...
  [javadoc] Loading source files for package javax.xml.rpc...
  [javadoc] Loading source files for package javax.xml.rpc.encoding...
  [javadoc] Loading source files for package javax.xml.rpc.holders...
  [javadoc] Loading source files for package javax.xml.rpc.soap...
  [javadoc] Loading source files for package javax.xml.rpc.handler...
  [javadoc] Loading source files for package javax.xml.rpc.handler.soap...
  [javadoc] Loading source files for package javax.xml.rpc.server...
  [javadoc] Loading source files for package javax.xml.messaging...
  [javadoc] Loading source files for package javax.xml.soap...
  [javadoc] Loading source files for package javax.xml.transform...
  [javadoc] Loading source files for package javax.xml.namespace...
  [javadoc] Constructing Javadoc information...
  [javadoc] /home/rubys/jakarta/xml-axis/java/src/org/apache/axis/transport/http/FakeTrustSocketFactory.java:58:
Class com.sun.net.ssl.SSLContext not found in import.
  [javadoc] import com.sun.net.ssl.SSLContext;
  [javadoc]        ^
  [javadoc] /home/rubys/jakarta/xml-axis/java/src/org/apache/axis/transport/http/FakeTrustSocketFactory.java:59:
Class com.sun.net.ssl.TrustManager not found in import.
  [javadoc] import com.sun.net.ssl.TrustManager;
  [javadoc]        ^
  [javadoc] /home/rubys/jakarta/xml-axis/java/src/org/apache/axis/transport/http/FakeTrustSocketFactory.java:60:
Class com.sun.net.ssl.X509TrustManager not found in import.
  [javadoc] import com.sun.net.ssl.X509TrustManager;
  [javadoc]        ^
  [javadoc] /home/rubys/jakarta/xml-axis/java/src/org/apache/axis/transport/http/FakeTrustSocketFactory.java:91:
Interface com.sun.net.ssl.X509TrustManager of nested class org.apache.axis.transport.http.FakeTrustSocketFactory.
FakeX509TrustManager not found.
  [javadoc]     public static class FakeX509TrustManager implements X509TrustManager {
  [javadoc]                                                         ^
  [javadoc] /home/rubys/jakarta/xml-axis/java/src/org/apache/axis/utils/bytecode/BCEL.java:58:
Class org.apache.bcel.classfile.ClassParser not found in import.
  [javadoc] import org.apache.bcel.classfile.ClassParser;
  [javadoc]        ^
  [javadoc] /home/rubys/jakarta/xml-axis/java/src/org/apache/axis/utils/bytecode/BCEL.java:59:
Class org.apache.bcel.classfile.Code not found in import.
  [javadoc] import org.apache.bcel.classfile.Code;
  [javadoc]        ^
  [javadoc] /home/rubys/jakarta/xml-axis/java/src/org/apache/axis/utils/bytecode/BCEL.java:60:
Class org.apache.bcel.classfile.JavaClass not found in import.
  [javadoc] import org.apache.bcel.classfile.JavaClass;
  [javadoc]        ^
  [javadoc] /home/rubys/jakarta/xml-axis/java/src/org/apache/axis/utils/bytecode/BCEL.java:61:
Class org.apache.bcel.classfile.LocalVariable not found in import.
  [javadoc] import org.apache.bcel.classfile.LocalVariable;
  [javadoc]        ^
  [javadoc] /home/rubys/jakarta/xml-axis/java/src/org/apache/axis/utils/bytecode/BCEL.java:62:
Class org.apache.bcel.classfile.LocalVariableTable not found in import.
  [javadoc] import org.apache.bcel.classfile.LocalVariableTable;
  [javadoc]        ^
  [javadoc] /home/rubys/jakarta/xml-axis/java/src/org/apache/axis/utils/bytecode/BCEL.java:63:
Class org.apache.bcel.classfile.Method not found in import.
  [javadoc] import org.apache.bcel.classfile.Method;
  [javadoc]        ^
  [javadoc] javadoc: warning - Import not found: com.sun.net.ssl.SSLContext - ignoring!
  [javadoc] javadoc: warning - Import not found: com.sun.net.ssl.TrustManager - ignoring!
  [javadoc] javadoc: warning - Import not found: com.sun.net.ssl.X509TrustManager - ignoring!
  [javadoc] javadoc: warning - Import not found: com.sun.net.ssl.SSLContext - ignoring!
  [javadoc] javadoc: warning - Import not found: com.sun.net.ssl.TrustManager - ignoring!
  [javadoc] javadoc: warning - Import not found: com.sun.net.ssl.X509TrustManager - ignoring!
  [javadoc] javadoc: warning - Import not found: org.apache.bcel.classfile.ClassParser - ignoring!
  [javadoc] javadoc: warning - Import not found: org.apache.bcel.classfile.Code - ignoring!
  [javadoc] javadoc: warning - Import not found: org.apache.bcel.classfile.JavaClass - ignoring!
  [javadoc] javadoc: warning - Import not found: org.apache.bcel.classfile.LocalVariable -
ignoring!
  [javadoc] javadoc: warning - Import not found: org.apache.bcel.classfile.LocalVariableTable
- ignoring!
  [javadoc] javadoc: warning - Import not found: org.apache.bcel.classfile.Method - ignoring!
  [javadoc] javadoc: warning - Import not found: serp.bytecode.BCClass - ignoring!
  [javadoc] javadoc: warning - Import not found: serp.bytecode.BCMethod - ignoring!
  [javadoc] javadoc: warning - Import not found: serp.bytecode.Project - ignoring!
  [javadoc] javadoc: warning - Import not found: serp.bytecode.Code - ignoring!
  [javadoc] javadoc: warning - Import not found: serp.bytecode.LocalVariableTable - ignoring!
  [javadoc] javadoc: warning - Import not found: serp.bytecode.LocalVariable - ignoring!
  [javadoc] Building tree for all the packages and classes...
  [javadoc] Building index for all the packages and classes...
  [javadoc] javadoc: warning - getCompleteAttributes: @return tag has no arguments.
  [javadoc] Building index for all classes...
  [javadoc] Generating /home/rubys/jakarta/xml-axis/java/build/javadocs/stylesheet.css...
  [javadoc] 19 warnings

javadocsdist:
    [mkdir] Created dir: /home/rubys/jakarta/xml-axis/java/axis-1_0/docs
    [mkdir] Created dir: /home/rubys/jakarta/xml-axis/java/axis-1_0/docs/apiDocs
     [copy] Copying 1108 files to /home/rubys/jakarta/xml-axis/java/axis-1_0/docs/apiDocs

samples:
    [javac] Compiling 2 source files to /home/rubys/jakarta/xml-axis/java/build/classes
[wsdl2java] WSDL2Java samples/echo/InteropTest.wsdl
    [javac] Compiling 7 source files to /home/rubys/jakarta/xml-axis/java/build/classes
[wsdl2java] WSDL2Java samples/addr/AddressBook.wsdl
    [javac] Compiling 9 source files to /home/rubys/jakarta/xml-axis/java/build/classes
    [javac] Compiling 72 source files to /home/rubys/jakarta/xml-axis/java/build/classes

buildTest:
     [echo] junit package found ...
    [javac] Compiling 100 source files to /home/rubys/jakarta/xml-axis/java/build/classes
    [javac] Note: Some input files use or override a deprecated API.
    [javac] Note: Recompile with -deprecation for details.
     [copy] Copying 1 file to /home/rubys/jakarta/xml-axis/java/build/classes/test/wsdd

junit:
    [mkdir] Created dir: /home/rubys/jakarta/xml-axis/java/test-reports
    [junit] Running test.RPCDispatch.PackageTests
    [junit] Tests run: 12, Failures: 0, Errors: 0, Time elapsed: 3.961 sec
    [junit] Running test.encoding.PackageTests
    [junit] Tests run: 189, Failures: 0, Errors: 0, Time elapsed: 6.708 sec
    [junit] Running test.session.PackageTests
    [junit] Tests run: 2, Failures: 0, Errors: 0, Time elapsed: 10.431 sec
    [junit] Running test.utils.cache.PackageTests
    [junit] Tests run: 5, Failures: 0, Errors: 0, Time elapsed: 1.881 sec
    [junit] Running test.utils.PackageTests
    [junit] Tests run: 27, Failures: 0, Errors: 0, Time elapsed: 12.002 sec
    [junit] Running test.outparams.PackageTests
    [junit] Tests run: 1, Failures: 0, Errors: 0, Time elapsed: 4.688 sec
    [junit] Running test.faults.PackageTests
    [junit] Tests run: 2, Failures: 0, Errors: 0, Time elapsed: 5.907 sec
    [junit] Running test.chains.PackageTests
    [junit] Tests run: 4, Failures: 0, Errors: 0, Time elapsed: 3.435 sec
    [junit] Running test.wsdd.PackageTests
    [junit] Tests run: 10, Failures: 0, Errors: 0, Time elapsed: 7.597 sec
    [junit] Running test.message.PackageTests
    [junit] Tests run: 6, Failures: 0, Errors: 0, Time elapsed: 3.432 sec
    [junit] Running test.soap.PackageTests
    [junit] - Mapping Exception to AxisFault
    [junit] Did not understand "MustUnderstand" header(s)!
    [junit] 	at org.apache.axis.handlers.soap.SOAPService$SOAPRequestHandler.invoke(SOAPService.java:190)
    [junit] 	at org.apache.axis.strategies.InvocationStrategy.visit(InvocationStrategy.java:71)
    [junit] 	at org.apache.axis.SimpleChain.doVisiting(SimpleChain.java:150)
    [junit] 	at org.apache.axis.SimpleChain.invoke(SimpleChain.java:120)
    [junit] 	at org.apache.axis.server.AxisServer.invoke(AxisServer.java:286)
    [junit] 	at org.apache.axis.transport.local.LocalSender.invoke(LocalSender.java:158)
    [junit] 	at org.apache.axis.strategies.InvocationStrategy.visit(InvocationStrategy.java:71)
    [junit] 	at org.apache.axis.SimpleChain.doVisiting(SimpleChain.java:150)
    [junit] 	at org.apache.axis.SimpleChain.invoke(SimpleChain.java:120)
    [junit] 	at org.apache.axis.client.AxisClient.invoke(AxisClient.java:174)
    [junit] 	at org.apache.axis.client.Call.invoke(Call.java:1934)
    [junit] 	at org.apache.axis.client.Call.invoke(Call.java:1706)
    [junit] 	at org.apache.axis.client.Call.invoke(Call.java:1634)
    [junit] 	at org.apache.axis.client.Call.invoke(Call.java:1659)
    [junit] 	at test.soap.TestHeaderAttrs.runTest(TestHeaderAttrs.java:188)
    [junit] 	at test.soap.TestHeaderAttrs.testMUBadHeader(TestHeaderAttrs.java:109)
    [junit] 	at java.lang.reflect.Method.invoke(Native Method)
    [junit] 	at junit.framework.TestCase.runTest(TestCase.java:158)
    [junit] 	at junit.framework.TestCase.runBare(TestCase.java:131)
    [junit] 	at junit.framework.TestResult$1.protect(TestResult.java:106)
    [junit] 	at junit.framework.TestResult.runProtected(TestResult.java:124)
    [junit] 	at junit.framework.TestResult.run(TestResult.java:109)
    [junit] 	at junit.framework.TestCase.run(TestCase.java:122)
    [junit] 	at junit.framework.TestSuite.runTest(TestSuite.java:208)
    [junit] 	at junit.framework.TestSuite.run(TestSuite.java:203)
    [junit] 	at junit.framework.TestSuite.runTest(TestSuite.java:208)
    [junit] 	at junit.framework.TestSuite.run(TestSuite.java:203)
    [junit] 	at org.apache.tools.ant.taskdefs.optional.junit.JUnitTestRunner.run(JUnitTestRunner.java:325)
    [junit] 	at org.apache.tools.ant.taskdefs.optional.junit.JUnitTestRunner.main(JUnitTestRunner.java:524)
    [junit] Tests run: 4, Failures: 0, Errors: 0, Time elapsed: 5.786 sec
    [junit] Running test.properties.PackageTests
    [junit] Tests run: 3, Failures: 0, Errors: 0, Time elapsed: 6.105 sec
    [junit] Running test.inheritance.PackageTests
    [junit] Tests run: 1, Failures: 0, Errors: 0, Time elapsed: 6.409 sec
    [junit] Running test.concurrency.PackageTests
    [junit] Tests run: 1, Failures: 0, Errors: 0, Time elapsed: 16.38 sec
    [junit] Running test.dynamic.PackageTests
    [junit] Tests run: 1, Failures: 0, Errors: 0, Time elapsed: 5.808 sec

dist:
    [mkdir] Created dir: /home/rubys/jakarta/xml-axis/java/axis-1_0/lib
    [mkdir] Created dir: /home/rubys/jakarta/xml-axis/java/axis-1_0/samples
    [mkdir] Created dir: /home/rubys/jakarta/xml-axis/java/axis-1_0/webapps/axis
     [copy] Copying 7 files to /home/rubys/jakarta/xml-axis/java/axis-1_0/lib
     [copy] Copying 260 files to /home/rubys/jakarta/xml-axis/java/axis-1_0/samples
     [copy] Copying 34 files to /home/rubys/jakarta/xml-axis/java/axis-1_0/docs
     [copy] Copying 3 files to /home/rubys/jakarta/xml-axis/java/axis-1_0/webapps/axis
     [copy] Copying 2 files to /home/rubys/jakarta/xml-axis/java/axis-1_0/webapps/axis/WEB-INF
     [copy] Copying 7 files to /home/rubys/jakarta/xml-axis/java/axis-1_0/webapps/axis/WEB-INF/lib
     [copy] Copying 111 files to /home/rubys/jakarta/xml-axis/java/axis-1_0/webapps/axis/WEB-INF/classes/samples
     [copy] Copying 1 file to /home/rubys/jakarta/xml-axis/java/axis-1_0
     [copy] Copying 1 file to /home/rubys/jakarta/xml-axis/java/axis-1_0

functional-tests:

wsdl-setup:
     [copy] Copying 1 file to /home/rubys/jakarta/xml-axis/java/build/classes
     [copy] Copying 4 files to /home/rubys/jakarta/xml-axis/java/build/work/samples
Trying to override old definition of task wsdl2java

main:
     [echo] Running WSDL2Java and Java2WSDL Emitters
[wsdl2java] WSDL2Java test/wsdl/omit/omit.wsdl
[java2wsdl] Java2WSDL samples.userguide.example6.WidgetPrice
[wsdl2java] WSDL2Java build/work/samples/userguide/example6/WidgetPrice.wsdl
[wsdl2java] WSDL2Java test/wsdl/multibinding/multibinding.wsdl
[wsdl2java] WSDL2Java test/wsdl/multiref/MultiRefTest.wsdl
[wsdl2java] WSDL2Java test/wsdl/addrNoImplSEI/AddressBook.wsdl
[wsdl2java] WSDL2Java test/wsdl/opStyles/opStyles.wsdl
solicitResponse is a solicit-response style operation and is unsupported.
notification is a notification style operation and is unsupported.
[wsdl2java] WSDL2Java test/wsdl/refattr/refattr.wsdl
     [copy] Copying 9 files to /home/rubys/jakarta/xml-axis/java/build/work/test/wsdl/roundtrip
    [javac] Compiling 9 source files to /home/rubys/jakarta/xml-axis/java/build/classes
[java2wsdl] Java2WSDL test.wsdl.roundtrip.RoundtripPortType
   [delete] Deleting directory /home/rubys/jakarta/xml-axis/java/build/classes/test/wsdl/roundtrip
[wsdl2java] WSDL2Java build/work/test/wsdl/roundtrip/Roundtrip.wsdl
[wsdl2java] WSDL2Java test/wsdl/sequence/SequenceTest.wsdl
     [copy] Copying 1 file to /home/rubys/jakarta/xml-axis/java/build/work/test/wsdl/sequence
    [javac] Compiling 6 source files to /home/rubys/jakarta/xml-axis/java/build/classes
[java2wsdl] Java2WSDL test.wsdl.sequence.SequenceTestPortType
   [delete] Deleting directory /home/rubys/jakarta/xml-axis/java/build/classes/test/wsdl/sequence
[wsdl2java] WSDL2Java build/work/test/wsdl/sequence/SequenceTest.wsdl
[wsdl2java] WSDL2Java test/wsdl/arrays/ArrayTest.wsdl
[wsdl2java] WSDL2Java test/wsdl/inheritance/InheritanceTest.wsdl
     [copy] Copying 2 files to /home/rubys/jakarta/xml-axis/java/build/work/test/wsdl/inheritance
    [javac] Compiling 6 source files to /home/rubys/jakarta/xml-axis/java/build/classes
[java2wsdl] Java2WSDL test.wsdl.inheritance.InheritancePortType
   [delete] Deleting directory /home/rubys/jakarta/xml-axis/java/build/classes/test/wsdl/inheritance
[wsdl2java] WSDL2Java build/work/test/wsdl/inheritance/InheritanceTest.wsdl
    [javac] Compiling 6 source files to /home/rubys/jakarta/xml-axis/java/build/classes
[java2wsdl] Java2WSDL test.wsdl.inheritance.Baby
[wsdl2java] WSDL2Java test/wsdl/marrays/MArrayTest.wsdl
[wsdl2java] WSDL2Java test/wsdl/marrays/MArrayTest.wsdl
[wsdl2java] WSDL2Java test/wsdl/nested/Nested.wsdl
[wsdl2java] WSDL2Java test/wsdl/datatypes/DataTypes.wsdl
[wsdl2java] WSDL2Java test/wsdl/wrapped/CityBBB.wsdl
[wsdl2java] WSDL2Java test/wsdl/extensibility/QueryTypes.wsdl
[wsdl2java] WSDL2Java test/wsdl/extensibility/ExtensibilityQuery.wsdl
[wsdl2java] WSDL2Java test/wsdl/_import/Import.wsdl
[wsdl2java] WSDL2Java test/wsdl/_import/Import.wsdl
[wsdl2java] WSDL2Java test/wsdl/_import/ImportMessagesXSDImport.wsdl
[wsdl2java] WSDL2Java test/wsdl/import2/service1/service2/testimport.wsdl
[wsdl2java] WSDL2Java test/wsdl/inout/inout.wsdl
[wsdl2java] WSDL2Java http://www.xmethods.net/tmodels/InteropTest.wsdl
[wsdl2java] WSDL2Java http://www.whitemesa.com/interop/InteropTest.wsdl
[wsdl2java] java.io.IOException: WSDL2Java emitter timed out (this often means the WSDL at
the specified URL is inaccessible)!
[wsdl2java] WSDL2Java http://www.whitemesa.com/interop/InteropTestB.wsdl
[wsdl2java] java.io.IOException: WSDL2Java emitter timed out (this often means the WSDL at
the specified URL is inaccessible)!
[wsdl2java] WSDL2Java http://mssoapinterop.org/stk/InteropB.wsdl
[wsdl2java] WSDL2Java http://mssoapinterop.org/stk/InteropBtyped.wsdl
[wsdl2java] WSDL2Java http://mssoapinterop.org/stk/InteropC.wsdl
[wsdl2java] WSDL2Java http://www.whitemesa.com/r3/import1.wsdl
[wsdl2java] java.io.IOException: WSDL2Java emitter timed out (this often means the WSDL at
the specified URL is inaccessible)!
[java2wsdl] Java2WSDL test.wsdl.interop3.import1.definitions.SoapInteropImport1PortType
[java2wsdl] java.lang.ClassNotFoundException: test.wsdl.interop3.import1.definitions.SoapInteropImport1PortType
[java2wsdl] 	at org.apache.tools.ant.AntClassLoader.findClassInComponents(AntClassLoader.java:1070)
[java2wsdl] 	at org.apache.tools.ant.AntClassLoader.findClass(AntClassLoader.java:1031)
[java2wsdl] 	at org.apache.tools.ant.AntClassLoader.loadClass(AntClassLoader.java:920)
[java2wsdl] 	at java.lang.ClassLoader.loadClass(ClassLoader.java:255)
[java2wsdl] 	at java.lang.ClassLoader.loadClassInternal(ClassLoader.java:315)
[java2wsdl] 	at java.lang.Class.forName0(Native Method)
[java2wsdl] 	at java.lang.Class.forName(Class.java:120)
[java2wsdl] 	at org.apache.axis.wsdl.fromJava.Emitter.setCls(Emitter.java:1085)
[java2wsdl] 	at test.wsdl.Java2WsdlAntTask.execute(Java2WsdlAntTask.java:113)
[java2wsdl] 	at org.apache.tools.ant.Task.perform(Task.java:317)
[java2wsdl] 	at org.apache.tools.ant.Target.execute(Target.java:309)
[java2wsdl] 	at org.apache.tools.ant.Target.performTasks(Target.java:334)
[java2wsdl] 	at org.apache.tools.ant.Project.executeTarget(Project.java:1216)
[java2wsdl] 	at org.apache.tools.ant.taskdefs.Ant.execute(Ant.java:374)
[java2wsdl] 	at org.apache.tools.ant.Task.perform(Task.java:317)
[java2wsdl] 	at org.apache.tools.ant.Target.execute(Target.java:309)
[java2wsdl] 	at org.apache.tools.ant.Target.performTasks(Target.java:334)
[java2wsdl] 	at org.apache.tools.ant.Project.executeTarget(Project.java:1216)
[java2wsdl] 	at org.apache.tools.ant.taskdefs.Ant.execute(Ant.java:374)
[java2wsdl] 	at org.apache.tools.ant.Task.perform(Task.java:317)
[java2wsdl] 	at org.apache.tools.ant.Target.execute(Target.java:309)
[java2wsdl] 	at org.apache.tools.ant.Target.performTasks(Target.java:334)
[java2wsdl] 	at org.apache.tools.ant.Project.executeTarget(Project.java:1216)
[java2wsdl] 	at org.apache.tools.ant.Project.executeTargets(Project.java:1160)
[java2wsdl] 	at org.apache.tools.ant.Main.runBuild(Main.java:606)
[java2wsdl] 	at org.apache.tools.ant.Main.start(Main.java:197)
[java2wsdl] 	at org.apache.tools.ant.Main.main(Main.java:235)
[java2wsdl] java.lang.ClassNotFoundException: test.wsdl.interop3.import1.SoapInteropImport1BindingImpl
[java2wsdl] 	at org.apache.tools.ant.AntClassLoader.findClassInComponents(AntClassLoader.java:1070)
[java2wsdl] 	at org.apache.tools.ant.AntClassLoader.findClass(AntClassLoader.java:1031)
[java2wsdl] 	at org.apache.tools.ant.AntClassLoader.loadClass(AntClassLoader.java:920)
[java2wsdl] 	at java.lang.ClassLoader.loadClass(ClassLoader.java:255)
[java2wsdl] 	at java.lang.ClassLoader.loadClassInternal(ClassLoader.java:315)
[java2wsdl] 	at java.lang.Class.forName0(Native Method)
[java2wsdl] 	at java.lang.Class.forName(Class.java:120)
[java2wsdl] 	at org.apache.axis.wsdl.fromJava.Emitter.setImplCls(Emitter.java:1114)
[java2wsdl] 	at test.wsdl.Java2WsdlAntTask.execute(Java2WsdlAntTask.java:115)
[java2wsdl] 	at org.apache.tools.ant.Task.perform(Task.java:317)
[java2wsdl] 	at org.apache.tools.ant.Target.execute(Target.java:309)
[java2wsdl] 	at org.apache.tools.ant.Target.performTasks(Target.java:334)
[java2wsdl] 	at org.apache.tools.ant.Project.executeTarget(Project.java:1216)
[java2wsdl] 	at org.apache.tools.ant.taskdefs.Ant.execute(Ant.java:374)
[java2wsdl] 	at org.apache.tools.ant.Task.perform(Task.java:317)
[java2wsdl] 	at org.apache.tools.ant.Target.execute(Target.java:309)
[java2wsdl] 	at org.apache.tools.ant.Target.performTasks(Target.java:334)
[java2wsdl] 	at org.apache.tools.ant.Project.executeTarget(Project.java:1216)
[java2wsdl] 	at org.apache.tools.ant.taskdefs.Ant.execute(Ant.java:374)
[java2wsdl] 	at org.apache.tools.ant.Task.perform(Task.java:317)
[java2wsdl] 	at org.apache.tools.ant.Target.execute(Target.java:309)
[java2wsdl] 	at org.apache.tools.ant.Target.performTasks(Target.java:334)
[java2wsdl] 	at org.apache.tools.ant.Project.executeTarget(Project.java:1216)
[java2wsdl] 	at org.apache.tools.ant.Project.executeTargets(Project.java:1160)
[java2wsdl] 	at org.apache.tools.ant.Main.runBuild(Main.java:606)
[java2wsdl] 	at org.apache.tools.ant.Main.start(Main.java:197)
[java2wsdl] 	at org.apache.tools.ant.Main.main(Main.java:235)
[java2wsdl] java.lang.NullPointerException
[java2wsdl] 	at java.lang.Class.isAssignableFrom(Native Method)
[java2wsdl] 	at org.apache.axis.description.ServiceDesc.setImplClass(ServiceDesc.java:203)
[java2wsdl] 	at org.apache.axis.wsdl.fromJava.Emitter.emit(Emitter.java:213)
[java2wsdl] 	at org.apache.axis.wsdl.fromJava.Emitter.emit(Emitter.java:299)
[java2wsdl] 	at test.wsdl.Java2WsdlAntTask.execute(Java2WsdlAntTask.java:136)
[java2wsdl] 	at org.apache.tools.ant.Task.perform(Task.java:317)
[java2wsdl] 	at org.apache.tools.ant.Target.execute(Target.java:309)
[java2wsdl] 	at org.apache.tools.ant.Target.performTasks(Target.java:334)
[java2wsdl] 	at org.apache.tools.ant.Project.executeTarget(Project.java:1216)
[java2wsdl] 	at org.apache.tools.ant.taskdefs.Ant.execute(Ant.java:374)
[java2wsdl] 	at org.apache.tools.ant.Task.perform(Task.java:317)
[java2wsdl] 	at org.apache.tools.ant.Target.execute(Target.java:309)
[java2wsdl] 	at org.apache.tools.ant.Target.performTasks(Target.java:334)
[java2wsdl] 	at org.apache.tools.ant.Project.executeTarget(Project.java:1216)
[java2wsdl] 	at org.apache.tools.ant.taskdefs.Ant.execute(Ant.java:374)
[java2wsdl] 	at org.apache.tools.ant.Task.perform(Task.java:317)
[java2wsdl] 	at org.apache.tools.ant.Target.execute(Target.java:309)
[java2wsdl] 	at org.apache.tools.ant.Target.performTasks(Target.java:334)
[java2wsdl] 	at org.apache.tools.ant.Project.executeTarget(Project.java:1216)
[java2wsdl] 	at org.apache.tools.ant.Project.executeTargets(Project.java:1160)
[java2wsdl] 	at org.apache.tools.ant.Main.runBuild(Main.java:606)
[java2wsdl] 	at org.apache.tools.ant.Main.start(Main.java:197)
[java2wsdl] 	at org.apache.tools.ant.Main.main(Main.java:235)

BUILD FAILED
/home/rubys/jakarta/xml-axis/java/test/wsdl/Wsdl2javaTestSuite.xml:546: Error while running
test.wsdl.Java2WsdlAntTask

Total time: 8 minutes 20 seconds

Mime
View raw message