axis-java-dev mailing list archives

Site index · List index
Message view « Date » · « Thread »
Top « Date » · « Thread »
From Glen Daniels <gdani...@macromedia.com>
Subject RE: [GUMP] Build Failure - Axis
Date Fri, 19 Apr 2002 12:42:11 GMT

Team, how are we gonna debug this?  Sam, can you help out here?

--Glen

> -----Original Message-----
> From: Sam Ruby [mailto:rubys@us.ibm.com]
> Sent: Friday, April 19, 2002 8:35 AM
> To: axis-dev@xml.apache.org
> Subject: [GUMP] Build Failure - Axis
> 
> 
> ----------------------------------------------------
> This email is autogenerated from the output from:
> <http://jakarta.apache.org/builds/gump/2002-04-19/xml-axis.html>
> ----------------------------------------------------
> 
> Build results exceed maximum length.
> Please see URL above for details.
> Last 50 lines of build output follows.
> 
>     [junit]     <property name="env.jakarta_site2" 
> value="1"></property>
>     [junit]     <property name="env.village" value="1"></property>
>     [junit]     <property name="env.commons_collections" 
> value="1"></property>
>     [junit]     <property name="java.awt.graphicsenv" 
> value="sun.awt.X11GraphicsEnvironment"></property>
>     [junit]     <property name="java.vm.vendor" value="Sun 
> Microsystems Inc."></property>
>     [junit]     <property name="env.krysalis_centipede" 
> value="1"></property>
>     [junit]     <property name="env.jakarta_james" 
> value="1"></property>
>     [junit]     <property name="env.jakarta_avalon_dist" 
> value="1"></property>
>     [junit]     <property name="env.jakarta_avalon_excalibur" 
> value="1"></property>
>     [junit]     <property 
> name="env.jakarta_avalon_exceptionutil" value="1"></property>
>     [junit]     <property name="env.jrefactory" value="1"></property>
>     [junit]     <property name="env.town" value="1"></property>
>     [junit]     <property name="env.commons_validator" 
> value="1"></property>
>     [junit]     <property name="test.functional.reportdir" 
> value="test-reports"></property>
>     [junit]     <property name="build.lib" 
> value="build/lib"></property>
>     [junit]     <property name="build.dir" value="build"></property>
>     [junit]     <property 
> name="env.jakarta_turbine_stratum_gump_descriptor" 
> value="1"></property>
>     [junit]     <property name="env.commons_http" 
> value="1"></property>
>     [junit]     <property name="ant.version" value="Apache 
> Ant version 1.5alpha compiled on April 19 2002"></property>
>     [junit]     <property name="regexp.jar" 
> value="test/lib/jakarta-oro-2.0.5.jar"></property>
>     [junit]     <property name="env.HOSTNAME" 
> value="rubix"></property>
>     [junit]     <property name="file.encoding" 
> value="ISO-8859-1"></property>
>     [junit]     <property name="undeploy.xml.property" 
> value="/home/rubys/jakarta/xml-axis/java/build/work/samples/us
erguide/example6/undeploy.wsdd:/home/rubys/jakarta/xml-> axis/java/build/work/samples/addr/undeploy.wsdd:/home/rubys/ja
> karta/xml-axis/java/build/work/test/wsdl/multibinding/undeploy
> .wsdd:/home/rubys/jakarta/xml-axis/java/build/work/test/wsdl/m
> ultiref/undeploy.wsdd:/home/rubys/jakarta/xml-axis/java/build/
work/test/wsdl/opStyles/undeploy.wsdd:/home/rubys/jakarta/xml-> axis/java/build/work/test/wsdl/refattr/undeploy.wsdd:/home/rub
> ys/jakarta/xml-axis/java/build/work/test/wsdl/roundtrip/undepl
> oy.wsdd:/home/rubys/jakarta/xml-axis/java/build/work/test/wsdl
> /sequence/undeploy.wsdd:/home/rubys/jakarta/xml-axis/java/buil
d/work/test/wsdl/arrays/undeploy.wsdd:/home/rubys/jakarta/xml-> axis/java/build/work/test/wsdl/inheritance/undeploy.wsdd:/home
> /rubys/jakarta/xml-axis/java/build/work/test/wsdl/marrays/unde
> ploy.wsdd:/home/rubys/jakarta/xml-axis/java/build/work/test/ws
> dl/nested/und!
> eploy.wsdd:/home/rubys/jakarta/xml-axis/java/build/work/test/w
> sdl/datatypes/undeploy.wsdd:/home/rubys/jakarta/xml-axis/java/
build/work/test/wsdl/wrapped/undeploy.wsdd:/home/rubys/jakarta/xml-axis/java/build/work/test/wsdl/>
_import/undeploy.wsdd:/home/rubys/jakarta/xml-axis/java/build/
work/test/wsdl/inout/undeploy.wsdd:/home/rubys/jakarta/xml-> axis/java/build/work/test/wsdl/interop3/import1/undeploy.wsdd:
> /home/rubys/jakarta/xml-axis/java/build/work/test/wsdl/interop
3/import1/step6/definitions/undeploy.wsdd:/home/rubys/jakarta/xml-> axis/java/build/work/test/wsdl/interop3/import2/undeploy.wsdd:
> /home/rubys/jakarta/xml-axis/java/build/work/test/wsdl/interop
3/import2/step6/definitions/undeploy.wsdd:/home/rubys/jakarta/xml-> axis/java/build/work/test/wsdl/interop3/absimport2/undeploy.ws
> dd:/home/rubys/jakarta/xml-axis/java/build/work/test/wsdl/inte
> rop3/import3/undeploy.wsdd:/home/rubys/jakarta/xml-axis/java/b
uild/work/test/wsdl/interop3/import3/step6/definitions/undeploy.wsdd:/home/rubys/j!
> akarta/xml-axis/java/build/work/test/wsdl/interop3/groupE/unde
> ploy.wsdd:/home/rubys/jakarta/xml-axis/java/build/work/test/ws
> dl/clash/undeploy.wsdd:/home/rubys/jakarta/xml-axis/java/build
/work/test/wsdl/faults/undeploy.wsdd:/home/rubys/jakarta/xml-> axis/java/build/work/test/wsdl/names/undeploy.wsdd:/home/rubys
> /jakarta/xml-axis/java/build/work/test/wsdl/types/comprehensiv
> e_service/undeploy.wsdd:/home/rubys/jakarta/xml-axis/java/buil
d/work/test/wsdl/parameterOrder/undeploy.wsdd:/home/rubys/jakarta/xml-> axis/java/build/work/test/wsdl/getPort/undeploy.wsdd:/home/rub
> ys/jakarta/xml-axis/java/build/work/test/wsdl/qualify/undeploy
> .wsdd:/home/rubys/jakarta/xml-axis/java/build/work/test/import
> 2/undeploy.wsdd:/home/rubys/jakarta/xml-axis/java/build/work/n
> et/xmethods/undeploy.wsdd:/home/rubys/jakarta/xml-axis/java/bu
ild/work/interop/test/undeploy.wsdd:/home/rubys/jakarta/xml-> axis/java/build/work/interop/testb/undeploy.wsdd:/home/rubys/j
> akarta/xml-axis/java/build/work/mssoapinterop/interopb/u!
> ndeploy.wsdd:/home/rubys/jakarta/xml-axis/java/build/work/msso
apinterop/interopbtyped/undeploy.wsdd:/home/rubys/jakarta/xml-> axis/java/build/work/mssoapinterop/interopc/undeploy.wsdd:/hom
> e/rubys/jakarta/xml-axis/java/build/work/com/themindelectric/w
> ww/undeploy.wsdd"></property>
>     [junit]     <property name="packages" 
> value="org.*,javax.*"></property>
>     [junit]     <property name="env.excalibur_instrument" 
> value="1"></property>
>     [junit]   </properties>
>     [junit]   <testcase name="test1TypeTestAllPrimitivesIn" 
> time="5.485"></testcase>
>     [junit]   <testcase 
> name="test2TypeTestAllPrimitivesInout" time="0.545"></testcase>
>     [junit]   <testcase name="test3TypeTestAllPrimitivesOut" 
> time="0.272">
>     [junit]     <failure message="Remote Exception caught: 
> org.xml.sax.SAXParseException: The value of the attribute 
> &quot;xmlns:qns&quot; is invalid. Prefixed namespace bindings 
> may not be empty." 
> type="junit.framework.AssertionFailedError">junit.framework.As
> sertionFailedError: Remote Exception caught: 
> org.xml.sax.SAXParseException: The value of the attribute 
> &quot;xmlns:qns&quot; is invalid. Prefixed namespace bindings 
> may not be empty.
>     [junit] 	at 
> test.wsdl.types.comprehensive_service.TypeTestServiceTestCase.
> test3TypeTestAllPrimitivesOut(Unknown Source)
>     [junit] </failure>
>     [junit]   </testcase>
>     [junit]   <system-out></system-out>
>     [junit]   <system-err></system-err>
>     [junit] </testsuite>
>      [java] - TCPListener received new connection: 
> Socket[addr=rubix/127.0.0.1,port=33208,localport=8088]
>      [java] - AxisListener quitting.
> Trying to override old definition of task runaxisfunctionaltests
> 
> stop-functional-test-http-server:
>      [echo] Stopping test http server.
>      [java] - Administration service requested to quit, quitting.
>      [java] - SimpleAxisServer quitting.
>      [java] <Admin> quitting.</Admin>
> [runaxisfunctionaltests] RunAxisFunctionalTestsTask.callStop 
> successfully sent quit message.
> 
> BUILD FAILED
> /home/rubys/jakarta/xml-axis/java/test/build_functional_tests.
> xml:93: Test 
> test.wsdl.types.comprehensive_service.TypeTestServiceTestCase failed
> 
> Total time: 13 minutes 26 seconds
> 

Mime
View raw message