axis-java-dev mailing list archives

Site index · List index
Message view « Date » · « Thread »
Top « Date » · « Thread »
From Sam Ruby <ru...@us.ibm.com>
Subject [GUMP] Build Failure - Axis
Date Sat, 16 Feb 2002 13:53:24 GMT
----------------------------------------------------
This email is autogenerated from the output from:
<http://jakarta.apache.org/builds/gump/2002-02-16/xml-axis.html>
----------------------------------------------------

Buildfile: build.xml

setenv:
    [mkdir] Created dir: /home/rubys/jakarta/xml-axis/java/build/classes
    [mkdir] Created dir: /home/rubys/jakarta/xml-axis/java/build/lib
dropping /home/rubys/jakarta/xml-security/xmlsec.jar from path as it doesn't exist
dropping /home/rubys/jakarta/xml-security/xmlsec.jar from path as it doesn't exist
dropping /home/rubys/jakarta/xml-security/xmlsec.jar from path as it doesn't exist
dropping /home/rubys/jakarta/xml-security/xmlsec.jar from path as it doesn't exist
dropping /home/rubys/jakarta/xml-security/xmlsec.jar from path as it doesn't exist
dropping /home/rubys/jakarta/xml-security/xmlsec.jar from path as it doesn't exist
dropping /home/rubys/jakarta/xml-security/xmlsec.jar from path as it doesn't exist
dropping /home/rubys/jakarta/xml-security/xmlsec.jar from path as it doesn't exist
dropping /home/rubys/jakarta/xml-security/xmlsec.jar from path as it doesn't exist
dropping /home/rubys/jakarta/xml-security/xmlsec.jar from path as it doesn't exist
dropping /home/rubys/jakarta/xml-security/xmlsec.jar from path as it doesn't exist
     [echo] --- Build environment for Axis ---
     [echo] --- Flags (Note: If the {property name} is displayed, 
     [echo]            then the component is not present)
     [echo] 
     [echo] === Required Libraries ===
     [echo] wsdl4j.present=true
     [echo] log4j.present=true
     [echo] clutil.present=true
     [echo] bcel.present=true
     [echo] 
     [echo] --- Optional Libraries ---
     [echo] servlet.present=true
     [echo] junit.present=true
     [echo] activation.present=true
     [echo] mailapi.present=true
     [echo] attachments.present=true
     [echo] security.present=${security.present}
     [echo] 
     [echo] --- Property values ---
     [echo] debug=off
     [echo] deprecation=true

compile:
    [javac] Compiling 411 source files to /home/rubys/jakarta/xml-axis/java/build/classes
dropping /home/rubys/jakarta/xml-security/xmlsec.jar from path as it doesn't exist
    [javac] /home/rubys/jakarta/xml-axis/java/src/org/apache/axis/utils/Options.java:112:
warning: getAllPossiblePriorities() in org.apache.log4j.Priority has been deprecated
    [javac]             Priority[] allPriorities = Priority.getAllPossiblePriorities(); 
    [javac]                                                ^
    [javac] /home/rubys/jakarta/xml-axis/java/src/org/apache/axis/utils/Options.java:113:
warning: getPriority() in org.apache.log4j.Category has been deprecated
    [javac]             Priority currentPriority = Category.getRoot().getPriority();
    [javac]                                                        ^
    [javac] /home/rubys/jakarta/xml-axis/java/src/org/apache/axis/utils/Options.java:118:
warning: setPriority(org.apache.log4j.Priority) in org.apache.log4j.Category has been deprecated
    [javac]                     Category.getRoot().setPriority(allPriorities[i]);
    [javac]                                     ^
    [javac] /home/rubys/jakarta/xml-axis/java/src/org/apache/axis/handlers/LogMessage.java:73:
warning: setPriority(org.apache.log4j.Priority) in org.apache.log4j.Category has been deprecated
    [javac]         category.setPriority(Priority.INFO);
    [javac]                 ^
    [javac] 4 warnings
     [copy] Copying 1 file to /home/rubys/jakarta/xml-axis/java/build/classes/org/apache/axis/server
     [copy] Copying 1 file to /home/rubys/jakarta/xml-axis/java/build/classes/org/apache/axis/client
     [copy] Copying 1 file to /home/rubys/jakarta/xml-axis/java/build/classes
     [copy] Copying 1 file to /home/rubys/jakarta/xml-axis/java/build/classes/org/apache/axis/utils
      [jar] DEPRECATED - The jarfile attribute is deprecated. Use destfile attribute instead.
      [jar] Building jar: /home/rubys/jakarta/xml-axis/java/build/lib/axis.jar
     [copy] Copying 1 file to /home/rubys/jakarta/xml-axis/java/build/lib
     [copy] Copying 1 file to /home/rubys/jakarta/xml-axis/java/build/lib
     [copy] Copying 1 file to /home/rubys/jakarta/xml-axis/java/build/lib
     [copy] Copying 1 file to /home/rubys/jakarta/xml-axis/java/build/lib

post-compile:

javadocs:
    [mkdir] Created dir: /home/rubys/jakarta/xml-axis/java/build/javadocs
  [javadoc] Generating Javadoc
dropping /home/rubys/jakarta/xml-security/xmlsec.jar from path as it doesn't exist
  [javadoc] Javadoc execution
  [javadoc] Loading source files for package javax.xml.rpc...
  [javadoc] Loading source files for package javax.xml.rpc.encoding...
  [javadoc] Loading source files for package javax.xml.rpc.holders...
  [javadoc] Loading source files for package javax.xml.rpc.namespace...
  [javadoc] Loading source files for package javax.xml.rpc.soap...
  [javadoc] Loading source files for package javax.xml.rpc.handler...
  [javadoc] Loading source files for package javax.xml.rpc.handler.soap...
  [javadoc] Loading source files for package javax.xml.rpc.server...
  [javadoc] Loading source files for package javax.xml.messaging...
  [javadoc] Loading source files for package javax.xml.soap...
  [javadoc] Loading source files for package javax.xml.transform...
  [javadoc] Loading source files for package org.apache.axis...
  [javadoc] Loading source files for package org.apache.axis.attachments...
  [javadoc] Loading source files for package org.apache.axis.client...
  [javadoc] Loading source files for package org.apache.axis.configuration...
  [javadoc] Loading source files for package org.apache.axis.deployment...
  [javadoc] Loading source files for package org.apache.axis.deployment.v2dd...
  [javadoc] Loading source files for package org.apache.axis.deployment.v2dd.providers...
  [javadoc] Loading source files for package org.apache.axis.deployment.wsdd...
  [javadoc] Loading source files for package org.apache.axis.deployment.wsdd.providers...
  [javadoc] Loading source files for package org.apache.axis.deployment.wsml...
  [javadoc] Loading source files for package org.apache.axis.encoding...
  [javadoc] Loading source files for package org.apache.axis.encoding.ser...
  [javadoc] Loading source files for package org.apache.axis.handlers...
  [javadoc] Loading source files for package org.apache.axis.handlers.http...
  [javadoc] Loading source files for package org.apache.axis.handlers.soap...
  [javadoc] Loading source files for package org.apache.axis.message...
  [javadoc] Loading source files for package org.apache.axis.providers...
  [javadoc] Loading source files for package org.apache.axis.providers.java...
  [javadoc] Loading source files for package org.apache.axis.resolver...
  [javadoc] Loading source files for package org.apache.axis.security...
  [javadoc] Loading source files for package org.apache.axis.security.servlet...
  [javadoc] Loading source files for package org.apache.axis.security.simple...
  [javadoc] Loading source files for package org.apache.axis.server...
  [javadoc] Loading source files for package org.apache.axis.session...
  [javadoc] Loading source files for package org.apache.axis.strategies...
  [javadoc] Loading source files for package org.apache.axis.transport.http...
  [javadoc] Loading source files for package org.apache.axis.transport.local...
  [javadoc] Loading source files for package org.apache.axis.utils...
  [javadoc] Loading source files for package org.apache.axis.utils.cache...
  [javadoc] Loading source files for package org.apache.axis.utils.compiler...
  [javadoc] Loading source files for package org.apache.axis.wsdl...
  [javadoc] Loading source files for package org.apache.axis.wsdl.fromJava...
  [javadoc] Loading source files for package org.apache.axis.wsdl.toJava...
  [javadoc] Constructing Javadoc information...
  [javadoc] Building tree for all the packages and classes...
  [javadoc] Building index for all the packages and classes...
  [javadoc] Building index for all classes...

samples:
    [javac] Compiling 61 source files to /home/rubys/jakarta/xml-axis/java/build/classes
dropping /home/rubys/jakarta/xml-security/xmlsec.jar from path as it doesn't exist

buildTest:
     [echo] junit package found ...
    [javac] Compiling 73 source files to /home/rubys/jakarta/xml-axis/java/build/classes
dropping /home/rubys/jakarta/xml-security/xmlsec.jar from path as it doesn't exist
    [javac] Note: Some input files use or override a deprecated API.
    [javac] Note: Recompile with -deprecation for details.
     [copy] Copying 1 file to /home/rubys/jakarta/xml-axis/java/build/classes/test/wsdd

junit:
    [mkdir] Created dir: /home/rubys/jakarta/xml-axis/java/test-reports
    [junit] Running test.RPCDispatch.PackageTests
dropping /home/rubys/jakarta/xml-security/xmlsec.jar from path as it doesn't exist
dropping /home/rubys/jakarta/xml-security/xmlsec.jar from path as it doesn't exist
dropping /home/rubys/jakarta/xml-security/xmlsec.jar from path as it doesn't exist
dropping /home/rubys/jakarta/xml-security/xmlsec.jar from path as it doesn't exist
    [junit] Tests run: 11, Failures: 0, Errors: 0, Time elapsed: 2.623 sec
    [junit] Running test.chains.PackageTests
dropping /home/rubys/jakarta/xml-security/xmlsec.jar from path as it doesn't exist
dropping /home/rubys/jakarta/xml-security/xmlsec.jar from path as it doesn't exist
dropping /home/rubys/jakarta/xml-security/xmlsec.jar from path as it doesn't exist
dropping /home/rubys/jakarta/xml-security/xmlsec.jar from path as it doesn't exist
    [junit] Tests run: 4, Failures: 0, Errors: 0, Time elapsed: 2.731 sec
    [junit] Running test.encoding.PackageTests
dropping /home/rubys/jakarta/xml-security/xmlsec.jar from path as it doesn't exist
dropping /home/rubys/jakarta/xml-security/xmlsec.jar from path as it doesn't exist
dropping /home/rubys/jakarta/xml-security/xmlsec.jar from path as it doesn't exist
dropping /home/rubys/jakarta/xml-security/xmlsec.jar from path as it doesn't exist
    [junit] Tests run: 167, Failures: 0, Errors: 0, Time elapsed: 2.848 sec
    [junit] Running test.faults.PackageTests
dropping /home/rubys/jakarta/xml-security/xmlsec.jar from path as it doesn't exist
dropping /home/rubys/jakarta/xml-security/xmlsec.jar from path as it doesn't exist
dropping /home/rubys/jakarta/xml-security/xmlsec.jar from path as it doesn't exist
dropping /home/rubys/jakarta/xml-security/xmlsec.jar from path as it doesn't exist
    [junit] Tests run: 2, Failures: 0, Errors: 0, Time elapsed: 4.63 sec
    [junit] Running test.soap.PackageTests
dropping /home/rubys/jakarta/xml-security/xmlsec.jar from path as it doesn't exist
dropping /home/rubys/jakarta/xml-security/xmlsec.jar from path as it doesn't exist
dropping /home/rubys/jakarta/xml-security/xmlsec.jar from path as it doesn't exist
dropping /home/rubys/jakarta/xml-security/xmlsec.jar from path as it doesn't exist
    [junit] Tests run: 4, Failures: 0, Errors: 0, Time elapsed: 4.322 sec
    [junit] Running test.outparams.PackageTests
dropping /home/rubys/jakarta/xml-security/xmlsec.jar from path as it doesn't exist
dropping /home/rubys/jakarta/xml-security/xmlsec.jar from path as it doesn't exist
dropping /home/rubys/jakarta/xml-security/xmlsec.jar from path as it doesn't exist
dropping /home/rubys/jakarta/xml-security/xmlsec.jar from path as it doesn't exist
    [junit] Tests run: 1, Failures: 0, Errors: 0, Time elapsed: 3.95 sec
    [junit] Running test.session.PackageTests
dropping /home/rubys/jakarta/xml-security/xmlsec.jar from path as it doesn't exist
dropping /home/rubys/jakarta/xml-security/xmlsec.jar from path as it doesn't exist
dropping /home/rubys/jakarta/xml-security/xmlsec.jar from path as it doesn't exist
dropping /home/rubys/jakarta/xml-security/xmlsec.jar from path as it doesn't exist
    [junit] Tests run: 2, Failures: 0, Errors: 0, Time elapsed: 8.803 sec
    [junit] Running test.utils.cache.PackageTests
dropping /home/rubys/jakarta/xml-security/xmlsec.jar from path as it doesn't exist
dropping /home/rubys/jakarta/xml-security/xmlsec.jar from path as it doesn't exist
dropping /home/rubys/jakarta/xml-security/xmlsec.jar from path as it doesn't exist
dropping /home/rubys/jakarta/xml-security/xmlsec.jar from path as it doesn't exist
    [junit] Tests run: 5, Failures: 0, Errors: 0, Time elapsed: 1.65 sec
    [junit] Running test.utils.PackageTests
dropping /home/rubys/jakarta/xml-security/xmlsec.jar from path as it doesn't exist
dropping /home/rubys/jakarta/xml-security/xmlsec.jar from path as it doesn't exist
dropping /home/rubys/jakarta/xml-security/xmlsec.jar from path as it doesn't exist
dropping /home/rubys/jakarta/xml-security/xmlsec.jar from path as it doesn't exist
    [junit] Tests run: 31, Failures: 0, Errors: 0, Time elapsed: 4.404 sec
    [junit] Running test.wsdd.PackageTests
dropping /home/rubys/jakarta/xml-security/xmlsec.jar from path as it doesn't exist
dropping /home/rubys/jakarta/xml-security/xmlsec.jar from path as it doesn't exist
dropping /home/rubys/jakarta/xml-security/xmlsec.jar from path as it doesn't exist
dropping /home/rubys/jakarta/xml-security/xmlsec.jar from path as it doesn't exist
    [junit] Tests run: 10, Failures: 0, Errors: 0, Time elapsed: 5.513 sec

dist:
    [mkdir] Created dir: /home/rubys/jakarta/xml-axis/java/axis-1_0
    [mkdir] Created dir: /home/rubys/jakarta/xml-axis/java/axis-1_0/docs
    [mkdir] Created dir: /home/rubys/jakarta/xml-axis/java/axis-1_0/docs/apiDocs
    [mkdir] Created dir: /home/rubys/jakarta/xml-axis/java/axis-1_0/lib
    [mkdir] Created dir: /home/rubys/jakarta/xml-axis/java/axis-1_0/samples
    [mkdir] Created dir: /home/rubys/jakarta/xml-axis/java/axis-1_0/webapps/axis
     [copy] Copying 1020 files to /home/rubys/jakarta/xml-axis/java/axis-1_0/docs/apiDocs
     [copy] Copying 5 files to /home/rubys/jakarta/xml-axis/java/axis-1_0/lib
     [copy] Copying 218 files to /home/rubys/jakarta/xml-axis/java/axis-1_0/samples
     [copy] Copying 31 files to /home/rubys/jakarta/xml-axis/java/axis-1_0/docs
     [copy] Copying 3 files to /home/rubys/jakarta/xml-axis/java/axis-1_0/webapps/axis
     [copy] Copying 2 files to /home/rubys/jakarta/xml-axis/java/axis-1_0/webapps/axis/WEB-INF
     [copy] Copying 5 files to /home/rubys/jakarta/xml-axis/java/axis-1_0/webapps/axis/WEB-INF/lib
     [copy] Copying 84 files to /home/rubys/jakarta/xml-axis/java/axis-1_0/webapps/axis/WEB-INF/classes/samples
     [copy] Copying 1 file to /home/rubys/jakarta/xml-axis/java/axis-1_0
     [copy] Copying 1 file to /home/rubys/jakarta/xml-axis/java/axis-1_0
     [copy] Copying 1 file to /home/rubys/jakarta/xml-axis/java/axis-1_0

functional-tests:
dropping /home/rubys/jakarta/xml-security/xmlsec.jar from path as it doesn't exist

wsdl-setup:
     [copy] Copying 1 file to /home/rubys/jakarta/xml-axis/java/build/classes
     [copy] Copying 4 files to /home/rubys/jakarta/xml-axis/java/build/work/samples
dropping /home/rubys/jakarta/xml-security/xmlsec.jar from path as it doesn't exist
dropping /home/rubys/jakarta/xml-security/xmlsec.jar from path as it doesn't exist

main:
     [echo] Running WSDL2Java and Java2WSDL Emitters
[wsdl2java] WSDL2Java samples/addr/AddressBook.wsdl
[java2wsdl] Java2WSDL samples.userguide.example6.WidgetPrice
[java2wsdl] log4j:WARN No appenders could be found for logger (org.apache.axis.utils.NSStack).
[java2wsdl] log4j:WARN Please initialize the log4j system properly.
[java2wsdl] ----end
[java2wsdl] ----
[java2wsdl] http://schemas.xmlsoap.org/wsdl/ -> wsdl
[java2wsdl] ----end
[java2wsdl] ----
[java2wsdl] http://schemas.xmlsoap.org/wsdl/ -> wsdl
[java2wsdl] http://schemas.xmlsoap.org/soap/encoding/ -> SOAP-ENC
[java2wsdl] ----end
[java2wsdl] ----
[java2wsdl] http://schemas.xmlsoap.org/wsdl/ -> wsdl
[java2wsdl] http://schemas.xmlsoap.org/soap/encoding/ -> SOAP-ENC
[java2wsdl] urn:Example6-impl -> impl
[java2wsdl] ----end
[java2wsdl] ----
[java2wsdl] http://schemas.xmlsoap.org/wsdl/ -> wsdl
[java2wsdl] http://schemas.xmlsoap.org/soap/encoding/ -> SOAP-ENC
[java2wsdl] urn:Example6-impl -> impl
[java2wsdl] urn:Example6 -> intf
[java2wsdl] ----end
[java2wsdl] ----
[java2wsdl] http://schemas.xmlsoap.org/wsdl/ -> wsdl
[java2wsdl] http://schemas.xmlsoap.org/soap/encoding/ -> SOAP-ENC
[java2wsdl] urn:Example6-impl -> impl
[java2wsdl] urn:Example6 -> intf
[java2wsdl] http://schemas.xmlsoap.org/wsdl/ -> wsdl
[java2wsdl] ----end
[java2wsdl] ----
[java2wsdl] http://schemas.xmlsoap.org/wsdl/ -> wsdl
[java2wsdl] http://schemas.xmlsoap.org/soap/encoding/ -> SOAP-ENC
[java2wsdl] urn:Example6-impl -> impl
[java2wsdl] urn:Example6 -> intf
[java2wsdl] http://schemas.xmlsoap.org/wsdl/ -> wsdl
[java2wsdl] http://schemas.xmlsoap.org/wsdl/soap/ -> wsdlsoap
[java2wsdl] ----end
[wsdl2java] WSDL2Java build/work/samples/userguide/example6/WidgetPrice.wsdl
[wsdl2java] WSDL2Java test/wsdl/multibinding/multibinding.wsdl
[wsdl2java] WSDL2Java test/wsdl/multiref/MultiRefTest.wsdl
[wsdl2java] WSDL2Java test/wsdl/multithread/AddressBook.wsdl
[wsdl2java] WSDL2Java test/wsdl/opStyles/opStyles.wsdl
[wsdl2java] solicitResponse is a solicit-response style operation and is unsupported.
[wsdl2java] notification is a notification style operation and is unsupported.
[wsdl2java] WSDL2Java test/wsdl/refattr/refattr.wsdl
[wsdl2java] WSDL2Java test/wsdl/roundtrip/Roundtrip.wsdl
     [copy] Copying 6 files to /home/rubys/jakarta/xml-axis/java/build/work/test/wsdl/roundtrip
    [javac] Compiling 10 source files to /home/rubys/jakarta/xml-axis/java/build/classes
dropping /home/rubys/jakarta/xml-security/xmlsec.jar from path as it doesn't exist
[java2wsdl] Java2WSDL test.wsdl.roundtrip.RoundtripPortType
[java2wsdl] ----end
[java2wsdl] ----
[java2wsdl] http://schemas.xmlsoap.org/wsdl/ -> wsdl
[java2wsdl] ----end
[java2wsdl] ----
[java2wsdl] http://schemas.xmlsoap.org/wsdl/ -> wsdl
[java2wsdl] http://schemas.xmlsoap.org/soap/encoding/ -> SOAP-ENC
[java2wsdl] ----end
[java2wsdl] ----
[java2wsdl] http://schemas.xmlsoap.org/wsdl/ -> wsdl
[java2wsdl] http://schemas.xmlsoap.org/soap/encoding/ -> SOAP-ENC
[java2wsdl] http://roundtrip.wsdl.test-impl -> impl
[java2wsdl] ----end
[java2wsdl] ----
[java2wsdl] http://schemas.xmlsoap.org/wsdl/ -> wsdl
[java2wsdl] http://schemas.xmlsoap.org/soap/encoding/ -> SOAP-ENC
[java2wsdl] http://roundtrip.wsdl.test-impl -> impl
[java2wsdl] http://roundtrip.wsdl.test -> intf
[java2wsdl] ----end
[java2wsdl] ----
[java2wsdl] http://schemas.xmlsoap.org/wsdl/ -> wsdl
[java2wsdl] http://schemas.xmlsoap.org/soap/encoding/ -> SOAP-ENC
[java2wsdl] http://roundtrip.wsdl.test-impl -> impl
[java2wsdl] http://roundtrip.wsdl.test -> intf
[java2wsdl] http://schemas.xmlsoap.org/wsdl/ -> wsdl
[java2wsdl] ----end
[java2wsdl] ----
[java2wsdl] http://schemas.xmlsoap.org/wsdl/ -> wsdl
[java2wsdl] http://schemas.xmlsoap.org/soap/encoding/ -> SOAP-ENC
[java2wsdl] http://roundtrip.wsdl.test-impl -> impl
[java2wsdl] http://roundtrip.wsdl.test -> intf
[java2wsdl] http://schemas.xmlsoap.org/wsdl/ -> wsdl
[java2wsdl] http://schemas.xmlsoap.org/wsdl/soap/ -> wsdlsoap
[java2wsdl] ----end
   [delete] Deleting directory /home/rubys/jakarta/xml-axis/java/build/classes/test/wsdl/roundtrip
[wsdl2java] WSDL2Java build/work/test/wsdl/roundtrip/Roundtrip.wsdl
[wsdl2java] WSDL2Java test/wsdl/sequence/SequenceTest.wsdl
     [copy] Copying 1 file to /home/rubys/jakarta/xml-axis/java/build/work/test/wsdl/sequence
    [javac] Compiling 6 source files to /home/rubys/jakarta/xml-axis/java/build/classes
dropping /home/rubys/jakarta/xml-security/xmlsec.jar from path as it doesn't exist
[java2wsdl] Java2WSDL test.wsdl.sequence.SequenceTestPortType
[java2wsdl] ----end
[java2wsdl] ----
[java2wsdl] http://schemas.xmlsoap.org/wsdl/ -> wsdl
[java2wsdl] ----end
[java2wsdl] ----
[java2wsdl] http://schemas.xmlsoap.org/wsdl/ -> wsdl
[java2wsdl] http://schemas.xmlsoap.org/soap/encoding/ -> SOAP-ENC
[java2wsdl] ----end
[java2wsdl] ----
[java2wsdl] http://schemas.xmlsoap.org/wsdl/ -> wsdl
[java2wsdl] http://schemas.xmlsoap.org/soap/encoding/ -> SOAP-ENC
[java2wsdl] urn:SequenceTest2-impl -> impl
[java2wsdl] ----end
[java2wsdl] ----
[java2wsdl] http://schemas.xmlsoap.org/wsdl/ -> wsdl
[java2wsdl] http://schemas.xmlsoap.org/soap/encoding/ -> SOAP-ENC
[java2wsdl] urn:SequenceTest2-impl -> impl
[java2wsdl] urn:SequenceTest2 -> intf
[java2wsdl] ----end
[java2wsdl] ----
[java2wsdl] http://schemas.xmlsoap.org/wsdl/ -> wsdl
[java2wsdl] http://schemas.xmlsoap.org/soap/encoding/ -> SOAP-ENC
[java2wsdl] urn:SequenceTest2-impl -> impl
[java2wsdl] urn:SequenceTest2 -> intf
[java2wsdl] http://schemas.xmlsoap.org/wsdl/ -> wsdl
[java2wsdl] ----end
[java2wsdl] ----
[java2wsdl] http://schemas.xmlsoap.org/wsdl/ -> wsdl
[java2wsdl] http://schemas.xmlsoap.org/soap/encoding/ -> SOAP-ENC
[java2wsdl] urn:SequenceTest2-impl -> impl
[java2wsdl] urn:SequenceTest2 -> intf
[java2wsdl] http://schemas.xmlsoap.org/wsdl/ -> wsdl
[java2wsdl] http://schemas.xmlsoap.org/wsdl/soap/ -> wsdlsoap
[java2wsdl] ----end
   [delete] Deleting directory /home/rubys/jakarta/xml-axis/java/build/classes/test/wsdl/sequence
[wsdl2java] WSDL2Java build/work/test/wsdl/sequence/SequenceTest.wsdl
[wsdl2java] WSDL2Java test/wsdl/arrays/ArrayTest.wsdl
[wsdl2java] WSDL2Java test/wsdl/inheritance/InheritanceTest.wsdl
     [copy] Copying 2 files to /home/rubys/jakarta/xml-axis/java/build/work/test/wsdl/inheritance
    [javac] Compiling 6 source files to /home/rubys/jakarta/xml-axis/java/build/classes
dropping /home/rubys/jakarta/xml-security/xmlsec.jar from path as it doesn't exist
[java2wsdl] Java2WSDL test.wsdl.inheritance.InheritancePortType
[java2wsdl] ----end
[java2wsdl] ----
[java2wsdl] http://schemas.xmlsoap.org/wsdl/ -> wsdl
[java2wsdl] ----end
[java2wsdl] ----
[java2wsdl] http://schemas.xmlsoap.org/wsdl/ -> wsdl
[java2wsdl] http://schemas.xmlsoap.org/soap/encoding/ -> SOAP-ENC
[java2wsdl] ----end
[java2wsdl] ----
[java2wsdl] http://schemas.xmlsoap.org/wsdl/ -> wsdl
[java2wsdl] http://schemas.xmlsoap.org/soap/encoding/ -> SOAP-ENC
[java2wsdl] urn:InheritanceTest2-impl -> impl
[java2wsdl] ----end
[java2wsdl] ----
[java2wsdl] http://schemas.xmlsoap.org/wsdl/ -> wsdl
[java2wsdl] http://schemas.xmlsoap.org/soap/encoding/ -> SOAP-ENC
[java2wsdl] urn:InheritanceTest2-impl -> impl
[java2wsdl] urn:InheritanceTest2 -> intf
[java2wsdl] ----end
[java2wsdl] ----
[java2wsdl] http://schemas.xmlsoap.org/wsdl/ -> wsdl
[java2wsdl] http://schemas.xmlsoap.org/soap/encoding/ -> SOAP-ENC
[java2wsdl] urn:InheritanceTest2-impl -> impl
[java2wsdl] urn:InheritanceTest2 -> intf
[java2wsdl] http://schemas.xmlsoap.org/wsdl/ -> wsdl
[java2wsdl] ----end
[java2wsdl] ----
[java2wsdl] http://schemas.xmlsoap.org/wsdl/ -> wsdl
[java2wsdl] http://schemas.xmlsoap.org/soap/encoding/ -> SOAP-ENC
[java2wsdl] urn:InheritanceTest2-impl -> impl
[java2wsdl] urn:InheritanceTest2 -> intf
[java2wsdl] http://schemas.xmlsoap.org/wsdl/ -> wsdl
[java2wsdl] http://schemas.xmlsoap.org/wsdl/soap/ -> wsdlsoap
[java2wsdl] ----end
   [delete] Deleting directory /home/rubys/jakarta/xml-axis/java/build/classes/test/wsdl/inheritance
[wsdl2java] WSDL2Java build/work/test/wsdl/inheritance/InheritanceTest.wsdl
    [javac] Compiling 6 source files to /home/rubys/jakarta/xml-axis/java/build/classes
dropping /home/rubys/jakarta/xml-security/xmlsec.jar from path as it doesn't exist
[java2wsdl] Java2WSDL test.wsdl.inheritance.Baby
[java2wsdl] ----end
[java2wsdl] ----
[java2wsdl] http://schemas.xmlsoap.org/wsdl/ -> wsdl
[java2wsdl] ----end
[java2wsdl] ----
[java2wsdl] http://schemas.xmlsoap.org/wsdl/ -> wsdl
[java2wsdl] http://schemas.xmlsoap.org/soap/encoding/ -> SOAP-ENC
[java2wsdl] ----end
[java2wsdl] ----
[java2wsdl] http://schemas.xmlsoap.org/wsdl/ -> wsdl
[java2wsdl] http://schemas.xmlsoap.org/soap/encoding/ -> SOAP-ENC
[java2wsdl] urn:InheritanceTest3-impl -> impl
[java2wsdl] ----end
[java2wsdl] ----
[java2wsdl] http://schemas.xmlsoap.org/wsdl/ -> wsdl
[java2wsdl] http://schemas.xmlsoap.org/soap/encoding/ -> SOAP-ENC
[java2wsdl] urn:InheritanceTest3-impl -> impl
[java2wsdl] urn:InheritanceTest3 -> intf
[java2wsdl] ----end
[java2wsdl] ----
[java2wsdl] http://schemas.xmlsoap.org/wsdl/ -> wsdl
[java2wsdl] http://schemas.xmlsoap.org/soap/encoding/ -> SOAP-ENC
[java2wsdl] urn:InheritanceTest3-impl -> impl
[java2wsdl] urn:InheritanceTest3 -> intf
[java2wsdl] http://schemas.xmlsoap.org/wsdl/ -> wsdl
[java2wsdl] ----end
[java2wsdl] ----
[java2wsdl] http://schemas.xmlsoap.org/wsdl/ -> wsdl
[java2wsdl] http://schemas.xmlsoap.org/soap/encoding/ -> SOAP-ENC
[java2wsdl] urn:InheritanceTest3-impl -> impl
[java2wsdl] urn:InheritanceTest3 -> intf
[java2wsdl] http://schemas.xmlsoap.org/wsdl/ -> wsdl
[java2wsdl] http://schemas.xmlsoap.org/wsdl/soap/ -> wsdlsoap
[java2wsdl] ----end
[wsdl2java] WSDL2Java test/wsdl/marrays/MArrayTest.wsdl
[wsdl2java] WSDL2Java test/wsdl/marrays/MArrayTest.wsdl
[wsdl2java] WSDL2Java test/wsdl/_import/Import.wsdl
[wsdl2java] WSDL2Java test/wsdl/_import/Import.wsdl
[wsdl2java] WSDL2Java test/wsdl/inout/inout.wsdl
[wsdl2java] WSDL2Java http://www.xmethods.net/tmodels/InteropTest.wsdl
[wsdl2java] WSDL2Java http://www.whitemesa.com/interop/InteropTest.wsdl
[wsdl2java] WSDL2Java http://www.whitemesa.com/interop/InteropTestB.wsdl
[wsdl2java] WSDL2Java http://www.whitemesa.net/wsdl/std/echoheadersvc.wsdl
[wsdl2java] java.net.ConnectException: Connection timed out
[wsdl2java] 	at java.net.PlainSocketImpl.socketConnect(Native Method)
[wsdl2java] 	at java.net.PlainSocketImpl.doConnect(PlainSocketImpl.java:355)
[wsdl2java] 	at java.net.PlainSocketImpl.connectToAddress(PlainSocketImpl.java:142)
[wsdl2java] 	at java.net.PlainSocketImpl.connect(PlainSocketImpl.java:129)
[wsdl2java] 	at java.net.Socket.<init>(Socket.java:273)
[wsdl2java] 	at java.net.Socket.<init>(Socket.java:100)
[wsdl2java] 	at sun.net.NetworkClient.doConnect(NetworkClient.java:50)
[wsdl2java] 	at sun.net.www.http.HttpClient.openServer(HttpClient.java:335)
[wsdl2java] 	at sun.net.www.http.HttpClient.openServer(HttpClient.java:521)
[wsdl2java] 	at sun.net.www.http.HttpClient.<init>(HttpClient.java:271)
[wsdl2java] 	at sun.net.www.http.HttpClient.<init>(HttpClient.java:281)
[wsdl2java] 	at sun.net.www.http.HttpClient.New(HttpClient.java:293)
[wsdl2java] 	at sun.net.www.protocol.http.HttpURLConnection.connect(HttpURLConnection.java:404)
[wsdl2java] 	at sun.net.www.protocol.http.HttpURLConnection.getInputStream(HttpURLConnection.java:497)
[wsdl2java] 	at java.net.URL.openStream(URL.java:798)
[wsdl2java] 	at org.apache.xerces.impl.XMLEntityManager.startEntity(Unknown Source)
[wsdl2java] 	at org.apache.xerces.impl.XMLEntityManager.startDocumentEntity(Unknown Source)
[wsdl2java] 	at org.apache.xerces.impl.XMLDocumentScannerImpl.setInputSource(Unknown Source)
[wsdl2java] 	at org.apache.xerces.parsers.StandardParserConfiguration.parse(Unknown Source)
[wsdl2java] 	at org.apache.xerces.parsers.StandardParserConfiguration.parse(Unknown Source)
[wsdl2java] 	at org.apache.xerces.parsers.XMLParser.parse(Unknown Source)
[wsdl2java] 	at org.apache.xerces.parsers.DOMParser.parse(Unknown Source)
[wsdl2java] 	at org.apache.xerces.jaxp.DocumentBuilderImpl.parse(Unknown Source)
[wsdl2java] 	at org.apache.axis.utils.XMLUtils.newDocument(Unknown Source)
[wsdl2java] 	at org.apache.axis.utils.XMLUtils.newDocument(Unknown Source)
[wsdl2java] 	at test.wsdl.Wsdl2javaAntTask.execute(Unknown Source)
[wsdl2java] 	at org.apache.tools.ant.Task.perform(Task.java:223)
[wsdl2java] 	at org.apache.tools.ant.Target.execute(Target.java:186)
[wsdl2java] 	at org.apache.tools.ant.Target.performTasks(Target.java:204)
[wsdl2java] 	at org.apache.tools.ant.Project.executeTarget(Project.java:921)
[wsdl2java] 	at org.apache.tools.ant.taskdefs.Ant.execute(Ant.java:302)
[wsdl2java] 	at org.apache.tools.ant.Task.perform(Task.java:223)
[wsdl2java] 	at org.apache.tools.ant.Target.execute(Target.java:186)
[wsdl2java] 	at org.apache.tools.ant.Target.performTasks(Target.java:204)
[wsdl2java] 	at org.apache.tools.ant.Project.executeTarget(Project.java:921)
[wsdl2java] 	at org.apache.tools.ant.taskdefs.Ant.execute(Ant.java:302)
[wsdl2java] 	at org.apache.tools.ant.Task.perform(Task.java:223)
[wsdl2java] 	at org.apache.tools.ant.Target.execute(Target.java:186)
[wsdl2java] 	at org.apache.tools.ant.Target.performTasks(Target.java:204)
[wsdl2java] 	at org.apache.tools.ant.Project.executeTarget(Project.java:921)
[wsdl2java] 	at org.apache.tools.ant.Project.executeTargets(Project.java:875)
[wsdl2java] 	at org.apache.tools.ant.Main.runBuild(Main.java:527)
[wsdl2java] 	at org.apache.tools.ant.Main.start(Main.java:163)
[wsdl2java] 	at org.apache.tools.ant.Main.main(Main.java:187)
[wsdl2java] java.lang.NullPointerException
[wsdl2java] WSDL2Java http://mssoapinterop.org/stk/InteropB.wsdl
[wsdl2java] WSDL2Java http://mssoapinterop.org/stk/InteropBtyped.wsdl
[wsdl2java] WSDL2Java http://mssoapinterop.org/stk/InteropC.wsdl
[wsdl2java] WSDL2Java test/wsdl/clash/clash.wsdl
[wsdl2java] WSDL2Java test/wsdl/faults/FaultService.wsdl
[wsdl2java] WSDL2Java http://www.uddi.org/wsdl/inquire_v1.wsdl
[wsdl2java] WSDL2Java http://www.uddi.org/wsdl/publish_v1.wsdl
[wsdl2java] WSDL2Java http://services.xmethods.net/soap/urn:xmethods-delayed-quotes.wsdl
[wsdl2java] WSDL2Java test/wsdl/filegen/FileGen.wsdl
[wsdl2java] WSDL2Java test/wsdl/filegen/FileGen.wsdl
[wsdl2java] WSDL2Java test/wsdl/names/JavaNames.wsdl
[wsdl2java] WSDL2Java test/wsdl/types/ComprehensiveTypes.wsdl
[wsdl2java] WSDL2Java test/wsdl/parameterOrder/parameterOrder.wsdl
[wsdl2java] WSDL2Java http://www.perfectxml.net/WebServices/SalesRankNPrice/BookService.asmx?WSDL
[wsdl2java] java.net.ConnectException: Connection refused
[wsdl2java] 	at java.net.PlainSocketImpl.socketConnect(Native Method)
[wsdl2java] 	at java.net.PlainSocketImpl.doConnect(PlainSocketImpl.java:355)
[wsdl2java] 	at java.net.PlainSocketImpl.connectToAddress(PlainSocketImpl.java:142)
[wsdl2java] 	at java.net.PlainSocketImpl.connect(PlainSocketImpl.java:129)
[wsdl2java] 	at java.net.Socket.<init>(Socket.java:273)
[wsdl2java] 	at java.net.Socket.<init>(Socket.java:100)
[wsdl2java] 	at sun.net.NetworkClient.doConnect(NetworkClient.java:50)
[wsdl2java] 	at sun.net.www.http.HttpClient.openServer(HttpClient.java:335)
[wsdl2java] 	at sun.net.www.http.HttpClient.openServer(HttpClient.java:521)
[wsdl2java] 	at sun.net.www.http.HttpClient.<init>(HttpClient.java:271)
[wsdl2java] 	at sun.net.www.http.HttpClient.<init>(HttpClient.java:281)
[wsdl2java] 	at sun.net.www.http.HttpClient.New(HttpClient.java:293)
[wsdl2java] 	at sun.net.www.protocol.http.HttpURLConnection.connect(HttpURLConnection.java:404)
[wsdl2java] 	at sun.net.www.protocol.http.HttpURLConnection.getInputStream(HttpURLConnection.java:497)
[wsdl2java] 	at java.net.URL.openStream(URL.java:798)
[wsdl2java] 	at org.apache.xerces.impl.XMLEntityManager.startEntity(Unknown Source)
[wsdl2java] 	at org.apache.xerces.impl.XMLEntityManager.startDocumentEntity(Unknown Source)
[wsdl2java] 	at org.apache.xerces.impl.XMLDocumentScannerImpl.setInputSource(Unknown Source)
[wsdl2java] 	at org.apache.xerces.parsers.StandardParserConfiguration.parse(Unknown Source)
[wsdl2java] 	at org.apache.xerces.parsers.StandardParserConfiguration.parse(Unknown Source)
[wsdl2java] 	at org.apache.xerces.parsers.XMLParser.parse(Unknown Source)
[wsdl2java] 	at org.apache.xerces.parsers.DOMParser.parse(Unknown Source)
[wsdl2java] 	at org.apache.xerces.jaxp.DocumentBuilderImpl.parse(Unknown Source)
[wsdl2java] 	at org.apache.axis.utils.XMLUtils.newDocument(Unknown Source)
[wsdl2java] 	at org.apache.axis.utils.XMLUtils.newDocument(Unknown Source)
[wsdl2java] 	at test.wsdl.Wsdl2javaAntTask.execute(Unknown Source)
[wsdl2java] 	at org.apache.tools.ant.Task.perform(Task.java:223)
[wsdl2java] 	at org.apache.tools.ant.Target.execute(Target.java:186)
[wsdl2java] 	at org.apache.tools.ant.Target.performTasks(Target.java:204)
[wsdl2java] 	at org.apache.tools.ant.Project.executeTarget(Project.java:921)
[wsdl2java] 	at org.apache.tools.ant.taskdefs.Ant.execute(Ant.java:302)
[wsdl2java] 	at org.apache.tools.ant.Task.perform(Task.java:223)
[wsdl2java] 	at org.apache.tools.ant.Target.execute(Target.java:186)
[wsdl2java] 	at org.apache.tools.ant.Target.performTasks(Target.java:204)
[wsdl2java] 	at org.apache.tools.ant.Project.executeTarget(Project.java:921)
[wsdl2java] 	at org.apache.tools.ant.taskdefs.Ant.execute(Ant.java:302)
[wsdl2java] 	at org.apache.tools.ant.Task.perform(Task.java:223)
[wsdl2java] 	at org.apache.tools.ant.Target.execute(Target.java:186)
[wsdl2java] 	at org.apache.tools.ant.Target.performTasks(Target.java:204)
[wsdl2java] 	at org.apache.tools.ant.Project.executeTarget(Project.java:921)
[wsdl2java] 	at org.apache.tools.ant.Project.executeTargets(Project.java:875)
[wsdl2java] 	at org.apache.tools.ant.Main.runBuild(Main.java:527)
[wsdl2java] 	at org.apache.tools.ant.Main.start(Main.java:163)
[wsdl2java] 	at org.apache.tools.ant.Main.main(Main.java:187)
[wsdl2java] java.lang.NullPointerException
     [copy] Copying 27 files to /home/rubys/jakarta/xml-axis/java/build/work/test
     [copy] Copying 28 files to /home/rubys/jakarta/xml-axis/java/build/work/test/wsdl
     [copy] Copying 6 files to /home/rubys/jakarta/xml-axis/java/build/work/samples
    [javac] Compiling 351 source files to /home/rubys/jakarta/xml-axis/java/build/classes
dropping /home/rubys/jakarta/xml-security/xmlsec.jar from path as it doesn't exist
    [javac] /home/rubys/jakarta/xml-axis/java/build/work/test/wsdl/literal/SalesRankNPrice_ServiceTestCase.java:26:
cannot resolve symbol
    [javac] symbol  : class SalesRankNPrice_Type  
    [javac] location: class test.wsdl.literal.SalesRankNPrice_ServiceTestCase
    [javac]     private void printit(SalesRankNPrice_Type r) {
    [javac]                          ^
    [javac] /home/rubys/jakarta/xml-axis/java/build/work/test/wsdl/literal/SalesRankNPrice_ServiceTestCase.java:26:
printit(java.lang.String) is already defined in test.wsdl.literal.SalesRankNPrice_ServiceTestCase
    [javac]     private void printit(SalesRankNPrice_Type r) {
    [javac]                  ^
    [javac] /home/rubys/jakarta/xml-axis/java/build/work/test/wsdl/literal/SalesRankNPrice_ServiceTestCase.java:31:
cannot resolve symbol
    [javac] symbol  : class Prices  
    [javac] location: class test.wsdl.literal.SalesRankNPrice_ServiceTestCase
    [javac]     private void printit(Prices p) {
    [javac]                          ^
    [javac] /home/rubys/jakarta/xml-axis/java/build/work/test/wsdl/literal/SalesRankNPrice_ServiceTestCase.java:31:
printit(java.lang.String) is already defined in test.wsdl.literal.SalesRankNPrice_ServiceTestCase
    [javac]     private void printit(Prices p) {
    [javac]                  ^
    [javac] /home/rubys/jakarta/xml-axis/java/build/work/test/wsdl/literal/SalesRankNPrice_ServiceTestCase.java:37:
cannot resolve symbol
    [javac] symbol  : class SalesRanks  
    [javac] location: class test.wsdl.literal.SalesRankNPrice_ServiceTestCase
    [javac]     private void printit(SalesRanks s) {
    [javac]                          ^
    [javac] /home/rubys/jakarta/xml-axis/java/build/work/test/wsdl/literal/SalesRankNPrice_ServiceTestCase.java:37:
printit(java.lang.String) is already defined in test.wsdl.literal.SalesRankNPrice_ServiceTestCase
    [javac]     private void printit(SalesRanks s) {
    [javac]                  ^
    [javac] /home/rubys/jakarta/xml-axis/java/build/work/test/wsdl/literal/SalesRankNPrice_ServiceTestCase.java:43:
cannot resolve symbol
    [javac] symbol  : class All  
    [javac] location: class test.wsdl.literal.SalesRankNPrice_ServiceTestCase
    [javac]     private void printit(All all) {
    [javac]                          ^
    [javac] /home/rubys/jakarta/xml-axis/java/build/work/test/wsdl/literal/SalesRankNPrice_ServiceTestCase.java:43:
printit(java.lang.String) is already defined in test.wsdl.literal.SalesRankNPrice_ServiceTestCase
    [javac]     private void printit(All all) {
    [javac]                  ^
    [javac] /home/rubys/jakarta/xml-axis/java/build/work/test/wsdl/literal/SalesRankNPrice_ServiceTestCase.java:115:
cannot resolve symbol
    [javac] symbol  : class SalesRankNPriceSoap  
    [javac] location: class test.wsdl.literal.SalesRankNPrice_ServiceTestCase
    [javac]         SalesRankNPriceSoap binding;
    [javac]         ^
    [javac] /home/rubys/jakarta/xml-axis/java/build/work/test/wsdl/literal/SalesRankNPrice_ServiceTestCase.java:117:
cannot resolve symbol
    [javac] symbol  : class SalesRankNPrice_ServiceLocator  
    [javac] location: class test.wsdl.literal.SalesRankNPrice_ServiceTestCase
    [javac]             binding = new SalesRankNPrice_ServiceLocator().getSalesRankNPriceSoap();
    [javac]                           ^
    [javac] 10 errors

BUILD FAILED
/home/rubys/jakarta/xml-axis/java/test/build_functional_tests.xml:225: Compile failed, messages
should have been provided.

Total time: 7 minutes 46 seconds

Mime
View raw message