axis-java-dev mailing list archives

Site index · List index
Message view « Date » · « Thread »
Top « Date » · « Thread »
From Sam Ruby <ru...@us.ibm.com>
Subject [GUMP] Function Test Failure - Axis
Date Wed, 12 Sep 2001 11:04:43 GMT
----------------------------------------------------
This email is autogenerated from the output from:
<http://jakarta.apache.org/builds/gump/2001-09-12/test-axis.html>
----------------------------------------------------

Buildfile: build.xml

setenv:
     [echo] --- Build environment for Axis ---
     [echo] --- Flags (Note: If the {property name} is displayed, 
     [echo]            then the component is not present)
     [echo] 
     [echo] === Required Libraries ===
     [echo] wsdl4j.present=true
     [echo] log4j.present=true
     [echo] 
     [echo] --- Optional Libraries ---
     [echo] servlet.present=true
     [echo] junit.present=true
     [echo] 
     [echo] --- Property values ---
     [echo] debug=true
     [echo] deprecation=true

compile:

post-compile:

buildTest:
     [echo] junit package found ...

samples:

functional-tests:

functional-tests:

start-functional-test-tcp-server:
     [echo] Starting test tcp server.
     [java] TCPListener is listening on port 8088.
     [java] TCPListener received new connection: Socket[addr=rubix/127.0.0.1,port=35299,localport=8088]
[runaxisfunctionaltests] RunAxisFunctionalTestsTask.callStart successfully pinged server.

start-functional-test-http-server:
     [echo] Starting test http server.
     [java] TCPListener received new connection: Socket[addr=rubix/127.0.0.1,port=35300,localport=8088]
[runaxisfunctionaltests] RunAxisFunctionalTestsTask.callStart successfully pinged server.

junit-functional:
    [mkdir] Created dir: /home/rubys/jakarta/xml-axis/java/build/jws
     [copy] Copying 1 file to /home/rubys/jakarta/xml-axis/java/build/jws
     [copy] Copying 1 file to /home/rubys/jakarta/xml-axis/java/build/jws
    [junit] Running test.functional.FunctionalTests
    [junit] Testing echo interop sample.
    [junit] Processing file: samples/echo/deploy.xml
    [junit] <Admin>Done processing</Admin>
    [junit] 
    [junit] Test complete.
    [junit] Testing stock sample.
    [junit] Testing JWS...
    [junit] Processing file: samples/stock/deploy.xml
    [junit] Testing deployment...
    [junit] <Admin>Done processing</Admin>
    [junit] 
    [junit] Testing service...
    [junit] AxisFault
    [junit]   faultCode: null
    [junit]   faultString: User 'null' not authenticated (unknown user)
    [junit]   faultActor: null
    [junit]   faultDetails: null
    [junit] AxisFault
    [junit]   faultCode: null
    [junit]   faultString: User 'null' not authenticated (unknown user)
    [junit]   faultActor: null
    [junit]   faultDetails: null
    [junit] 
    [junit] 
    [junit] 	at org.apache.axis.message.SOAPFaultElement.getAxisFault(SOAPFaultElement.java:132)
    [junit] 	at org.apache.axis.message.SOAPFaultBuilder.<init>(SOAPFaultBuilder.java:90)
    [junit] 	at org.apache.axis.message.BodyBuilder.onStartChild(BodyBuilder.java:77)
    [junit] 	at org.apache.axis.encoding.DeserializationContext.startElement(DeserializationContext.java:528)
    [junit] Testing TCP transport.
    [junit] 	at org.apache.xerces.parsers.SAXParser.startElement(Unknown Source)
    [junit] 	at org.apache.xerces.validators.common.XMLValidator.callStartElement(Unknown
Source)
    [junit] 	at org.apache.xerces.framework.XMLDocumentScanner$ContentDispatcher.dispatch(Unknown
Source)
    [junit] 	at org.apache.xerces.framework.XMLDocumentScanner.parseSome(Unknown Source)
    [junit] 	at org.apache.xerces.framework.XMLParser.parse(Unknown Source)
    [junit] 	at javax.xml.parsers.SAXParser.parse(Unknown Source)
    [junit] 	at org.apache.axis.encoding.DeserializationContext.parse(DeserializationContext.java:160)
    [junit] Deploying TCP client transport...Processing 'samples/transport/tcp/deploy.xml'
    [junit] 	at org.apache.axis.Message.getAsSOAPEnvelope(Message.java:318)
    [junit] 	at org.apache.axis.client.ServiceClient.invoke(ServiceClient.java:576)
    [junit] 	at org.apache.axis.client.ServiceClient.invoke(ServiceClient.java:481)
    [junit] 	at samples.stock.GetQuote.getQuote(GetQuote.java:120)
    [junit] 	at test.functional.TestStockSample.doTestStock(TestStockSample.java:106)
    [junit] OK!
    [junit] 	at test.functional.TestStockSample.testStockService(TestStockSample.java:134)
    [junit] 	at java.lang.reflect.Method.invoke(Native Method)
    [junit] 	at junit.framework.TestCase.runTest(TestCase.java:166)
    [junit] 	at junit.framework.TestCase.runBare(TestCase.java:140)
    [junit] 	at junit.framework.TestResult$1.protect(TestResult.java:106)
    [junit] 	at junit.framework.TestResult.runProtected(TestResult.java:124)
    [junit] 	at junit.framework.TestResult.run(TestResult.java:109)
     [java] TCPListener received new connection: Socket[addr=rubix/127.0.0.1,port=35305,localport=8088]
    [junit] 	at junit.framework.TestCase.run(TestCase.java:131)
    [junit] 	at junit.framework.TestSuite.runTest(TestSuite.java:173)
    [junit] 	at junit.framework.TestSuite.run(TestSuite.java:168)
    [junit] 	at junit.framework.TestSuite.runTest(TestSuite.java:173)
    [junit] 	at junit.framework.TestSuite.run(TestSuite.java:168)
    [junit] 	at org.apache.tools.ant.taskdefs.optional.junit.JUnitTestRunner.run(JUnitTestRunner.java:231)
    [junit] 	at org.apache.tools.ant.taskdefs.optional.junit.JUnitTestRunner.main(JUnitTestRunner.java:409)
    [junit] Processing file: samples/stock/deploy.xml
    [junit] Testing deployment...<Admin>Done processing</Admin>
    [junit] 
    [junit] OK!
    [junit] Testing service...Testing TCP stock service...
     [java] TCPListener received new connection: Socket[addr=rubix/127.0.0.1,port=35306,localport=8088]
    [junit] AxisFault
    [junit]   faultCode: null
    [junit]   faultString: User 'null' not authenticated (unknown user)
    [junit]   faultActor: null
    [junit]   faultDetails: null
    [junit] AxisFault
    [junit]   faultCode: null
    [junit]   faultString: User 'null' not authenticated (unknown user)
    [junit]   faultActor: null
    [junit]   faultDetails: null
    [junit] 
    [junit] 
    [junit] 	at org.apache.axis.message.SOAPFaultElement.getAxisFault(SOAPFaultElement.java:132)
    [junit] 	at org.apache.axis.message.SOAPFaultBuilder.<init>(SOAPFaultBuilder.java:90)
    [junit] 	at org.apache.axis.message.BodyBuilder.onStartChild(BodyBuilder.java:77)
    [junit] 	at org.apache.axis.encoding.DeserializationContext.startElement(DeserializationContext.java:528)
    [junit] Testing transport sample.
    [junit] Testing client deployment...
    [junit] 	at org.apache.xerces.parsers.SAXParser.startElement(Unknown Source)
    [junit] 	at org.apache.xerces.validators.common.XMLValidator.callStartElement(Unknown
Source)
    [junit] 	at org.apache.xerces.framework.XMLDocumentScanner$ContentDispatcher.dispatch(Unknown
Source)
    [junit] Processing 'samples/transport/client_deploy.xml'
    [junit] 	at org.apache.xerces.framework.XMLDocumentScanner.parseSome(Unknown Source)
    [junit] 	at org.apache.xerces.framework.XMLParser.parse(Unknown Source)
    [junit] 	at javax.xml.parsers.SAXParser.parse(Unknown Source)
    [junit] 	at org.apache.axis.encoding.DeserializationContext.parse(DeserializationContext.java:160)
    [junit] 	at org.apache.axis.Message.getAsSOAPEnvelope(Message.java:318)
    [junit] 	at org.apache.axis.client.ServiceClient.invoke(ServiceClient.java:576)
    [junit] Testing deployment...
    [junit] 	at org.apache.axis.client.ServiceClient.invoke(ServiceClient.java:481)
    [junit] 	at test.functional.TestTCPTransportSample.doTestStock(TestTCPTransportSample.java:110)
    [junit] 	at test.functional.TestTCPTransportSample.testTCPTransportSample(TestTCPTransportSample.java:143)
    [junit] 	at java.lang.reflect.Method.invoke(Native Method)
    [junit] 	at junit.framework.TestCase.runTest(TestCase.java:166)
    [junit] 	at junit.framework.TestCase.runBare(TestCase.java:140)
    [junit] 	at junit.framework.TestResult$1.protect(TestResult.java:106)
    [junit] 	at junit.framework.TestResult.runProtected(TestResult.java:124)
    [junit] 	at junit.framework.TestResult.run(TestResult.java:109)
    [junit] 	at junit.framework.TestCase.run(TestCase.java:131)
    [junit] 	at junit.framework.TestSuite.runTest(TestSuite.java:173)
    [junit] 	at junit.framework.TestSuite.run(TestSuite.java:168)
    [junit] 	at junit.framework.TestSuite.runTest(TestSuite.java:173)
    [junit] 	at junit.framework.TestSuite.run(TestSuite.java:168)
    [junit] 	at org.apache.tools.ant.taskdefs.optional.junit.JUnitTestRunner.run(JUnitTestRunner.java:231)
    [junit] 	at org.apache.tools.ant.taskdefs.optional.junit.JUnitTestRunner.main(JUnitTestRunner.java:409)
    [junit] java.lang.Exception: Fault returned from TCP stock test: AxisFault
    [junit]   faultCode: null
    [junit]   faultString: User 'null' not authenticated (unknown user)
    [junit]   faultActor: null
    [junit]   faultDetails: null
    [junit] 
    [junit] 	at test.functional.TestTCPTransportSample.doTestStock(TestTCPTransportSample.java:126)
    [junit] 	at test.functional.TestTCPTransportSample.testTCPTransportSample(TestTCPTransportSample.java:143)
    [junit] 	at java.lang.reflect.Method.invoke(Native Method)
    [junit] 	at junit.framework.TestCase.runTest(TestCase.java:166)
    [junit] 	at junit.framework.TestCase.runBare(TestCase.java:140)
    [junit] 	at junit.framework.TestResult$1.protect(TestResult.java:106)
    [junit] 	at junit.framework.TestResult.runProtected(TestResult.java:124)
    [junit] 	at junit.framework.TestResult.run(TestResult.java:109)
    [junit] Processing 'samples/transport/deploy.xml'
    [junit] 	at junit.framework.TestCase.run(TestCase.java:131)
    [junit] 	at junit.framework.TestSuite.runTest(TestSuite.java:173)
    [junit] 	at junit.framework.TestSuite.run(TestSuite.java:168)
    [junit] 	at junit.framework.TestSuite.runTest(TestSuite.java:173)
    [junit] 	at junit.framework.TestSuite.run(TestSuite.java:168)
    [junit] 	at org.apache.tools.ant.taskdefs.optional.junit.JUnitTestRunner.run(JUnitTestRunner.java:231)
    [junit] 	at org.apache.tools.ant.taskdefs.optional.junit.JUnitTestRunner.main(JUnitTestRunner.java:409)
    [junit] Testing service with symbol IBM...
    [junit] ser 'null' not authenticated (unknown user)
    [junit] Testing service with symbol XXX...
    [junit] AxisFault
    [junit]   faultCode: null
    [junit]   faultString: User 'null' not authenticated (unknown user)
    [junit]   faultActor: null
    [junit]   faultDetails: null
    [junit] AxisFault
    [junit]   faultCode: null
    [junit]   faultString: User 'null' not authenticated (unknown user)
    [junit]   faultActor: null
    [junit]   faultDetails: null
    [junit] 
    [junit] Testing bidbuy sample.
    [junit] Testing deployment...
    [junit] 
    [junit] 	at org.apache.axis.message.SOAPFaultElement.getAxisFault(SOAPFaultElement.java:132)
    [junit] 	at org.apache.axis.message.SOAPFaultBuilder.<init>(SOAPFaultBuilder.java:90)
    [junit] 	at org.apache.axis.message.BodyBuilder.onStartChild(BodyBuilder.java:77)
    [junit] 	at org.apache.axis.encoding.DeserializationContext.startElement(DeserializationContext.java:528)
    [junit] 	at org.apache.xerces.parsers.SAXParser.startElement(Unknown Source)
    [junit] 	at org.apache.xerces.validators.common.XMLValidator.callStartElement(Unknown
Source)
    [junit] 	at org.apache.xerces.framework.XMLDocumentScanner$ContentDispatcher.dispatch(Unknown
Source)
    [junit] 	at org.apache.xerces.framework.XMLDocumentScanner.parseSome(Unknown Source)
    [junit] 	at org.apache.xerces.framework.XMLParser.parse(Unknown Source)
    [junit] 	at javax.xml.parsers.SAXParser.parse(Unknown Source)
    [junit] 	at org.apache.axis.encoding.DeserializationContext.parse(DeserializationContext.java:160)
    [junit] 	at org.apache.axis.Message.getAsSOAPEnvelope(Message.java:318)
    [junit] 	at org.apache.axis.client.ServiceClient.invoke(ServiceClient.java:576)
    [junit] 	at org.apache.axis.client.ServiceClient.invoke(ServiceClient.java:481)
    [junit] 	at samples.transport.FileTest.main(FileTest.java:47)
    [junit] 	at test.functional.TestTransportSample.doTestXXX(TestTransportSample.java:117)
    [junit] 	at test.functional.TestTransportSample.testService(TestTransportSample.java:130)
    [junit] 	at java.lang.reflect.Method.invoke(Native Method)
    [junit] 	at junit.framework.TestCase.runTest(TestCase.java:166)
    [junit] 	at junit.framework.TestCase.runBare(TestCase.java:140)
    [junit] 	at junit.framework.TestResult$1.protect(TestResult.java:106)
    [junit] 	at junit.framework.TestResult.runProtected(TestResult.java:124)
    [junit] 	at junit.framework.TestResult.run(TestResult.java:109)
    [junit] 	at junit.framework.TestCase.run(TestCase.java:131)
    [junit] 	at junit.framework.TestSuite.runTest(TestSuite.java:173)
    [junit] 	at junit.framework.TestSuite.run(TestSuite.java:168)
    [junit] 	at junit.framework.TestSuite.runTest(TestSuite.java:173)
    [junit] 	at junit.framework.TestSuite.run(TestSuite.java:168)
    [junit] <Admin>Done processing</Admin>
    [junit] 
    [junit] Testing service...
    [junit] 	at org.apache.tools.ant.taskdefs.optional.junit.JUnitTestRunner.run(JUnitTestRunner.java:231)
    [junit] 	at org.apache.tools.ant.taskdefs.optional.junit.JUnitTestRunner.main(JUnitTestRunner.java:409)
    [junit] Processing file: samples/bidbuy/deploy.xml
    [junit] 9000
    [junit]   1 Tricorder
    [junit] Processing file: samples/addr/deploy.xml
    [junit]   3 Phasor
    [junit] Test complete.
    [junit] Testing address book sample.
    [junit] Testing deployment...
    [junit] <Admin>Done processing</Admin>
    [junit] 
    [junit] Testing service...
    [junit] Using proxy without session maintenance.
    [junit] >> Storing address for 'Purdue Boilermaker'
    [junit] >> Querying address for 'Purdue Boilermaker'
    [junit] >> Response is:
    [junit] 	[ADDRESS NOT FOUND!]
    [junit] >> Querying address for 'Purdue Boilermaker' again
    [junit] >> Response is:
    [junit] 	[ADDRESS NOT FOUND!]
    [junit] 
    [junit] 
    [junit] Using proxy with session maintenance.
    [junit] >> Storing address for 'Purdue Boilermaker'
    [junit] >> Querying address for 'Purdue Boilermaker'
    [junit] >> Response is:
    [junit] 	1 University Drive
    [junit] 	West Lafayette, IN 47907
    [junit] 	Phone: (765) 494-4900
    [junit] >> Querying address for 'Purdue Boilermaker' again
    [junit] Test complete.
    [junit] Testing misc sample.
    [junit] Testing service...
    [junit] >> Response is:
    [junit] 	1 University Drive
    [junit] 	West Lafayette, IN 47907
    [junit] 	Phone: (765) 494-4900
    [junit] Request:
    [junit] <SOAP-ENV:Envelope xmlns:SOAP-ENV="http://schemas.xmlsoap.org/soap/envelope/"
xmlns:soapenc="http://schemas.xmlsoap.org/soap/encoding/" > <SOAP-ENV:Body>
    [junit] <echo:Echo xmlns:echo="EchoService">
    [junit] <symbol>IBM</symbol>
    [junit] </echo:Echo>
    [junit] Processing file: samples/proxy/deploy.xml
    [junit] </SOAP-ENV:Body></SOAP-ENV:Envelope>
    [junit] 
    [junit] Response:
    [junit] <?xml version="1.0" encoding="UTF-8"?>
    [junit] <SOAP-ENV:Envelope xmlns:SOAP-ENV="http://schemas.xmlsoap.org/soap/envelope/"
xmlns:soapenc="http://schemas.xmlsoap.org/soap/encoding/"> <SOAP-ENV:Body>
    [junit] <echo:Echo xmlns:echo="EchoService">
    [junit] <symbol>IBM</symbol>
    [junit] </echo:Echo>
    [junit] </SOAP-ENV:Body></SOAP-ENV:Envelope>
    [junit] Test complete.
    [junit] Testing proxy sample.
    [junit] Testing deployment...
    [junit] <Admin>Done processing</Admin>
    [junit] Processing file: samples/proxy/client_deploy.xml
    [junit] 
    [junit] Testing server-side client deployment...
    [junit] <Admin>Done processing</Admin>
    [junit] 
    [junit] Testing service...
    [junit] Request:
    [junit] <SOAP-ENV:Envelope xmlns:SOAP-ENV="http://schemas.xmlsoap.org/soap/envelope/"
xmlns:soapenc="http://schemas.xmlsoap.org/soap/encoding/" > <SOAP-ENV:Body>
    [junit] <echo:Echo xmlns:echo="EchoService">
    [junit] <symbol>IBM</symbol>
    [junit] </echo:Echo>
    [junit] </SOAP-ENV:Body></SOAP-ENV:Envelope>
    [junit] 
     [java] 1 [main] INFO org.apache.axis.handlers.LogMessage  - This message courtesy of
the LogMessage Handler!
     [java] TCPListener received new connection: Socket[addr=rubix/127.0.0.1,port=35320,localport=8088]
     [java] 1 [main] INFO org.apache.axis.handlers.LogMessage  - This message courtesy of
the LogMessage Handler!
    [junit] Response:
    [junit] <?xml version="1.0" encoding="UTF-8"?>
    [junit] <SOAP-ENV:Envelope xmlns:SOAP-ENV="http://schemas.xmlsoap.org/soap/envelope/"
xmlns:soapenc="http://schemas.xmlsoap.org/soap/encoding/"> <SOAP-ENV:Body>
    [junit] <echo:Echo xmlns:echo="EchoService">
    [junit] <symbol>IBM</symbol>
    [junit] </echo:Echo>
    [junit] </SOAP-ENV:Body></SOAP-ENV:Envelope>
    [junit] Test complete.
    [junit] Tests run: 8, Failures: 0, Errors: 3, Time elapsed: 16.852 sec
    [junit] Testsuite: test.functional.FunctionalTests
    [junit] Tests run: 8, Failures: 0, Errors: 3, Time elapsed: 16.852 sec
    [junit] 
    [junit] Testcase: testEchoService took 5.638 sec
    [junit] Testcase: testStockService took 4.665 sec
    [junit] 	Caused an ERROR
    [junit] Fault returned from test: AxisFault
    [junit]   faultCode: null
    [junit]   faultString: User 'null' not authenticated (unknown user)
    [junit]   faultActor: null
    [junit]   faultDetails: null
    [junit] 
    [junit] java.lang.Exception: Fault returned from test: AxisFault
    [junit]   faultCode: null
    [junit]   faultString: User 'null' not authenticated (unknown user)
    [junit]   faultActor: null
    [junit]   faultDetails: null
    [junit] 
    [junit] 	at test.functional.TestStockSample.testStockService(TestStockSample.java:144)
    [junit] 	at java.lang.reflect.Method.invoke(Native Method)
    [junit] 	at junit.framework.TestCase.runTest(TestCase.java:166)
    [junit] 	at junit.framework.TestCase.runBare(TestCase.java:140)
    [junit] 	at junit.framework.TestResult$1.protect(TestResult.java:106)
    [junit] 	at junit.framework.TestResult.runProtected(TestResult.java:124)
    [junit] 	at junit.framework.TestResult.run(TestResult.java:109)
    [junit] 	at junit.framework.TestCase.run(TestCase.java:131)
    [junit] 	at junit.framework.TestSuite.runTest(TestSuite.java:173)
    [junit] 	at junit.framework.TestSuite.run(TestSuite.java:168)
    [junit] 	at junit.framework.TestSuite.runTest(TestSuite.java:173)
    [junit] 	at junit.framework.TestSuite.run(TestSuite.java:168)
    [junit] 	at org.apache.tools.ant.taskdefs.optional.junit.JUnitTestRunner.run(JUnitTestRunner.java:231)
    [junit] 	at org.apache.tools.ant.taskdefs.optional.junit.JUnitTestRunner.main(JUnitTestRunner.java:409)
    [junit] 
    [junit] Testcase: testTCPTransportSample took 0.88 sec
    [junit] 	Caused an ERROR
    [junit] Fault returned from test: java.lang.Exception: Fault returned from TCP stock test:
AxisFault
    [junit]   faultCode: null
    [junit]   faultString: User 'null' not authenticated (unknown user)
    [junit]   faultActor: null
    [junit]   faultDetails: null
    [junit] 
    [junit] java.lang.Exception: Fault returned from test: java.lang.Exception: Fault returned
from TCP stock test: AxisFault
    [junit]   faultCode: null
    [junit]   faultString: User 'null' not authenticated (unknown user)
    [junit]   faultActor: null
    [junit]   faultDetails: null
    [junit] 
    [junit] 	at test.functional.TestTCPTransportSample.testTCPTransportSample(TestTCPTransportSample.java:155)
    [junit] 	at java.lang.reflect.Method.invoke(Native Method)
    [junit] 	at junit.framework.TestCase.runTest(TestCase.java:166)
    [junit] 	at junit.framework.TestCase.runBare(TestCase.java:140)
    [junit] 	at junit.framework.TestResult$1.protect(TestResult.java:106)
    [junit] 	at junit.framework.TestResult.runProtected(TestResult.java:124)
    [junit] 	at junit.framework.TestResult.run(TestResult.java:109)
    [junit] 	at junit.framework.TestCase.run(TestCase.java:131)
    [junit] 	at junit.framework.TestSuite.runTest(TestSuite.java:173)
    [junit] 	at junit.framework.TestSuite.run(TestSuite.java:168)
    [junit] 	at junit.framework.TestSuite.runTest(TestSuite.java:173)
    [junit] 	at junit.framework.TestSuite.run(TestSuite.java:168)
    [junit] 	at org.apache.tools.ant.taskdefs.optional.junit.JUnitTestRunner.run(JUnitTestRunner.java:231)
    [junit] 	at org.apache.tools.ant.taskdefs.optional.junit.JUnitTestRunner.main(JUnitTestRunner.java:409)
    [junit] 
    [junit] Testcase: testService took 2.397 sec
    [junit] 	Caused an ERROR
    [junit] Fault returned from test: AxisFault
    [junit]   faultCode: null
    [junit]   faultString: User 'null' not authenticated (unknown user)
    [junit]   faultActor: null
    [junit]   faultDetails: null
    [junit] 
    [junit] java.lang.Exception: Fault returned from test: AxisFault
    [junit]   faultCode: null
    [junit]   faultString: User 'null' not authenticated (unknown user)
    [junit]   faultActor: null
    [junit]   faultDetails: null
    [junit] 
    [junit] 	at test.functional.TestTransportSample.testService(TestTransportSample.java:136)
    [junit] 	at java.lang.reflect.Method.invoke(Native Method)
    [junit] 	at junit.framework.TestCase.runTest(TestCase.java:166)
    [junit] 	at junit.framework.TestCase.runBare(TestCase.java:140)
    [junit] 	at junit.framework.TestResult$1.protect(TestResult.java:106)
    [junit] 	at junit.framework.TestResult.runProtected(TestResult.java:124)
    [junit] 	at junit.framework.TestResult.run(TestResult.java:109)
    [junit] 	at junit.framework.TestCase.run(TestCase.java:131)
    [junit] 	at junit.framework.TestSuite.runTest(TestSuite.java:173)
    [junit] 	at junit.framework.TestSuite.run(TestSuite.java:168)
    [junit] 	at junit.framework.TestSuite.runTest(TestSuite.java:173)
    [junit] 	at junit.framework.TestSuite.run(TestSuite.java:168)
    [junit] 	at org.apache.tools.ant.taskdefs.optional.junit.JUnitTestRunner.run(JUnitTestRunner.java:231)
    [junit] 	at org.apache.tools.ant.taskdefs.optional.junit.JUnitTestRunner.main(JUnitTestRunner.java:409)
    [junit] 
    [junit] Testcase: testBidBuyService took 0.765 sec
    [junit] Testcase: testAddressBookService took 1.36 sec
    [junit] Testcase: testService took 0.078 sec
    [junit] Testcase: testService took 1.055 sec
     [java] TCPListener received new connection: Socket[addr=rubix/127.0.0.1,port=35321,localport=8088]
     [java] AxisListener quitting.

stop-functional-test-http-server:
     [echo] Stopping test http server.
     [java] Doing a quit
     [java] Admin service requested to quit, quitting.
     [java] SimpleAxisServer quitting.
     [java] <Admin>Quitting</Admin>
     [java] 
[runaxisfunctionaltests] RunAxisFunctionalTestsTask.callStop successfully sent quit message.

BUILD FAILED

/home/rubys/jakarta/xml-axis/java/test/build_functional_tests.xml:69: Test test.functional.FunctionalTests
failed

Total time: 45 seconds

Mime
View raw message