axis-java-dev mailing list archives

Site index · List index
Message view « Date » · « Thread »
Top « Date » · « Thread »
From Sam Ruby <ru...@us.ibm.com>
Subject [GUMP] Function Test Failure - Axis
Date Thu, 30 Aug 2001 10:54:17 GMT
----------------------------------------------------
This email is autogenerated from the output from:
<http://jakarta.apache.org/builds/gump/2001-08-30/test-axis.html>
----------------------------------------------------

Buildfile: build.xml

setenv:
     [echo] --- Build environment for Axis ---
     [echo] --- Flags (Note: If the {property name} is displayed, 
     [echo]            then the component is not present)
     [echo] 
     [echo] === Required Libraries ===
     [echo] wsdl4j.present=true
     [echo] 
     [echo] --- Optional Libraries ---
     [echo] servlet.present=true
     [echo] junit.present=true
     [echo] 
     [echo] --- Property values ---
     [echo] debug=true
     [echo] deprecation=true

compile:

post-compile:

buildTest:
     [echo] junit package found ...

samples:

functional-tests:

functional-tests:

start-functional-test-tcp-server:
     [echo] Starting test tcp server.
     [java] TCPListener is listening on port 8088.
     [java] TCPListener received new connection: Socket[addr=rubix/127.0.0.1,port=56911,localport=8088]
[runaxisfunctionaltests] RunAxisFunctionalTestsTask.callStart successfully pinged server.

start-functional-test-http-server:
     [echo] Starting test http server.
     [java] TCPListener received new connection: Socket[addr=rubix/127.0.0.1,port=56928,localport=8088]
[runaxisfunctionaltests] RunAxisFunctionalTestsTask.callStart successfully pinged server.

junit-functional:
    [mkdir] Created dir: /home/rubys/jakarta/xml-axis/java/build/jws
     [copy] Copying 1 file to /home/rubys/jakarta/xml-axis/java/build/jws
     [copy] Copying 1 file to /home/rubys/jakarta/xml-axis/java/build/jws
     [java] java.net.BindException: Address already in use
     [java] 	at java.net.PlainSocketImpl.socketBind(Native Method)
     [java] 	at java.net.PlainSocketImpl.bind(PlainSocketImpl.java:405)
     [java] 	at java.net.ServerSocket.<init>(ServerSocket.java:170)
     [java] 	at java.net.ServerSocket.<init>(ServerSocket.java:82)
     [java] 	at org.apache.axis.transport.http.SimpleAxisServer.main(SimpleAxisServer.java:667)
    [junit] Running test.functional.FunctionalTests
    [junit] Testing echo interop sample.
    [junit] Processing file: samples/echo/deploy.xml
    [junit] <Admin>Done processing</Admin>
    [junit] 
    [junit] Test complete.
    [junit] Testing stock sample.
    [junit] Testing JWS...
    [junit] AxisFault
    [junit]   faultCode: null
    [junit]   faultString: java.io.FileNotFoundException: jws/StockQuoteService.jws (No such
file or directory)
    [junit] AxisFault
    [junit]   faultCode: null
    [junit]   faultString: java.io.FileNotFoundException: jws/StockQuoteService.jws (No such
file or directory)
    [junit]   faultActor: null
    [junit]   faultDetails: null
    [junit] 
    [junit] 	at org.apache.axis.message.SOAPFaultElement.getAxisFault(SOAPFaultElement.java:132)
    [junit]   faultActor: null
    [junit]   faultDetails: null
    [junit] 
    [junit] 	at org.apache.axis.message.SOAPFaultBuilder.<init>(SOAPFaultBuilder.java:90)
    [junit] 	at org.apache.axis.message.BodyBuilder.onStartChild(BodyBuilder.java:73)
    [junit] 	at org.apache.axis.encoding.DeserializationContext.startElement(DeserializationContext.java:528)
    [junit] 	at org.apache.xerces.parsers.SAXParser.startElement(Unknown Source)
    [junit] Testing TCP transport.
    [junit] 	at org.apache.xerces.validators.common.XMLValidator.callStartElement(Unknown
Source)
    [junit] 	at org.apache.xerces.framework.XMLDocumentScanner$ContentDispatcher.dispatch(Unknown
Source)
    [junit] 	at org.apache.xerces.framework.XMLDocumentScanner.parseSome(Unknown Source)
    [junit] 	at org.apache.xerces.framework.XMLParser.parse(Unknown Source)
    [junit] 	at javax.xml.parsers.SAXParser.parse(Unknown Source)
    [junit] Deploying TCP client transport...Processing 'samples/transport/tcp/deploy.xml'
    [junit] 	at org.apache.axis.encoding.DeserializationContext.parse(DeserializationContext.java:160)
    [junit] 	at org.apache.axis.Message.getAsSOAPEnvelope(Message.java:315)
    [junit] 	at org.apache.axis.client.ServiceClient.invoke(ServiceClient.java:555)
    [junit] 	at org.apache.axis.client.ServiceClient.invoke(ServiceClient.java:460)
    [junit] OK!
    [junit] 	at samples.stock.GetQuote.getQuote(GetQuote.java:122)
    [junit] 	at test.functional.TestStockSample.doTestStockJWS(TestStockSample.java:84)
    [junit] 	at test.functional.TestStockSample.testStockService(TestStockSample.java:126)
    [junit] 	at java.lang.reflect.Method.invoke(Native Method)
    [junit] 	at junit.framework.TestCase.runTest(TestCase.java:166)
    [junit] 	at junit.framework.TestCase.runBare(TestCase.java:140)
    [junit] 	at junit.framework.TestResult$1.protect(TestResult.java:106)
    [junit] 	at junit.framework.TestResult.runProtected(TestResult.java:124)
     [java] TCPListener received new connection: Socket[addr=rubix/127.0.0.1,port=56972,localport=8088]
    [junit] 	at junit.framework.TestResult.run(TestResult.java:109)
    [junit] 	at junit.framework.TestCase.run(TestCase.java:131)
    [junit] 	at junit.framework.TestSuite.runTest(TestSuite.java:173)
    [junit] 	at junit.framework.TestSuite.run(TestSuite.java:168)
    [junit] 	at junit.framework.TestSuite.runTest(TestSuite.java:173)
    [junit] 	at junit.framework.TestSuite.run(TestSuite.java:168)
    [junit] 	at org.apache.tools.ant.taskdefs.optional.junit.JUnitTestRunner.run(JUnitTestRunner.java:231)
    [junit] 	at org.apache.tools.ant.taskdefs.optional.junit.JUnitTestRunner.main(JUnitTestRunner.java:409)
    [junit] Processing file: samples/stock/deploy.xml
    [junit] Enter: TCPSender::invoke
    [junit] Exit: TCPSender::invoke
     [java] TCPListener received new connection: Socket[addr=rubix/127.0.0.1,port=56977,localport=8088]
    [junit] Enter: TCPSender::invoke
    [junit] Testing deployment...<Admin>Done processing</Admin>
    [junit] 
    [junit] OK!
    [junit] Testing service...Testing TCP stock service...
    [junit] Exit: TCPSender::invoke
    [junit] Processing file: samples/stock/undeploy.xml
    [junit] OK!
     [java] TCPListener received new connection: Socket[addr=rubix/127.0.0.1,port=56978,localport=8088]
    [junit] Enter: TCPSender::invoke
    [junit] Exit: TCPSender::invoke
    [junit] Testing undeployment...<Admin>Done processing</Admin>
    [junit] 
    [junit] OK!
    [junit] Test complete.
    [junit] Testing transport sample.
    [junit] Testing client deployment...
    [junit] Processing 'samples/transport/client_deploy.xml'
    [junit] Testing deployment...
    [junit] Processing 'samples/transport/deploy.xml'
    [junit] Testing service with symbol IBM...
    [junit] IBM: 104.13
    [junit] FileReader halted.
    [junit] Testing service with symbol XXX...
    [junit] XXX: 55.25
    [junit] FileReader halted.
    [junit] Processing file: samples/bidbuy/deploy.xml
    [junit] Test complete.
    [junit] Testing bidbuy sample.
    [junit] Testing deployment...
    [junit] <Admin>Done processing</Admin>
    [junit] 
    [junit] Testing service...
    [junit] 9006
    [junit]   1 Tricorder
    [junit] Processing file: samples/addr/deploy.xml
    [junit]   3 Phasor
    [junit] Test complete.
    [junit] Testing address book sample.
    [junit] Testing deployment...
    [junit] <Admin>Done processing</Admin>
    [junit] 
    [junit] Testing service...
    [junit] Using proxy without session maintenance.
    [junit] >> Storing address for 'Purdue Boilermaker'
    [junit] >> Querying address for 'Purdue Boilermaker'
    [junit] >> Response is:
    [junit] 	1 University Drive
    [junit] 	West Lafayette, IN 47907
    [junit] 	Phone: (765) 494-4900
    [junit] >> Querying address for 'Purdue Boilermaker' again
    [junit] >> Response is:
    [junit] 	1 University Drive
    [junit] 	West Lafayette, IN 47907
    [junit] 	Phone: (765) 494-4900
    [junit] Testing misc sample.
    [junit] Testing service...
    [junit] java.lang.Exception: non-session test expected null response, got 1 University
Drive
    [junit] West Lafayette, IN 47907
    [junit] (765) 494-4900
    [junit] 	at samples.addr.Main.main(Main.java:123)
    [junit] 	at test.functional.TestAddressBookSample.doTest(TestAddressBookSample.java:89)
    [junit] 	at test.functional.TestAddressBookSample.testAddressBookService(TestAddressBookSample.java:98)
    [junit] 	at java.lang.reflect.Method.invoke(Native Method)
    [junit] Request:
    [junit] 	at junit.framework.TestCase.runTest(TestCase.java:166)
    [junit] 	at junit.framework.TestCase.runBare(TestCase.java:140)
    [junit] 	at junit.framework.TestResult$1.protect(TestResult.java:106)
    [junit] <SOAP-ENV:Envelope xmlns:SOAP-ENV="http://schemas.xmlsoap.org/soap/envelope/"
xmlns:soapenc="http://schemas.xmlsoap.org/soap/encoding/" > <SOAP-ENV:Body>
    [junit] <echo:Echo xmlns:echo="EchoService">
    [junit] <symbol>IBM</symbol>
    [junit] </echo:Echo>
    [junit] 	at junit.framework.TestResult.runProtected(TestResult.java:124)
    [junit] 	at junit.framework.TestResult.run(TestResult.java:109)
    [junit] </SOAP-ENV:Body></SOAP-ENV:Envelope>
    [junit] 
    [junit] Response:
    [junit] <?xml version="1.0" encoding="UTF-8"?>
    [junit] 	at junit.framework.TestCase.run(TestCase.java:131)
    [junit] 	at junit.framework.TestSuite.runTest(TestSuite.java:173)
    [junit] <SOAP-ENV:Envelope xmlns:SOAP-ENV="http://schemas.xmlsoap.org/soap/envelope/"
xmlns:soapenc="http://schemas.xmlsoap.org/soap/encoding/"> <SOAP-ENV:Body>
    [junit] <echo:Echo xmlns:echo="EchoService">
    [junit] 	at junit.framework.TestSuite.run(TestSuite.java:168)
    [junit] 	at junit.framework.TestSuite.runTest(TestSuite.java:173)
    [junit] <symbol>IBM</symbol>
    [junit] </echo:Echo>
    [junit] </SOAP-ENV:Body></SOAP-ENV:Envelope>
    [junit] Test complete.
    [junit] Testing proxy sample.
    [junit] 	at junit.framework.TestSuite.run(TestSuite.java:168)
    [junit] 	at org.apache.tools.ant.taskdefs.optional.junit.JUnitTestRunner.run(JUnitTestRunner.java:231)
    [junit] Testing deployment...
    [junit] 	at org.apache.tools.ant.taskdefs.optional.junit.JUnitTestRunner.main(JUnitTestRunner.java:409)
    [junit] Enter: AxisEngine::init
    [junit] Enter: BasicHandler::getDeploymentData
    [junit] Exit: BasicHandler::getDeploymentData
    [junit] Enter: BasicHandler::getDeploymentData
    [junit] Exit: BasicHandler::getDeploymentData
    [junit] Enter: BasicHandler::getDeploymentData
    [junit] Exit: BasicHandler::getDeploymentData
    [junit] Enter: BasicHandler::getDeploymentData
    [junit] Exit: BasicHandler::getDeploymentData
    [junit] Enter: Transport::getDeploymentData
    [junit] Exit: Transport::getDeploymentData
    [junit] Enter: Transport::getDeploymentData
    [junit] Exit: Transport::getDeploymentData
    [junit] Enter: Transport::getDeploymentData
    [junit] Exit: Transport::getDeploymentData
    [junit] Enter: Transport::getDeploymentData
    [junit] Exit: Transport::getDeploymentData
    [junit] Exit: AxisEngine::init
    [junit] Transport is org.apache.axis.transport.http.HTTPTransport@13722c
    [junit] Enter: Service::invoke()
    [junit] Enter: AxisClient::invoke
    [junit] Enter: SimpleTargetedChain::invoke
    [junit] Enter: HTTPSender::invoke
    [junit] Created an insecure HTTP connection
    [junit] XML sent:
    [junit] ---------------------------------------------------
    [junit] POST /axis/servlet/AxisServlet HTTP/1.0
    [junit] Content-Length: 262
    [junit] Host: localhost
    [junit] Content-Type: text/xml; charset=utf-8
    [junit] SOAPAction: "EchoService"
    [junit] 
    [junit] <SOAP-ENV:Envelope xmlns:SOAP-ENV="http://schemas.xmlsoap.org/soap/envelope/"
xmlns:soapenc="http://schemas.xmlsoap.org/soap/encoding/" > <SOAP-ENV:Body>
    [junit] <echo:Echo xmlns:echo="EchoService">
    [junit] <symbol>IBM</symbol>
    [junit] </echo:Echo>
    [junit] </SOAP-ENV:Body></SOAP-ENV:Envelope>
    [junit] 
    [junit] HTTP/1.0 200 OK
    [junit] Content-Type text/xml; charset=utf-8
    [junit] Content-Length 299
    [junit] Set-Cookie 1212
    [junit] Set-Cookie2 1212
    [junit] 
    [junit] XML received:
    [junit] -----------------------------------------------
    [junit] <?xml version="1.0" encoding="UTF-8"?>
    [junit] <SOAP-ENV:Envelope xmlns:SOAP-ENV="http://schemas.xmlsoap.org/soap/envelope/"
xmlns:soapenc="http://schemas.xmlsoap.org/soap/encoding/"> <SOAP-ENV:Body>
    [junit] <echo:Echo xmlns:echo="EchoService">
    [junit] <symbol>IBM</symbol>
    [junit] </echo:Echo>
    [junit] </SOAP-ENV:Body></SOAP-ENV:Envelope>
    [junit] Exit: HTTPDispatchHandler::invoke
    [junit] Exit: SimpleTargetedChain::invoke
    [junit] Exit: AxisClient::invoke
    [junit] Exit: Service::invoke()
    [junit] Processing file: samples/proxy/deploy.xml
    [junit] Enter: AxisEngine::init
    [junit] Enter: BasicHandler::getDeploymentData
    [junit] Exit: BasicHandler::getDeploymentData
    [junit] Enter: BasicHandler::getDeploymentData
    [junit] Exit: BasicHandler::getDeploymentData
    [junit] Enter: BasicHandler::getDeploymentData
    [junit] Exit: BasicHandler::getDeploymentData
    [junit] Enter: BasicHandler::getDeploymentData
    [junit] Exit: BasicHandler::getDeploymentData
    [junit] Enter: Transport::getDeploymentData
    [junit] Exit: Transport::getDeploymentData
    [junit] Enter: Transport::getDeploymentData
    [junit] Exit: Transport::getDeploymentData
    [junit] Enter: Transport::getDeploymentData
    [junit] Exit: Transport::getDeploymentData
    [junit] Enter: Transport::getDeploymentData
    [junit] Exit: Transport::getDeploymentData
    [junit] Exit: AxisEngine::init
    [junit] Transport is org.apache.axis.transport.http.HTTPTransport@49b9ca
    [junit] Enter: Service::invoke()
    [junit] Enter: AxisClient::invoke
    [junit] Enter: SimpleTargetedChain::invoke
    [junit] Enter: HTTPSender::invoke
    [junit] Created an insecure HTTP connection
    [junit] XML sent:
    [junit] ---------------------------------------------------
    [junit] POST /axis/servlet/AxisServlet HTTP/1.0
    [junit] Content-Length: 928
    [junit] Host: localhost
    [junit] Content-Type: text/xml; charset=utf-8
    [junit] SOAPAction: "AdminService"
    [junit] 
    [junit] <?xml version="1.0" encoding="UTF-8"?>
    [junit] <Admin>Done processing</Admin>
    [junit] 
    [junit] Testing server-side client deployment...
    [junit] <SOAP-ENV:Envelope xmlns:SOAP-ENV="http://schemas.xmlsoap.org/soap/envelope/"
xmlns:xsd="http://www.w3.org/2001/XMLSchema" xmlns:xsi="http://www.w3.org/2001/XMLSchema-instance"><SOAP-ENV:Body><m:deploy
xmlns:m="AdminService">
    [junit] 
    [junit]   <chain   name="proxyPivot"   flow="MsgDispatcher" />
    [junit] 
    [junit] <Admin>Done processing</Admin>
    [junit]   <!-- NEED TO DEPLOY HTTPActionHandler FOR THE FIRST TIME EVER?!?!?! - RobJ
-->
    [junit]   <handler name="HTTPActionHandler" class="org.apache.axis.handlers.http.HTTPActionHandler"/>
    [junit] 
    [junit] Testing service...
    [junit]   <transport name="SimpleHTTP" pivot="HTTPSender" request="HTTPActionHandler"
/>
    [junit]  
    [junit] Request:
    [junit]   <service name="ProxyService" pivot="proxyPivot" >
    [junit]     <option name="className" value="samples.proxy.ProxyService" />
    [junit]     <option name="methodName" value="ProxyService" />
    [junit] <SOAP-ENV:Envelope xmlns:SOAP-ENV="http://schemas.xmlsoap.org/soap/envelope/"
xmlns:soapenc="http://schemas.xmlsoap.org/soap/encoding/" > <SOAP-ENV:Body>
    [junit] <echo:Echo xmlns:echo="EchoService">
    [junit] <symbol>IBM</symbol>
    [junit] </echo:Echo>
    [junit]     <option name="FullMessageService" value="true" />
    [junit]     <option name="URL" value="tcp://localhost:8088/" />
    [junit]   </service>
    [junit]   
     [java] TCPListener received new connection: Socket[addr=rubix/127.0.0.1,port=57012,localport=8088]
    [junit] </SOAP-ENV:Body></SOAP-ENV:Envelope>
    [junit] 
    [junit] </m:deploy>
    [junit] 
    [junit] </SOAP-ENV:Body></SOAP-ENV:Envelope>
    [junit] HTTP/1.0 200 OK
    [junit] Content-Type text/xml; charset=utf-8
    [junit] Content-Length 297
    [junit] Set-Cookie 1212
    [junit] Set-Cookie2 1212
    [junit] 
    [junit] XML received:
    [junit] -----------------------------------------------
    [junit] <?xml version="1.0" encoding="UTF-8"?>
    [junit] Response:
    [junit] <?xml version="1.0" encoding="UTF-8"?>
    [junit] <SOAP-ENV:Envelope xmlns:SOAP-ENV="http://schemas.xmlsoap.org/soap/envelope/"
xmlns:soapenc="http://schemas.xmlsoap.org/soap/encoding/"> <SOAP-ENV:Body>
    [junit] <echo:Echo xmlns:echo="EchoService">
    [junit] <symbol>IBM</symbol>
    [junit] </echo:Echo>
    [junit] </SOAP-ENV:Body></SOAP-ENV:Envelope>
    [junit] Test complete.
    [junit] Tests run: 8, Failures: 0, Errors: 2, Time elapsed: 13.519 sec
    [junit] Testsuite: test.functional.FunctionalTests
    [junit] Tests run: 8, Failures: 0, Errors: 2, Time elapsed: 13.519 sec
    [junit] 
    [junit] <SOAP-ENV:Envelope xmlns:SOAP-ENV="http://schemas.xmlsoap.org/soap/envelope/"
xmlns:xsd="http://www.w3.org/2001/XMLSchema" xmlns:xsi="http://www.w3.org/2001/XMLSchema-instance"><SOAP-ENV:Body><Admin>Done
processing</Admin></SOAP-ENV:Body></SOAP-ENV:Envelope>
    [junit] Exit: HTTPDispatchHandler::invoke
    [junit] Exit: SimpleTargetedChain::invoke
    [junit] Exit: AxisClient::invoke
    [junit] Exit: Service::invoke()
    [junit] Processing file: samples/proxy/client_deploy.xml
    [junit] Enter: AxisEngine::init
    [junit] Enter: BasicHandler::getDeploymentData
    [junit] Testcase: testEchoService took 5.631 sec
    [junit] Testcase: testStockService took 0.717 sec
    [junit] 	Caused an ERROR
    [junit] Fault returned from test: AxisFault
    [junit]   faultCode: null
    [junit]   faultString: java.io.FileNotFoundException: jws/StockQuoteService.jws (No such
file or directory)
    [junit]   faultActor: null
    [junit] Exit: BasicHandler::getDeploymentData
    [junit] Enter: BasicHandler::getDeploymentData
    [junit] Exit: BasicHandler::getDeploymentData
    [junit] Enter: BasicHandler::getDeploymentData
    [junit] Exit: BasicHandler::getDeploymentData
    [junit] Enter: BasicHandler::getDeploymentData
    [junit] Exit: BasicHandler::getDeploymentData
    [junit]   faultDetails: null
    [junit] 
    [junit] java.lang.Exception: Fault returned from test: AxisFault
    [junit]   faultCode: null
    [junit]   faultString: java.io.FileNotFoundException: jws/StockQuoteService.jws (No such
file or directory)
    [junit]   faultActor: null
    [junit]   faultDetails: null
    [junit] 
    [junit] Enter: Transport::getDeploymentData
    [junit] Exit: Transport::getDeploymentData
    [junit] Enter: Transport::getDeploymentData
    [junit] Exit: Transport::getDeploymentData
    [junit] Enter: Transport::getDeploymentData
    [junit] Exit: Transport::getDeploymentData
    [junit] Enter: Transport::getDeploymentData
    [junit] 	at test.functional.TestStockSample.testStockService(TestStockSample.java:140)
    [junit] 	at java.lang.reflect.Method.invoke(Native Method)
    [junit] 	at junit.framework.TestCase.runTest(TestCase.java:166)
    [junit] 	at junit.framework.TestCase.runBare(TestCase.java:140)
    [junit] Exit: Transport::getDeploymentData
    [junit] Exit: AxisEngine::init
    [junit] Transport is org.apache.axis.transport.http.HTTPTransport@49b9ca
    [junit] Enter: Service::invoke()
    [junit] Enter: AxisClient::invoke
    [junit] Enter: SimpleTargetedChain::invoke
    [junit] Enter: HTTPSender::invoke
    [junit] Created an insecure HTTP connection
    [junit] 	at junit.framework.TestResult$1.protect(TestResult.java:106)
    [junit] 	at junit.framework.TestResult.runProtected(TestResult.java:124)
    [junit] 	at junit.framework.TestResult.run(TestResult.java:109)
    [junit] 	at junit.framework.TestCase.run(TestCase.java:131)
    [junit] XML sent:
    [junit] ---------------------------------------------------
    [junit] POST /axis/servlet/AxisServlet HTTP/1.0
    [junit] Content-Length: 623
    [junit] Host: localhost
    [junit] Content-Type: text/xml; charset=utf-8
    [junit] SOAPAction: "AdminService"
    [junit] 
    [junit] <?xml version="1.0" encoding="UTF-8"?>
    [junit] 	at junit.framework.TestSuite.runTest(TestSuite.java:173)
    [junit] 	at junit.framework.TestSuite.run(TestSuite.java:168)
    [junit] 	at junit.framework.TestSuite.runTest(TestSuite.java:173)
    [junit] 	at junit.framework.TestSuite.run(TestSuite.java:168)
    [junit] <SOAP-ENV:Envelope xmlns:SOAP-ENV="http://schemas.xmlsoap.org/soap/envelope/"
xmlns:xsd="http://www.w3.org/2001/XMLSchema" xmlns:xsi="http://www.w3.org/2001/XMLSchema-instance"><SOAP-ENV:Body><m:clientdeploy
xmlns:m="AdminService">
    [junit] 	at org.apache.tools.ant.taskdefs.optional.junit.JUnitTestRunner.run(JUnitTestRunner.java:231)
    [junit] 	at org.apache.tools.ant.taskdefs.optional.junit.JUnitTestRunner.main(JUnitTestRunner.java:409)
    [junit] 
    [junit] Testcase: testTCPTransportSample took 1.214 sec
    [junit] Testcase: testService took 3.204 sec
    [junit] Testcase: testBidBuyService took 0.996 sec
    [junit]   <handler name="TCPSender" class="samples.transport.tcp.TCPSender"/>
    [junit]   <handler name="LogIt" class="org.apache.axis.handlers.LogMessage">
    [junit]    <option name="message" value="This message courtesy of the LogMessage Handler!"/>
    [junit]   </handler>
    [junit] Testcase: testAddressBookService took 0.864 sec
    [junit] 	Caused an ERROR
    [junit] Fault returned from test: java.lang.Exception: non-session test expected null
response, got 1 University Drive
    [junit] West Lafayette, IN 47907
    [junit] (765) 494-4900
    [junit]   <transport name="tcp" pivot="TCPSender" request="LogIt"/>
    [junit] </m:clientdeploy>
    [junit] 
    [junit] </SOAP-ENV:Body></SOAP-ENV:Envelope>
    [junit] HTTP/1.0 200 OK
    [junit] Content-Type text/xml; charset=utf-8
    [junit] Content-Length 297
    [junit] Set-Cookie 1212
    [junit] Set-Cookie2 1212
    [junit] 
    [junit] XML received:
    [junit] -----------------------------------------------
    [junit] java.lang.Exception: Fault returned from test: java.lang.Exception: non-session
test expected null response, got 1 University Drive
    [junit] West Lafayette, IN 47907
    [junit] (765) 494-4900
    [junit] 	at test.functional.TestAddressBookSample.testAddressBookService(TestAddressBookSample.java:104)
    [junit] <?xml version="1.0" encoding="UTF-8"?>
    [junit] 	at java.lang.reflect.Method.invoke(Native Method)
    [junit] 	at junit.framework.TestCase.runTest(TestCase.java:166)
    [junit] 	at junit.framework.TestCase.runBare(TestCase.java:140)
    [junit] 	at junit.framework.TestResult$1.protect(TestResult.java:106)
    [junit] 	at junit.framework.TestResult.runProtected(TestResult.java:124)
    [junit] <SOAP-ENV:Envelope xmlns:SOAP-ENV="http://schemas.xmlsoap.org/soap/envelope/"
xmlns:xsd="http://www.w3.org/2001/XMLSchema" xmlns:xsi="http://www.w3.org/2001/XMLSchema-instance"><SOAP-ENV:Body><Admin>Done
processing</Admin></SOAP-ENV:Body></SOAP-ENV:Envelope>
    [junit] Exit: HTTPDispatchHandler::invoke
    [junit] Exit: SimpleTargetedChain::invoke
    [junit] Exit: AxisClient::invoke
    [junit] Exit: Service::invoke()
    [junit] Enter: AxisEngine::init
    [junit] Enter: BasicHandler::getDeploymentData
    [junit] Exit: BasicHandler::getDeploymentData
    [junit] 	at junit.framework.TestResult.run(TestResult.java:109)
    [junit] 	at junit.framework.TestCase.run(TestCase.java:131)
    [junit] 	at junit.framework.TestSuite.runTest(TestSuite.java:173)
    [junit] 	at junit.framework.TestSuite.run(TestSuite.java:168)
    [junit] Enter: BasicHandler::getDeploymentData
    [junit] Exit: BasicHandler::getDeploymentData
    [junit] Enter: BasicHandler::getDeploymentData
    [junit] Exit: BasicHandler::getDeploymentData
    [junit] Enter: BasicHandler::getDeploymentData
    [junit] Exit: BasicHandler::getDeploymentData
    [junit] Enter: Transport::getDeploymentData
    [junit] 	at junit.framework.TestSuite.runTest(TestSuite.java:173)
    [junit] 	at junit.framework.TestSuite.run(TestSuite.java:168)
    [junit] 	at org.apache.tools.ant.taskdefs.optional.junit.JUnitTestRunner.run(JUnitTestRunner.java:231)
    [junit] 	at org.apache.tools.ant.taskdefs.optional.junit.JUnitTestRunner.main(JUnitTestRunner.java:409)
    [junit] 
    [junit] Exit: Transport::getDeploymentData
    [junit] Enter: Transport::getDeploymentData
    [junit] Exit: Transport::getDeploymentData
    [junit] Enter: Transport::getDeploymentData
    [junit] Exit: Transport::getDeploymentData
    [junit] Enter: Transport::getDeploymentData
    [junit] Exit: Transport::getDeploymentData
    [junit] Testcase: testService took 0.105 sec
    [junit] Testcase: testService took 0.776 sec
    [junit] Exit: AxisEngine::init
    [junit] Transport is org.apache.axis.transport.http.HTTPTransport@20d62b
    [junit] Enter: Service::invoke()
    [junit] Enter: AxisClient::invoke
    [junit] Enter: SimpleTargetedChain::invoke
    [junit] Enter: HTTPSender::invoke
    [junit] Created an insecure HTTP connection
    [junit] XML sent:
    [junit] ---------------------------------------------------
    [junit] POST /axis/servlet/AxisServlet HTTP/1.0
    [junit] Content-Length: 262
    [junit] Host: localhost
    [junit] Content-Type: text/xml; charset=utf-8
    [junit] SOAPAction: "ProxyService"
    [junit] 
    [junit] <SOAP-ENV:Envelope xmlns:SOAP-ENV="http://schemas.xmlsoap.org/soap/envelope/"
xmlns:soapenc="http://schemas.xmlsoap.org/soap/encoding/" > <SOAP-ENV:Body>
    [junit] <echo:Echo xmlns:echo="EchoService">
    [junit] <symbol>IBM</symbol>
    [junit] </echo:Echo>
    [junit] </SOAP-ENV:Body></SOAP-ENV:Envelope>
    [junit] 
    [junit] HTTP/1.0 200 OK
    [junit] Content-Type text/xml; charset=utf-8
    [junit] Content-Length 299
    [junit] Set-Cookie 1212
    [junit] Set-Cookie2 1212
    [junit] 
    [junit] XML received:
    [junit] -----------------------------------------------
    [junit] <?xml version="1.0" encoding="UTF-8"?>
    [junit] <SOAP-ENV:Envelope xmlns:SOAP-ENV="http://schemas.xmlsoap.org/soap/envelope/"
xmlns:soapenc="http://schemas.xmlsoap.org/soap/encoding/"> <SOAP-ENV:Body>
    [junit] <echo:Echo xmlns:echo="EchoService">
    [junit] <symbol>IBM</symbol>
    [junit] </echo:Echo>
    [junit] </SOAP-ENV:Body></SOAP-ENV:Envelope>
    [junit] Exit: HTTPDispatchHandler::invoke
    [junit] Exit: SimpleTargetedChain::invoke
    [junit] Exit: AxisClient::invoke
    [junit] Exit: Service::invoke()
     [java] TCPListener received new connection: Socket[addr=rubix/127.0.0.1,port=57017,localport=8088]

BUILD FAILED

Test test.functional.FunctionalTests failed

Total time: 33 seconds

Mime
View raw message