axis-java-dev mailing list archives

Site index · List index
Message view « Date » · « Thread »
Top « Date » · « Thread »
From Sam Ruby <ru...@us.ibm.com>
Subject [GUMP] Function Test Failure - Axis
Date Sun, 12 Aug 2001 10:12:51 GMT
----------------------------------------------------
This email is autogenerated from the output from:
<http://jakarta.apache.org/builds/gump/2001-08-12/test-axis.html>
----------------------------------------------------

Buildfile: build.xml

setenv:
     [echo] --- Build environment for Axis ---
     [echo] --- Flags (Note: If the {property name} is displayed, 
     [echo]            then the component is not present)
     [echo] 
     [echo] --- Optional Libraries ---
     [echo] servlet.present=true
     [echo] junit.present=true
     [echo] 
     [echo] --- Property values ---
     [echo] debug=true
     [echo] deprecation=true

compile:
      [jar] Building jar: /home/rubys/jakarta/xml-axis/java/build/lib/axis.jar

post-compile:

buildTest:
     [echo] junit package found ...

samples:
    [javac] Compiling 49 source files to /home/rubys/jakarta/xml-axis/java/build/classes

functional-tests:

functional-tests:

start-functional-test-tcp-server:
     [echo] Starting test tcp server.
     [java] TCPListener is listening on port 8088.
     [java] TCPListener received new connection: Socket[addr=rubix/127.0.0.1,port=32885,localport=8088]
     [java] Couldn't read engine config!
     [java] java.lang.NullPointerException
     [java] 	at org.apache.xerces.dom.DeepNodeListImpl.nextMatchingElementAfter(Unknown Source)
     [java] 	at org.apache.xerces.dom.DeepNodeListImpl.item(Unknown Source)
     [java] 	at org.apache.xerces.dom.DeepNodeListImpl.getLength(Unknown Source)
     [java] 	at org.apache.axis.utils.Admin.deploy(Admin.java:210)
     [java] 	at org.apache.axis.utils.Admin.processEngineConfig(Admin.java:177)
     [java] 	at org.apache.axis.AxisEngine.readConfiguration(AxisEngine.java:235)
     [java] 	at org.apache.axis.AxisEngine.init(AxisEngine.java:195)
     [java] 	at org.apache.axis.AxisEngine.<init>(AxisEngine.java:139)
     [java] 	at org.apache.axis.server.AxisServer.<init>(AxisServer.java:88)
     [java] 	at samples.transport.tcp.TCPListener$SocketHandler.run(TCPListener.java:148)
     [java] 	at java.lang.Thread.run(Thread.java:484)
     [java] Couldn't read engine config!
     [java] java.lang.NullPointerException
     [java] 	at org.apache.xerces.dom.DeepNodeListImpl.nextMatchingElementAfter(Unknown Source)
[runaxisfunctionaltests] RunAxisFunctionalTestsTask.callStart successfully pinged server.
     [java] 	at org.apache.xerces.dom.DeepNodeListImpl.item(Unknown Source)
     [java] 	at org.apache.xerces.dom.DeepNodeListImpl.getLength(Unknown Source)
     [java] 	at org.apache.axis.utils.Admin.deploy(Admin.java:210)
     [java] 	at org.apache.axis.utils.Admin.processEngineConfig(Admin.java:177)
     [java] 	at org.apache.axis.AxisEngine.readConfiguration(AxisEngine.java:235)
     [java] 	at org.apache.axis.AxisEngine.init(AxisEngine.java:195)
     [java] 	at samples.transport.tcp.TCPListener$SocketHandler.run(TCPListener.java:149)
     [java] 	at java.lang.Thread.run(Thread.java:484)

start-functional-test-http-server:
     [echo] Starting test http server.
     [java] TCPListener received new connection: Socket[addr=rubix/127.0.0.1,port=32886,localport=8088]
[runaxisfunctionaltests] RunAxisFunctionalTestsTask.callStart successfully pinged server.

junit-functional:
    [mkdir] Created dir: /home/rubys/jakarta/xml-axis/java/build/jws
     [copy] Copying 1 file to /home/rubys/jakarta/xml-axis/java/build/jws
     [copy] Copying 1 file to /home/rubys/jakarta/xml-axis/java/build/jws
    [junit] Running test.functional.FunctionalTests
     [java] java.net.BindException: Address already in use
     [java] 	at java.net.PlainSocketImpl.socketBind(Native Method)
     [java] 	at java.net.PlainSocketImpl.bind(PlainSocketImpl.java:405)
     [java] 	at java.net.ServerSocket.<init>(ServerSocket.java:170)
     [java] 	at java.net.ServerSocket.<init>(ServerSocket.java:82)
     [java] 	at org.apache.axis.transport.http.SimpleAxisServer.main(SimpleAxisServer.java:625)
    [junit] Testing echo interop sample.
    [junit] Processing file: samples/echo/deploy.xml
    [junit] Couldn't read engine config!
    [junit] java.lang.NullPointerException
    [junit] 	at org.apache.xerces.dom.DeepNodeListImpl.nextMatchingElementAfter(Unknown Source)
    [junit] 	at org.apache.xerces.dom.DeepNodeListImpl.item(Unknown Source)
    [junit] 	at org.apache.xerces.dom.DeepNodeListImpl.getLength(Unknown Source)
    [junit] 	at org.apache.axis.utils.Admin.deploy(Admin.java:210)
    [junit] 	at org.apache.axis.utils.Admin.processEngineConfig(Admin.java:177)
    [junit] 	at org.apache.axis.AxisEngine.readConfiguration(AxisEngine.java:235)
    [junit] 	at org.apache.axis.AxisEngine.init(AxisEngine.java:195)
    [junit] 	at org.apache.axis.AxisEngine.<init>(AxisEngine.java:139)
    [junit] 	at org.apache.axis.client.AxisClient.<init>(AxisClient.java:79)
    [junit] 	at org.apache.axis.client.ServiceClient.<init>(ServiceClient.java:204)
    [junit] 	at org.apache.axis.client.AdminClient.main(AdminClient.java:127)
    [junit] 	at test.functional.TestEchoSample.testEchoService(TestEchoSample.java:76)
    [junit] 	at java.lang.reflect.Method.invoke(Native Method)
    [junit] 	at junit.framework.TestCase.runTest(TestCase.java:166)
    [junit] 	at junit.framework.TestCase.runBare(TestCase.java:140)
    [junit] 	at junit.framework.TestResult$1.protect(TestResult.java:106)
    [junit] 	at junit.framework.TestResult.runProtected(TestResult.java:124)
    [junit] 	at junit.framework.TestResult.run(TestResult.java:109)
    [junit] 	at junit.framework.TestCase.run(TestCase.java:131)
    [junit] 	at junit.framework.TestSuite.runTest(TestSuite.java:173)
    [junit] 	at junit.framework.TestSuite.run(TestSuite.java:168)
    [junit] 	at junit.framework.TestSuite.runTest(TestSuite.java:173)
    [junit] 	at junit.framework.TestSuite.run(TestSuite.java:168)
    [junit] 	at org.apache.tools.ant.taskdefs.optional.junit.JUnitTestRunner.run(Unknown Source)
    [junit] 	at org.apache.tools.ant.taskdefs.optional.junit.JUnitTestRunner.main(Unknown
Source)
    [junit] Null response message!
    [junit] Couldn't read engine config!
    [junit] java.lang.NullPointerException
    [junit] Tests run: 1, Failures: 1, Errors: 0, Time elapsed: 2.676 sec
    [junit] 	at org.apache.xerces.dom.DeepNodeListImpl.nextMatchingElementAfter(Unknown Source)
    [junit] 	at org.apache.xerces.dom.DeepNodeListImpl.item(Unknown Source)
    [junit] 	at org.apache.xerces.dom.DeepNodeListImpl.getLength(Unknown Source)
    [junit] 	at org.apache.axis.utils.Admin.deploy(Admin.java:210)
    [junit] Testsuite: test.functional.FunctionalTests
    [junit] Tests run: 1, Failures: 1, Errors: 0, Time elapsed: 2.676 sec
    [junit] 
    [junit] 	at org.apache.axis.utils.Admin.processEngineConfig(Admin.java:177)
    [junit] 	at org.apache.axis.AxisEngine.readConfiguration(AxisEngine.java:235)
    [junit] Testcase: testEchoService took 2.661 sec
    [junit] 	FAILED
    [junit] echoString      : java.lang.Exception: Null response message!
    [junit] 	at org.apache.axis.AxisEngine.init(AxisEngine.java:195)
    [junit] 	at org.apache.axis.AxisEngine.<init>(AxisEngine.java:139)
    [junit] 	at org.apache.axis.client.AxisClient.<init>(AxisClient.java:79)
    [junit] junit.framework.AssertionFailedError: echoString      : java.lang.Exception: Null
response message!
    [junit] 	at junit.framework.Assert.fail(Assert.java:51)
    [junit] 	at org.apache.axis.client.ServiceClient.<init>(ServiceClient.java:204)
    [junit] 	at samples.echo.TestClient.setURL(TestClient.java:185)
    [junit] 	at junit.framework.Assert.assertTrue(Assert.java:38)
    [junit] 	at test.functional.TestEchoSample$1.verify(TestEchoSample.java:81)
    [junit] 	at test.functional.TestEchoSample.testEchoService(TestEchoSample.java:86)
    [junit] 	at java.lang.reflect.Method.invoke(Native Method)
    [junit] 	at samples.echo.TestClient.test(TestClient.java:175)
    [junit] 	at samples.echo.TestClient.execute(TestClient.java:200)
    [junit] 	at junit.framework.TestCase.runTest(TestCase.java:166)
    [junit] 	at junit.framework.TestCase.runBare(TestCase.java:140)
    [junit] 	at test.functional.TestEchoSample.testEchoService(TestEchoSample.java:87)
    [junit] 	at java.lang.reflect.Method.invoke(Native Method)
    [junit] 	at junit.framework.TestResult$1.protect(TestResult.java:106)
    [junit] 	at junit.framework.TestResult.runProtected(TestResult.java:124)
    [junit] 	at junit.framework.TestCase.runTest(TestCase.java:166)
    [junit] 	at junit.framework.TestCase.runBare(TestCase.java:140)
    [junit] 	at junit.framework.TestResult.run(TestResult.java:109)
    [junit] 	at junit.framework.TestCase.run(TestCase.java:131)
    [junit] 	at junit.framework.TestResult$1.protect(TestResult.java:106)
    [junit] 	at junit.framework.TestResult.runProtected(TestResult.java:124)
    [junit] 	at junit.framework.TestResult.run(TestResult.java:109)
    [junit] 	at junit.framework.TestSuite.runTest(TestSuite.java:173)
    [junit] 	at junit.framework.TestSuite.run(TestSuite.java:168)
    [junit] 	at junit.framework.TestCase.run(TestCase.java:131)
    [junit] 	at junit.framework.TestSuite.runTest(TestSuite.java:173)
    [junit] 	at junit.framework.TestSuite.runTest(TestSuite.java:173)
    [junit] 	at junit.framework.TestSuite.run(TestSuite.java:168)
    [junit] 	at junit.framework.TestSuite.run(TestSuite.java:168)
    [junit] 	at junit.framework.TestSuite.runTest(TestSuite.java:173)
    [junit] 	at org.apache.tools.ant.taskdefs.optional.junit.JUnitTestRunner.run(Unknown Source)
    [junit] 	at org.apache.tools.ant.taskdefs.optional.junit.JUnitTestRunner.main(Unknown
Source)
    [junit] 	at junit.framework.TestSuite.run(TestSuite.java:168)
    [junit] 	at org.apache.tools.ant.taskdefs.optional.junit.JUnitTestRunner.run(Unknown Source)
    [junit] 	at org.apache.tools.ant.taskdefs.optional.junit.JUnitTestRunner.main(Unknown
Source)
    [junit] 
     [java] TCPListener received new connection: Socket[addr=rubix/127.0.0.1,port=32887,localport=8088]
     [java] AxisListener quitting.

stop-functional-test-http-server:
     [echo] Stopping test http server.
     [java] Doing a quit
     [java] Couldn't read engine config!
     [java] java.lang.NullPointerException
     [java] 	at org.apache.xerces.dom.DeepNodeListImpl.nextMatchingElementAfter(Unknown Source)
     [java] 	at org.apache.xerces.dom.DeepNodeListImpl.item(Unknown Source)
     [java] 	at org.apache.xerces.dom.DeepNodeListImpl.getLength(Unknown Source)
     [java] 	at org.apache.axis.utils.Admin.deploy(Admin.java:210)
     [java] 	at org.apache.axis.utils.Admin.processEngineConfig(Admin.java:177)
     [java] 	at org.apache.axis.AxisEngine.readConfiguration(AxisEngine.java:235)
     [java] 	at org.apache.axis.AxisEngine.init(AxisEngine.java:195)
     [java] 	at org.apache.axis.AxisEngine.<init>(AxisEngine.java:139)
     [java] 	at org.apache.axis.client.AxisClient.<init>(AxisClient.java:79)
     [java] 	at org.apache.axis.client.ServiceClient.<init>(ServiceClient.java:204)
     [java] 	at org.apache.axis.client.AdminClient.main(AdminClient.java:127)
     [java] Null response message!
[runaxisfunctionaltests] RunAxisFunctionalTestsTask.callStop successfully sent quit message.

BUILD FAILED

Test test.functional.FunctionalTests failed

Total time: 34 seconds

Mime
View raw message