axis-java-dev mailing list archives

Site index · List index
Message view « Date » · « Thread »
Top « Date » · « Thread »
From Glen Daniels <gdani...@macromedia.com>
Subject RE: [GUMP] Function Test Failure - Axis
Date Tue, 26 Jun 2001 21:01:33 GMT

Are some of these timing problems a result of using a singleton somewhere in
XMLUtils?

> -----Original Message-----
> From: Sam Ruby [mailto:rubys@us.ibm.com]
> Sent: Tuesday, June 26, 2001 4:31 PM
> To: axis-dev@xml.apache.org
> Subject: [GUMP] Function Test Failure - Axis
> 
> 
> ----------------------------------------------------
> This email is autogenerated from the output from:
> <http://jakarta.apache.org/builds/gump/2001-06-26/test-axis.html>
> ----------------------------------------------------
> 
> Buildfile: build.xml
> 
> setenv:
>      [echo] --- Build environment for Axis ---
>      [echo] --- Flags (Note: If the {property name} is displayed, 
>      [echo]            then the component is not present)
>      [echo] 
>      [echo] --- Required Libraries ---
>      [echo] xerces.present=true
>      [echo] 
>      [echo] --- Optional Libraries ---
>      [echo] servlet.present=true
>      [echo] junit.present=true
>      [echo] 
>      [echo] --- Property values
>      [echo] debug=true
>      [echo] deprecation=true
> 
> compile:
> 
> post-compile:
> 
> buildTest:
>      [echo] junit package found ...
> 
> samples:
> 
> functional-tests:
> 
> functional-tests:
> 
> start-functional-test-tcp-server:
>      [echo] Starting test tcp server.
>      [java] AxisListener is listening on port 8088.
> RunAxisFunctionalTestsTask.callStart successfully pinged server.
> 
> start-functional-test-http-server:
>      [echo] Starting test http server.
> RunAxisFunctionalTestsTask.callStart successfully pinged server.
> 
> junit-functional:
>     [mkdir] Created dir: /home/rubys/jakarta/xml-axis/java/build/jws
>      [copy] Copying 1 file to 
> /home/rubys/jakarta/xml-axis/java/build/jws
>     [junit] Running test.functional.FunctionalTests
>     [junit] Creating FunctionalTests suite.
>     [junit] Tests run: 5, Failures: 0, Errors: 1, Time 
> elapsed: 14.949 sec
>     [junit] Testsuite: test.functional.FunctionalTests
>     [junit] Tests run: 5, Failures: 0, Errors: 1, Time 
> elapsed: 14.949 sec
>     [junit] 
>     [junit] ------------- Standard Output ---------------
>     [junit] Testing stock sample.
>     [junit] Testing JWS...
>     [junit] Testing deployment...
>     [junit] Processing file: samples/stock/deploy.xml
>     [junit] <Admin>Done processing</Admin>
>     [junit] Testing service...
>     [junit] Testing service with SOAPAction: ""...
>     [junit] Testing undeployment...
>     [junit] Processing file: samples/stock/undeploy.xml
>     [junit] <Admin>Done processing</Admin>
>     [junit] Test complete.
>     [junit] Testing TCP transport.
>     [junit] Testing deployment...
>     [junit] Processing file: samples/stock/deploy.xml
>     [junit] <Admin>Done processing</Admin>
>     [junit] Testing service...
>     [junit] Testing TCP stock service...
>     [junit] Testing undeployment...
>     [junit] Processing file: samples/stock/undeploy.xml
>     [junit] <Admin>Done processing</Admin>
>     [junit] Test complete.
>     [junit] Testing transport sample.
>     [junit] Testing client deployment...
>     [junit] Processing 'samples/transport/client_deploy.xml'
>     [junit] Testing deployment...
>     [junit] Processing 'samples/transport/deploy.xml'
>     [junit] Testing service with symbol IBM...
>     [junit] AxisFault
>     [junit]   faultCode: http://xml.apache.org/axis/:Server.NoService
>     [junit]   faultString: The Axis engine couldn't find a 
> target service to invoke! targetService is urn:xmltoday-delayed-quotes
>     [junit]   faultActor: null
>     [junit]   faultDetails: null
>     [junit] 
>     [junit] Testing bidbuy sample.
>     [junit] Testing deployment...
>     [junit] Processing file: samples/bidbuy/deploy.xml
>     [junit] <Admin>Done processing</Admin>
>     [junit] Testing service...
>     [junit] 9000
>     [junit]   1 Tricorder
>     [junit]   3 Phasor
>     [junit] Test complete.
>     [junit] Testing address book sample.
>     [junit] Testing deployment...
>     [junit] Processing file: samples/addressbook/deploy.xml
>     [junit] <Admin>Done processing</Admin>
>     [junit] Testing service...
>     [junit] Test complete.
>     [junit] ------------- ---------------- ---------------
>     [junit] ------------- Standard Error -----------------
>     [junit] org.xml.sax.SAXException: FWK005 parse may not be 
> called while parsing.
>     [junit] 	at 
> org.apache.xerces.framework.XMLParser.parse(Unknown Source)
>     [junit] 	at 
> org.apache.xerces.jaxp.DocumentBuilderImpl.parse(Unknown Source)
>     [junit] 	at 
> javax.xml.parsers.DocumentBuilder.parse(Unknown Source)
>     [junit] 	at 
> org.apache.axis.utils.XMLUtils.newDocument(XMLUtils.java:145)
>     [junit] 	at 
> org.apache.axis.AxisEngine.initializeHandlers(AxisEngine.java:235)
>     [junit] 	at org.apache.axis.AxisEngine.init(AxisEngine.java:204)
>     [junit] 	at 
> org.apache.axis.AxisEngine.<init>(AxisEngine.java:181)
>     [junit] 	at 
> org.apache.axis.server.AxisServer.<init>(AxisServer.java:115)
>     [junit] 	at samples.transport.FileReader.run(FileReader.java:80)
>     [junit] java.lang.NullPointerException
>     [junit] 	at 
> org.apache.axis.AxisEngine.initializeHandlers(AxisEngine.java:237)
>     [junit] 	at org.apache.axis.AxisEngine.init(AxisEngine.java:204)
>     [junit] 	at 
> org.apache.axis.AxisEngine.<init>(AxisEngine.java:181)
>     [junit] 	at 
> org.apache.axis.server.AxisServer.<init>(AxisServer.java:115)
>     [junit] 	at samples.transport.FileReader.run(FileReader.java:80)
>     [junit] AxisFault
>     [junit]   faultCode: 
> http://xml.apache.org/axis/:Server.generalException
>     [junit]   faultString: Deploying service urn:cominfo: 
> couldn't find pivot Handler 'stock'
>     [junit]   faultActor: null
>     [junit]   faultDetails: null
>     [junit] 
>     [junit] 	at 
> org.apache.axis.utils.Admin.registerService(Admin.java:432)
>     [junit] 	at 
> org.apache.axis.AxisEngine.initializeServices(AxisEngine.java:297)
>     [junit] 	at org.apache.axis.AxisEngine.init(AxisEngine.java:205)
>     [junit] 	at 
> org.apache.axis.AxisEngine.<init>(AxisEngine.java:181)
>     [junit] 	at 
> org.apache.axis.server.AxisServer.<init>(AxisServer.java:115)
>     [junit] 	at samples.transport.FileReader.run(FileReader.java:80)
>     [junit] AxisFault
>     [junit]   faultCode: http://xml.apache.org/axis/:Server.NoService
>     [junit]   faultString: The Axis engine couldn't find a 
> target service to invoke! targetService is urn:xmltoday-delayed-quotes
>     [junit]   faultActor: null
>     [junit]   faultDetails: null
>     [junit] 
>     [junit] 	at 
> org.apache.axis.message.SOAPFaultElement.onEndChild(SOAPFaultE
> lement.java:113)
>     [junit] 	at 
> org.apache.axis.message.SOAPSAXHandler.endElement(SOAPSAXHandl
> er.java:636)
>     [junit] 	at 
> org.apache.xerces.parsers.SAXParser.endElement(Unknown Source)
>     [junit] 	at 
> org.apache.xerces.validators.common.XMLValidator.callEndElemen
> t(Unknown Source)
>     [junit] 	at 
> org.apache.xerces.framework.XMLDocumentScanner$ContentDispatch
> er.dispatch(Unknown Source)
>     [junit] 	at 
> org.apache.xerces.framework.XMLDocumentScanner.parseSome(Unkno
> wn Source)
>     [junit] 	at 
> org.apache.xerces.framework.XMLParser.parse(Unknown Source)
>     [junit] 	at javax.xml.parsers.SAXParser.parse(Unknown Source)
>     [junit] 	at 
> org.apache.axis.message.SAXAdapter.parse(SAXAdapter.java:35)
>     [junit] 	at 
> org.apache.axis.message.SOAPSAXHandler.parseToEnd(SOAPSAXHandl
> er.java:209)
>     [junit] 	at 
> org.apache.axis.message.SOAPEnvelope.getFirstBody(SOAPEnvelope
> .java:133)
>     [junit] 	at 
> org.apache.axis.client.ServiceClient.invoke(ServiceClient.java:305)
>     [junit] 	at 
> org.apache.axis.client.ServiceClient.invoke(ServiceClient.java:238)
>     [junit] 	at samples.transport.FileTest.main(FileTest.java:49)
>     [junit] 	at 
> test.functional.TestTransportSample.doTestIBM(TestTransportSam
> ple.java:100)
>     [junit] 	at 
> test.functional.TestTransportSample.testService(TestTransportS
> ample.java:124)
>     [junit] 	at java.lang.reflect.Method.invoke(Native Method)
>     [junit] 	at junit.framework.TestCase.runTest(TestCase.java:166)
>     [junit] 	at junit.framework.TestCase.runBare(TestCase.java:140)
>     [junit] 	at 
> junit.framework.TestResult$1.protect(TestResult.java:106)
>     [junit] 	at 
> junit.framework.TestResult.runProtected(TestResult.java:124)
>     [junit] 	at junit.framework.TestResult.run(TestResult.java:109)
>     [junit] 	at junit.framework.TestCase.run(TestCase.java:131)
>     [junit] 	at junit.framework.TestSuite.runTest(TestSuite.java:173)
>     [junit] 	at junit.framework.TestSuite.run(TestSuite.java:168)
>     [junit] 	at junit.framework.TestSuite.runTest(TestSuite.java:173)
>     [junit] 	at junit.framework.TestSuite.run(TestSuite.java:168)
>     [junit] 	at 
> org.apache.tools.ant.taskdefs.optional.junit.JUnitTestRunner.r
> un(Unknown Source)
>     [junit] 	at 
> org.apache.tools.ant.taskdefs.optional.junit.JUnitTestRunner.m
> ain(Unknown Source)
>     [junit] Using proxy without session maintenance.
>     [junit] >> Storing address for 'Purdue Boilermaker'
>     [junit] >> Querying address for 'Purdue Boilermaker'
>     [junit] >> Response is:
>     [junit] 	[ADDRESS NOT FOUND!]
>     [junit] >> Querying address for 'Purdue Boilermaker' again
>     [junit] >> Response is:
>     [junit] 	[ADDRESS NOT FOUND!]
>     [junit] 
>     [junit] 
>     [junit] Using proxy with session maintenance.
>     [junit] >> Storing address for 'Purdue Boilermaker'
>     [junit] >> Querying address for 'Purdue Boilermaker'
>     [junit] >> Response is:
>     [junit] 	1 University Drive
>     [junit] 	West Lafayette, IN 47907
>     [junit] 	Phone: (765) 494-4900
>     [junit] >> Querying address for 'Purdue Boilermaker' again
>     [junit] >> Response is:
>     [junit] 	1 University Drive
>     [junit] 	West Lafayette, IN 47907
>     [junit] 	Phone: (765) 494-4900
>     [junit] ------------- ---------------- ---------------
>     [junit] Testcase: testStockService took 8.115 sec
>     [junit] Testcase: testTCPTransportSample took 1.12 sec
>     [junit] Testcase: testService took 2.022 sec
>     [junit] 	Caused an ERROR
>     [junit] Fault returned from test: AxisFault
>     [junit]   faultCode: http://xml.apache.org/axis/:Server.NoService
>     [junit]   faultString: The Axis engine couldn't find a 
> target service to invoke! targetService is urn:xmltoday-delayed-quotes
>     [junit]   faultActor: null
>     [junit]   faultDetails: null
>     [junit] 
>     [junit] java.lang.Exception: Fault returned from test: AxisFault
>     [junit]   faultCode: http://xml.apache.org/axis/:Server.NoService
>     [junit]   faultString: The Axis engine couldn't find a 
> target service to invoke! targetService is urn:xmltoday-delayed-quotes
>     [junit]   faultActor: null
>     [junit]   faultDetails: null
>     [junit] 
>     [junit] 	at 
> test.functional.TestTransportSample.testService(TestTransportS
> ample.java:132)
>     [junit] 	at java.lang.reflect.Method.invoke(Native Method)
>     [junit] 	at junit.framework.TestCase.runTest(TestCase.java:166)
>     [junit] 	at junit.framework.TestCase.runBare(TestCase.java:140)
>     [junit] 	at 
> junit.framework.TestResult$1.protect(TestResult.java:106)
>     [junit] 	at 
> junit.framework.TestResult.runProtected(TestResult.java:124)
>     [junit] 	at junit.framework.TestResult.run(TestResult.java:109)
>     [junit] 	at junit.framework.TestCase.run(TestCase.java:131)
>     [junit] 	at junit.framework.TestSuite.runTest(TestSuite.java:173)
>     [junit] 	at junit.framework.TestSuite.run(TestSuite.java:168)
>     [junit] 	at junit.framework.TestSuite.runTest(TestSuite.java:173)
>     [junit] 	at junit.framework.TestSuite.run(TestSuite.java:168)
>     [junit] 	at 
> org.apache.tools.ant.taskdefs.optional.junit.JUnitTestRunner.r
> un(Unknown Source)
>     [junit] 	at 
> org.apache.tools.ant.taskdefs.optional.junit.JUnitTestRunner.m
> ain(Unknown Source)
>     [junit] 
>     [junit] Testcase: testBidBuyService took 2.197 sec
>     [junit] Testcase: testAddressBookService took 1.483 sec
>      [java] AxisListener quitting.
> 
> stop-functional-test-http-server:
>      [echo] Stopping test http server.
>      [java] Doing a quit
>      [java] SimpleAxisServer quitting.
>      [java] Admin service requested to quit, quitting.
>      [java] <Admin>Quitting</Admin>
> RunAxisFunctionalTestsTask.callStop successfully sent quit message.
> 
> BUILD FAILED
> 
> /home/rubys/jakarta/xml-axis/java/test/build_functional_tests.
> xml:66: Test test.functional.FunctionalTests failed
> 
> Total time: 41 seconds
> 

Mime
View raw message