axis-java-dev mailing list archives

Site index · List index
Message view « Date » · « Thread »
Top « Date » · « Thread »
From Sam Ruby <ru...@us.ibm.com>
Subject [GUMP] Function Test Failure - Axis
Date Fri, 29 Jun 2001 12:36:31 GMT
----------------------------------------------------
This email is autogenerated from the output from:
<http://jakarta.apache.org/builds/gump/2001-06-29/test-axis.html>
----------------------------------------------------

Buildfile: build.xml

setenv:
     [echo] --- Build environment for Axis ---
     [echo] --- Flags (Note: If the {property name} is displayed, 
     [echo]            then the component is not present)
     [echo] 
     [echo] --- Required Libraries ---
     [echo] xerces.present=true
     [echo] 
     [echo] --- Optional Libraries ---
     [echo] servlet.present=true
     [echo] junit.present=true
     [echo] 
     [echo] --- Property values
     [echo] debug=true
     [echo] deprecation=true

compile:

post-compile:

buildTest:
     [echo] junit package found ...

samples:

functional-tests:

functional-tests:

start-functional-test-tcp-server:
     [echo] Starting test tcp server.
     [java] AxisListener is listening on port 8088.
RunAxisFunctionalTestsTask.callStart successfully pinged server.

start-functional-test-http-server:
     [echo] Starting test http server.
RunAxisFunctionalTestsTask.callStart successfully pinged server.

junit-functional:
    [mkdir] Created dir: /home/rubys/jakarta/xml-axis/java/build/jws
     [copy] Copying 1 file to /home/rubys/jakarta/xml-axis/java/build/jws
    [junit] Running test.functional.FunctionalTests
    [junit] Creating FunctionalTests suite.
    [junit] Tests run: 5, Failures: 0, Errors: 2, Time elapsed: 12.453 sec
    [junit] Testsuite: test.functional.FunctionalTests
    [junit] Tests run: 5, Failures: 0, Errors: 2, Time elapsed: 12.453 sec
    [junit] 
    [junit] ------------- Standard Output ---------------
    [junit] Testing stock sample.
    [junit] Testing JWS...
    [junit] Testing deployment...
    [junit] Processing file: samples/stock/deploy.xml
    [junit] <Admin>Done processing</Admin>
    [junit] Testing service...
    [junit] Testing service with SOAPAction: ""...
    [junit] Testing undeployment...
    [junit] Processing file: samples/stock/undeploy.xml
    [junit] <Admin>Done processing</Admin>
    [junit] Test complete.
    [junit] Testing TCP transport.
    [junit] Deploying TCP client transport...Processing 'samples/transport/tcp/deploy.xml'
    [junit] Testing transport sample.
    [junit] Testing client deployment...
    [junit] Processing 'samples/transport/client_deploy.xml'
    [junit] Testing deployment...
    [junit] Processing 'samples/transport/deploy.xml'
    [junit] Testing service with symbol IBM...
    [junit] AxisFault
    [junit]   faultCode: http://xml.apache.org/axis/:Server.generalException
    [junit]   faultString: java.lang.Exception: Null response message!
    [junit] 	at org.apache.axis.client.ServiceClient.invoke(ServiceClient.java:304)
    [junit] 	at org.apache.axis.client.ServiceClient.invoke(ServiceClient.java:248)
    [junit] 	at samples.transport.FileTest.main(FileTest.java:49)
    [junit] 	at test.functional.TestTransportSample.doTestIBM(TestTransportSample.java:100)
    [junit] 	at test.functional.TestTransportSample.testService(TestTransportSample.java:124)
    [junit] 	at java.lang.reflect.Method.invoke(Native Method)
    [junit] 	at junit.framework.TestCase.runTest(TestCase.java:166)
    [junit] 	at junit.framework.TestCase.runBare(TestCase.java:140)
    [junit] 	at junit.framework.TestResult$1.protect(TestResult.java:106)
    [junit] 	at junit.framework.TestResult.runProtected(TestResult.java:124)
    [junit] 	at junit.framework.TestResult.run(TestResult.java:109)
    [junit] 	at junit.framework.TestCase.run(TestCase.java:131)
    [junit] 	at junit.framework.TestSuite.runTest(TestSuite.java:173)
    [junit] 	at junit.framework.TestSuite.run(TestSuite.java:168)
    [junit] 	at junit.framework.TestSuite.runTest(TestSuite.java:173)
    [junit] 	at junit.framework.TestSuite.run(TestSuite.java:168)
    [junit] 	at org.apache.tools.ant.taskdefs.optional.junit.JUnitTestRunner.run(Unknown Source)
    [junit] 	at org.apache.tools.ant.taskdefs.optional.junit.JUnitTestRunner.main(Unknown
Source)
    [junit] 
    [junit]   faultActor: null
    [junit]   faultDetails: null
    [junit] 
    [junit] Testing bidbuy sample.
    [junit] Testing deployment...
    [junit] Processing file: samples/bidbuy/deploy.xml
    [junit] <Admin>Done processing</Admin>
    [junit] Testing service...
    [junit] 9000
    [junit]   1 Tricorder
    [junit]   3 Phasor
    [junit] Test complete.
    [junit] Testing address book sample.
    [junit] Testing deployment...
    [junit] Processing file: samples/addressbook/deploy.xml
    [junit] <Admin>Done processing</Admin>
    [junit] Testing service...
    [junit] Test complete.
    [junit] ------------- ---------------- ---------------
    [junit] ------------- Standard Error -----------------
    [junit] Error processing 'samples/transport/tcp/deploy.xml'
    [junit] java.io.FileNotFoundException: samples/transport/tcp/deploy.xml (No such file
or directory)
    [junit] 	at java.io.FileInputStream.open(Native Method)
    [junit] 	at java.io.FileInputStream.<init>(FileInputStream.java:64)
    [junit] 	at org.apache.axis.utils.Admin.main(Admin.java:705)
    [junit] 	at test.functional.TestTCPTransportSample.doTransportDeploy(TestTCPTransportSample.java:82)
    [junit] 	at test.functional.TestTCPTransportSample.testTCPTransportSample(TestTCPTransportSample.java:144)
    [junit] 	at java.lang.reflect.Method.invoke(Native Method)
    [junit] 	at junit.framework.TestCase.runTest(TestCase.java:166)
    [junit] 	at junit.framework.TestCase.runBare(TestCase.java:140)
    [junit] 	at junit.framework.TestResult$1.protect(TestResult.java:106)
    [junit] 	at junit.framework.TestResult.runProtected(TestResult.java:124)
    [junit] 	at junit.framework.TestResult.run(TestResult.java:109)
    [junit] 	at junit.framework.TestCase.run(TestCase.java:131)
    [junit] 	at junit.framework.TestSuite.runTest(TestSuite.java:173)
    [junit] 	at junit.framework.TestSuite.run(TestSuite.java:168)
    [junit] 	at junit.framework.TestSuite.runTest(TestSuite.java:173)
    [junit] 	at junit.framework.TestSuite.run(TestSuite.java:168)
    [junit] 	at org.apache.tools.ant.taskdefs.optional.junit.JUnitTestRunner.run(Unknown Source)
    [junit] 	at org.apache.tools.ant.taskdefs.optional.junit.JUnitTestRunner.main(Unknown
Source)
    [junit] java.io.FileNotFoundException: samples/transport/tcp/deploy.xml (No such file
or directory)
    [junit] 	at java.io.FileInputStream.open(Native Method)
    [junit] 	at java.io.FileInputStream.<init>(FileInputStream.java:64)
    [junit] 	at org.apache.axis.utils.Admin.main(Admin.java:705)
    [junit] 	at test.functional.TestTCPTransportSample.doTransportDeploy(TestTCPTransportSample.java:82)
    [junit] 	at test.functional.TestTCPTransportSample.testTCPTransportSample(TestTCPTransportSample.java:144)
    [junit] 	at java.lang.reflect.Method.invoke(Native Method)
    [junit] 	at junit.framework.TestCase.runTest(TestCase.java:166)
    [junit] 	at junit.framework.TestCase.runBare(TestCase.java:140)
    [junit] 	at junit.framework.TestResult$1.protect(TestResult.java:106)
    [junit] 	at junit.framework.TestResult.runProtected(TestResult.java:124)
    [junit] 	at junit.framework.TestResult.run(TestResult.java:109)
    [junit] 	at junit.framework.TestCase.run(TestCase.java:131)
    [junit] 	at junit.framework.TestSuite.runTest(TestSuite.java:173)
    [junit] 	at junit.framework.TestSuite.run(TestSuite.java:168)
    [junit] 	at junit.framework.TestSuite.runTest(TestSuite.java:173)
    [junit] 	at junit.framework.TestSuite.run(TestSuite.java:168)
    [junit] 	at org.apache.tools.ant.taskdefs.optional.junit.JUnitTestRunner.run(Unknown Source)
    [junit] 	at org.apache.tools.ant.taskdefs.optional.junit.JUnitTestRunner.main(Unknown
Source)
    [junit] AxisFault
    [junit]   faultCode: http://xml.apache.org/axis/:Server.generalException
    [junit]   faultString: java.lang.Exception: Null response message!
    [junit] 	at org.apache.axis.client.ServiceClient.invoke(ServiceClient.java:304)
    [junit] 	at org.apache.axis.client.ServiceClient.invoke(ServiceClient.java:248)
    [junit] 	at samples.transport.FileTest.main(FileTest.java:49)
    [junit] 	at test.functional.TestTransportSample.doTestIBM(TestTransportSample.java:100)
    [junit] 	at test.functional.TestTransportSample.testService(TestTransportSample.java:124)
    [junit] 	at java.lang.reflect.Method.invoke(Native Method)
    [junit] 	at junit.framework.TestCase.runTest(TestCase.java:166)
    [junit] 	at junit.framework.TestCase.runBare(TestCase.java:140)
    [junit] 	at junit.framework.TestResult$1.protect(TestResult.java:106)
    [junit] 	at junit.framework.TestResult.runProtected(TestResult.java:124)
    [junit] 	at junit.framework.TestResult.run(TestResult.java:109)
    [junit] 	at junit.framework.TestCase.run(TestCase.java:131)
    [junit] 	at junit.framework.TestSuite.runTest(TestSuite.java:173)
    [junit] 	at junit.framework.TestSuite.run(TestSuite.java:168)
    [junit] 	at junit.framework.TestSuite.runTest(TestSuite.java:173)
    [junit] 	at junit.framework.TestSuite.run(TestSuite.java:168)
    [junit] 	at org.apache.tools.ant.taskdefs.optional.junit.JUnitTestRunner.run(Unknown Source)
    [junit] 	at org.apache.tools.ant.taskdefs.optional.junit.JUnitTestRunner.main(Unknown
Source)
    [junit] 
    [junit]   faultActor: null
    [junit]   faultDetails: null
    [junit] 
    [junit] 	at org.apache.axis.client.ServiceClient.invoke(ServiceClient.java:304)
    [junit] 	at org.apache.axis.client.ServiceClient.invoke(ServiceClient.java:248)
    [junit] 	at samples.transport.FileTest.main(FileTest.java:49)
    [junit] 	at test.functional.TestTransportSample.doTestIBM(TestTransportSample.java:100)
    [junit] 	at test.functional.TestTransportSample.testService(TestTransportSample.java:124)
    [junit] 	at java.lang.reflect.Method.invoke(Native Method)
    [junit] 	at junit.framework.TestCase.runTest(TestCase.java:166)
    [junit] 	at junit.framework.TestCase.runBare(TestCase.java:140)
    [junit] 	at junit.framework.TestResult$1.protect(TestResult.java:106)
    [junit] 	at junit.framework.TestResult.runProtected(TestResult.java:124)
    [junit] 	at junit.framework.TestResult.run(TestResult.java:109)
    [junit] 	at junit.framework.TestCase.run(TestCase.java:131)
    [junit] 	at junit.framework.TestSuite.runTest(TestSuite.java:173)
    [junit] 	at junit.framework.TestSuite.run(TestSuite.java:168)
    [junit] 	at junit.framework.TestSuite.runTest(TestSuite.java:173)
    [junit] 	at junit.framework.TestSuite.run(TestSuite.java:168)
    [junit] 	at org.apache.tools.ant.taskdefs.optional.junit.JUnitTestRunner.run(Unknown Source)
    [junit] 	at org.apache.tools.ant.taskdefs.optional.junit.JUnitTestRunner.main(Unknown
Source)
    [junit] Using proxy without session maintenance.
    [junit] >> Storing address for 'Purdue Boilermaker'
    [junit] >> Querying address for 'Purdue Boilermaker'
    [junit] >> Response is:
    [junit] 	[ADDRESS NOT FOUND!]
    [junit] >> Querying address for 'Purdue Boilermaker' again
    [junit] >> Response is:
    [junit] 	[ADDRESS NOT FOUND!]
    [junit] 
    [junit] 
    [junit] Using proxy with session maintenance.
    [junit] >> Storing address for 'Purdue Boilermaker'
    [junit] >> Querying address for 'Purdue Boilermaker'
    [junit] >> Response is:
    [junit] 	1 University Drive
    [junit] 	West Lafayette, IN 47907
    [junit] 	Phone: (765) 494-4900
    [junit] >> Querying address for 'Purdue Boilermaker' again
    [junit] >> Response is:
    [junit] 	1 University Drive
    [junit] 	West Lafayette, IN 47907
    [junit] 	Phone: (765) 494-4900
    [junit] ------------- ---------------- ---------------
    [junit] Testcase: testStockService took 7.549 sec
    [junit] Testcase: testTCPTransportSample took 0.206 sec
    [junit] 	Caused an ERROR
    [junit] Fault returned from test: java.io.FileNotFoundException: samples/transport/tcp/deploy.xml
(No such file or directory)
    [junit] java.lang.Exception: Fault returned from test: java.io.FileNotFoundException:
samples/transport/tcp/deploy.xml (No such file or directory)
    [junit] 	at test.functional.TestTCPTransportSample.testTCPTransportSample(TestTCPTransportSample.java:164)
    [junit] 	at java.lang.reflect.Method.invoke(Native Method)
    [junit] 	at junit.framework.TestCase.runTest(TestCase.java:166)
    [junit] 	at junit.framework.TestCase.runBare(TestCase.java:140)
    [junit] 	at junit.framework.TestResult$1.protect(TestResult.java:106)
    [junit] 	at junit.framework.TestResult.runProtected(TestResult.java:124)
    [junit] 	at junit.framework.TestResult.run(TestResult.java:109)
    [junit] 	at junit.framework.TestCase.run(TestCase.java:131)
    [junit] 	at junit.framework.TestSuite.runTest(TestSuite.java:173)
    [junit] 	at junit.framework.TestSuite.run(TestSuite.java:168)
    [junit] 	at junit.framework.TestSuite.runTest(TestSuite.java:173)
    [junit] 	at junit.framework.TestSuite.run(TestSuite.java:168)
    [junit] 	at org.apache.tools.ant.taskdefs.optional.junit.JUnitTestRunner.run(Unknown Source)
    [junit] 	at org.apache.tools.ant.taskdefs.optional.junit.JUnitTestRunner.main(Unknown
Source)
    [junit] 
    [junit] Testcase: testService took 1.251 sec
    [junit] 	Caused an ERROR
    [junit] Fault returned from test: AxisFault
    [junit]   faultCode: http://xml.apache.org/axis/:Server.generalException
    [junit]   faultString: java.lang.Exception: Null response message!
    [junit] 	at org.apache.axis.client.ServiceClient.invoke(ServiceClient.java:304)
    [junit] 	at org.apache.axis.client.ServiceClient.invoke(ServiceClient.java:248)
    [junit] 	at samples.transport.FileTest.main(FileTest.java:49)
    [junit] 	at test.functional.TestTransportSample.doTestIBM(TestTransportSample.java:100)
    [junit] 	at test.functional.TestTransportSample.testService(TestTransportSample.java:124)
    [junit] 	at java.lang.reflect.Method.invoke(Native Method)
    [junit] 	at junit.framework.TestCase.runTest(TestCase.java:166)
    [junit] 	at junit.framework.TestCase.runBare(TestCase.java:140)
    [junit] 	at junit.framework.TestResult$1.protect(TestResult.java:106)
    [junit] 	at junit.framework.TestResult.runProtected(TestResult.java:124)
    [junit] 	at junit.framework.TestResult.run(TestResult.java:109)
    [junit] 	at junit.framework.TestCase.run(TestCase.java:131)
    [junit] 	at junit.framework.TestSuite.runTest(TestSuite.java:173)
    [junit] 	at junit.framework.TestSuite.run(TestSuite.java:168)
    [junit] 	at junit.framework.TestSuite.runTest(TestSuite.java:173)
    [junit] 	at junit.framework.TestSuite.run(TestSuite.java:168)
    [junit] 	at org.apache.tools.ant.taskdefs.optional.junit.JUnitTestRunner.run(Unknown Source)
    [junit] 	at org.apache.tools.ant.taskdefs.optional.junit.JUnitTestRunner.main(Unknown
Source)
    [junit] 
    [junit]   faultActor: null
    [junit]   faultDetails: null
    [junit] 
    [junit] java.lang.Exception: Fault returned from test: AxisFault
    [junit]   faultCode: http://xml.apache.org/axis/:Server.generalException
    [junit]   faultString: java.lang.Exception: Null response message!
    [junit] 	at org.apache.axis.client.ServiceClient.invoke(ServiceClient.java:304)
    [junit] 	at org.apache.axis.client.ServiceClient.invoke(ServiceClient.java:248)
    [junit] 	at samples.transport.FileTest.main(FileTest.java:49)
    [junit] 	at test.functional.TestTransportSample.doTestIBM(TestTransportSample.java:100)
    [junit] 	at test.functional.TestTransportSample.testService(TestTransportSample.java:124)
    [junit] 	at java.lang.reflect.Method.invoke(Native Method)
    [junit] 	at junit.framework.TestCase.runTest(TestCase.java:166)
    [junit] 	at junit.framework.TestCase.runBare(TestCase.java:140)
    [junit] 	at junit.framework.TestResult$1.protect(TestResult.java:106)
    [junit] 	at junit.framework.TestResult.runProtected(TestResult.java:124)
    [junit] 	at junit.framework.TestResult.run(TestResult.java:109)
    [junit] 	at junit.framework.TestCase.run(TestCase.java:131)
    [junit] 	at junit.framework.TestSuite.runTest(TestSuite.java:173)
    [junit] 	at junit.framework.TestSuite.run(TestSuite.java:168)
    [junit] 	at junit.framework.TestSuite.runTest(TestSuite.java:173)
    [junit] 	at junit.framework.TestSuite.run(TestSuite.java:168)
    [junit] 	at org.apache.tools.ant.taskdefs.optional.junit.JUnitTestRunner.run(Unknown Source)
    [junit] 	at org.apache.tools.ant.taskdefs.optional.junit.JUnitTestRunner.main(Unknown
Source)
    [junit] 
    [junit]   faultActor: null
    [junit]   faultDetails: null
    [junit] 
    [junit] 	at test.functional.TestTransportSample.testService(TestTransportSample.java:132)
    [junit] 	at java.lang.reflect.Method.invoke(Native Method)
    [junit] 	at junit.framework.TestCase.runTest(TestCase.java:166)
    [junit] 	at junit.framework.TestCase.runBare(TestCase.java:140)
    [junit] 	at junit.framework.TestResult$1.protect(TestResult.java:106)
    [junit] 	at junit.framework.TestResult.runProtected(TestResult.java:124)
    [junit] 	at junit.framework.TestResult.run(TestResult.java:109)
    [junit] 	at junit.framework.TestCase.run(TestCase.java:131)
    [junit] 	at junit.framework.TestSuite.runTest(TestSuite.java:173)
    [junit] 	at junit.framework.TestSuite.run(TestSuite.java:168)
    [junit] 	at junit.framework.TestSuite.runTest(TestSuite.java:173)
    [junit] 	at junit.framework.TestSuite.run(TestSuite.java:168)
    [junit] 	at org.apache.tools.ant.taskdefs.optional.junit.JUnitTestRunner.run(Unknown Source)
    [junit] 	at org.apache.tools.ant.taskdefs.optional.junit.JUnitTestRunner.main(Unknown
Source)
    [junit] 
    [junit] Testcase: testBidBuyService took 1.991 sec
    [junit] Testcase: testAddressBookService took 1.441 sec
     [java] AxisListener quitting.

stop-functional-test-http-server:
     [echo] Stopping test http server.
     [java] Doing a quit
     [java] SimpleAxisServer quitting.
     [java] Admin service requested to quit, quitting.
     [java] <Admin>Quitting</Admin>
RunAxisFunctionalTestsTask.callStop successfully sent quit message.

BUILD FAILED

/home/rubys/jakarta/xml-axis/java/test/build_functional_tests.xml:66: Test test.functional.FunctionalTests
failed

Total time: 39 seconds

Mime
View raw message