axis-c-dev mailing list archives

Site index · List index
Message view « Date » · « Thread »
Top « Date » · « Thread »
From "Jim Seipp" <Jim_Se...@avid.com>
Subject compiling axis2_svc_skel_WSDLInteropTestDocLitService.c
Date Thu, 12 Apr 2007 12:33:49 GMT
Hi Dinesh,

I am having problems compiling
axis2_svc_skel_WSDLInteropTestDocLitService.c
Most of the other codegen files you sent me compile correctly.

Thanks,

Jim

------ Build started: Project: XenaWS, Configuration: Debug Win32 ------

Compiling...
axis2_svc_skel_WSDLInteropTestDocLitService.c
c:\Download\Apachee Access
2\Dinesh\codegen\codegen\XenaWS\XenaWS\axis2_skel_WSDLInteropTestDocLitS
ervice.h(39) : error C2146: syntax error : missing ')' before identifier
'param0'
c:\Download\Apachee Access
2\Dinesh\codegen\codegen\XenaWS\XenaWS\axis2_skel_WSDLInteropTestDocLitS
ervice.h(39) : error C2144: syntax error : '<Unknown>' should be
preceded by '<Unknown>'
c:\Download\Apachee Access
2\Dinesh\codegen\codegen\XenaWS\XenaWS\axis2_skel_WSDLInteropTestDocLitS
ervice.h(39) : error C2144: syntax error : '<Unknown>' should be
preceded by '<Unknown>'
c:\Download\Apachee Access
2\Dinesh\codegen\codegen\XenaWS\XenaWS\axis2_skel_WSDLInteropTestDocLitS
ervice.h(39) : error C2143: syntax error : missing ')' before
'identifier'
c:\Download\Apachee Access
2\Dinesh\codegen\codegen\XenaWS\XenaWS\axis2_skel_WSDLInteropTestDocLitS
ervice.h(39) : error C2081: 'echoVoid' : name in formal parameter list
illegal
c:\Download\Apachee Access
2\Dinesh\codegen\codegen\XenaWS\XenaWS\axis2_skel_WSDLInteropTestDocLitS
ervice.h(39) : error C2061: syntax error : identifier 'param0'
c:\Download\Apachee Access
2\Dinesh\codegen\codegen\XenaWS\XenaWS\axis2_skel_WSDLInteropTestDocLitS
ervice.h(39) : error C2059: syntax error : ';'
c:\Download\Apachee Access
2\Dinesh\codegen\codegen\XenaWS\XenaWS\axis2_skel_WSDLInteropTestDocLitS
ervice.h(39) : error C2059: syntax error : ')'
c:\Download\Apachee Access
2\Dinesh\codegen\codegen\XenaWS\XenaWS\axis2_skel_WSDLInteropTestDocLitS
ervice.h(50) : error C2146: syntax error : missing ')' before identifier
'param2'
c:\Download\Apachee Access
2\Dinesh\codegen\codegen\XenaWS\XenaWS\axis2_skel_WSDLInteropTestDocLitS
ervice.h(50) : error C2144: syntax error : '<Unknown>' should be
preceded by '<Unknown>'
c:\Download\Apachee Access
2\Dinesh\codegen\codegen\XenaWS\XenaWS\axis2_skel_WSDLInteropTestDocLitS
ervice.h(50) : error C2144: syntax error : '<Unknown>' should be
preceded by '<Unknown>'
c:\Download\Apachee Access
2\Dinesh\codegen\codegen\XenaWS\XenaWS\axis2_skel_WSDLInteropTestDocLitS
ervice.h(50) : error C2143: syntax error : missing ')' before
'identifier'
c:\Download\Apachee Access
2\Dinesh\codegen\codegen\XenaWS\XenaWS\axis2_skel_WSDLInteropTestDocLitS
ervice.h(50) : error C2081: 'echoStringArray' : name in formal parameter
list illegal
c:\Download\Apachee Access
2\Dinesh\codegen\codegen\XenaWS\XenaWS\axis2_skel_WSDLInteropTestDocLitS
ervice.h(50) : error C2061: syntax error : identifier 'param2'
c:\Download\Apachee Access
2\Dinesh\codegen\codegen\XenaWS\XenaWS\axis2_skel_WSDLInteropTestDocLitS
ervice.h(50) : error C2059: syntax error : ';'
c:\Download\Apachee Access
2\Dinesh\codegen\codegen\XenaWS\XenaWS\axis2_skel_WSDLInteropTestDocLitS
ervice.h(50) : error C2059: syntax error : ')'
c:\Download\Apachee Access
2\Dinesh\codegen\codegen\XenaWS\XenaWS\axis2_skel_WSDLInteropTestDocLitS
ervice.h(61) : error C2146: syntax error : missing ')' before identifier
'param4'
c:\Download\Apachee Access
2\Dinesh\codegen\codegen\XenaWS\XenaWS\axis2_skel_WSDLInteropTestDocLitS
ervice.h(61) : error C2144: syntax error : '<Unknown>' should be
preceded by '<Unknown>'
c:\Download\Apachee Access
2\Dinesh\codegen\codegen\XenaWS\XenaWS\axis2_skel_WSDLInteropTestDocLitS
ervice.h(61) : error C2144: syntax error : '<Unknown>' should be
preceded by '<Unknown>'
c:\Download\Apachee Access
2\Dinesh\codegen\codegen\XenaWS\XenaWS\axis2_skel_WSDLInteropTestDocLitS
ervice.h(61) : error C2143: syntax error : missing ')' before
'identifier'
c:\Download\Apachee Access
2\Dinesh\codegen\codegen\XenaWS\XenaWS\axis2_skel_WSDLInteropTestDocLitS
ervice.h(61) : error C2081: 'echoStruct' : name in formal parameter list
illegal
c:\Download\Apachee Access
2\Dinesh\codegen\codegen\XenaWS\XenaWS\axis2_skel_WSDLInteropTestDocLitS
ervice.h(61) : error C2061: syntax error : identifier 'param4'
c:\Download\Apachee Access
2\Dinesh\codegen\codegen\XenaWS\XenaWS\axis2_skel_WSDLInteropTestDocLitS
ervice.h(61) : error C2059: syntax error : ';'
c:\Download\Apachee Access
2\Dinesh\codegen\codegen\XenaWS\XenaWS\axis2_skel_WSDLInteropTestDocLitS
ervice.h(61) : error C2059: syntax error : ')'
c:\Download\Apachee Access
2\Dinesh\codegen\codegen\XenaWS\XenaWS\axis2_skel_WSDLInteropTestDocLitS
ervice.h(72) : error C2146: syntax error : missing ')' before identifier
'param6'
c:\Download\Apachee Access
2\Dinesh\codegen\codegen\XenaWS\XenaWS\axis2_skel_WSDLInteropTestDocLitS
ervice.h(72) : error C2144: syntax error : '<Unknown>' should be
preceded by '<Unknown>'
c:\Download\Apachee Access
2\Dinesh\codegen\codegen\XenaWS\XenaWS\axis2_skel_WSDLInteropTestDocLitS
ervice.h(72) : error C2144: syntax error : '<Unknown>' should be
preceded by '<Unknown>'
c:\Download\Apachee Access
2\Dinesh\codegen\codegen\XenaWS\XenaWS\axis2_skel_WSDLInteropTestDocLitS
ervice.h(72) : error C2143: syntax error : missing ')' before
'identifier'
c:\Download\Apachee Access
2\Dinesh\codegen\codegen\XenaWS\XenaWS\axis2_skel_WSDLInteropTestDocLitS
ervice.h(72) : error C2081: 'echoString' : name in formal parameter list
illegal
c:\Download\Apachee Access
2\Dinesh\codegen\codegen\XenaWS\XenaWS\axis2_skel_WSDLInteropTestDocLitS
ervice.h(72) : error C2061: syntax error : identifier 'param6'
c:\Download\Apachee Access
2\Dinesh\codegen\codegen\XenaWS\XenaWS\axis2_skel_WSDLInteropTestDocLitS
ervice.h(72) : error C2059: syntax error : ';'
c:\Download\Apachee Access
2\Dinesh\codegen\codegen\XenaWS\XenaWS\axis2_skel_WSDLInteropTestDocLitS
ervice.h(72) : error C2059: syntax error : ')'
c:\Download\Apachee Access
2\Dinesh\codegen\codegen\XenaWS\XenaWS\axis2_svc_skel_WSDLInteropTestDoc
LitService.c(134) : error C2065: 'echoVoid' : undeclared identifier
c:\Download\Apachee Access
2\Dinesh\codegen\codegen\XenaWS\XenaWS\axis2_svc_skel_WSDLInteropTestDoc
LitService.c(134) : error C2146: syntax error : missing ';' before
identifier 'input_val1_1'
c:\Download\Apachee Access
2\Dinesh\codegen\codegen\XenaWS\XenaWS\axis2_svc_skel_WSDLInteropTestDoc
LitService.c(134) : error C2144: syntax error : '<Unknown>' should be
preceded by '<Unknown>'
c:\Download\Apachee Access
2\Dinesh\codegen\codegen\XenaWS\XenaWS\axis2_svc_skel_WSDLInteropTestDoc
LitService.c(134) : error C2144: syntax error : '<Unknown>' should be
preceded by '<Unknown>'
c:\Download\Apachee Access
2\Dinesh\codegen\codegen\XenaWS\XenaWS\axis2_svc_skel_WSDLInteropTestDoc
LitService.c(134) : error C2143: syntax error : missing ';' before
'identifier'
c:\Download\Apachee Access
2\Dinesh\codegen\codegen\XenaWS\XenaWS\axis2_svc_skel_WSDLInteropTestDoc
LitService.c(134) : error C2065: 'input_val1_1' : undeclared identifier
c:\Download\Apachee Access
2\Dinesh\codegen\codegen\XenaWS\XenaWS\axis2_svc_skel_WSDLInteropTestDoc
LitService.c(136) : error C2275: 'axis2_echoStringArrayResponse_t' :
illegal use of this type as an expression
        c:\Download\Apachee Access
2\Dinesh\codegen\codegen\XenaWS\XenaWS\axis2_echoStringArrayResponse.h(3
2) : see declaration of 'axis2_echoStringArrayResponse_t'
c:\Download\Apachee Access
2\Dinesh\codegen\codegen\XenaWS\XenaWS\axis2_svc_skel_WSDLInteropTestDoc
LitService.c(136) : error C2065: 'ret_val2' : undeclared identifier
c:\Download\Apachee Access
2\Dinesh\codegen\codegen\XenaWS\XenaWS\axis2_svc_skel_WSDLInteropTestDoc
LitService.c(137) : error C2065: 'echoStringArray' : undeclared
identifier
c:\Download\Apachee Access
2\Dinesh\codegen\codegen\XenaWS\XenaWS\axis2_svc_skel_WSDLInteropTestDoc
LitService.c(137) : error C2146: syntax error : missing ';' before
identifier 'input_val2_1'
c:\Download\Apachee Access
2\Dinesh\codegen\codegen\XenaWS\XenaWS\axis2_svc_skel_WSDLInteropTestDoc
LitService.c(137) : error C2144: syntax error : '<Unknown>' should be
preceded by '<Unknown>'
c:\Download\Apachee Access
2\Dinesh\codegen\codegen\XenaWS\XenaWS\axis2_svc_skel_WSDLInteropTestDoc
LitService.c(137) : error C2144: syntax error : '<Unknown>' should be
preceded by '<Unknown>'
c:\Download\Apachee Access
2\Dinesh\codegen\codegen\XenaWS\XenaWS\axis2_svc_skel_WSDLInteropTestDoc
LitService.c(137) : error C2143: syntax error : missing ';' before
'identifier'
c:\Download\Apachee Access
2\Dinesh\codegen\codegen\XenaWS\XenaWS\axis2_svc_skel_WSDLInteropTestDoc
LitService.c(137) : error C2065: 'input_val2_1' : undeclared identifier
c:\Download\Apachee Access
2\Dinesh\codegen\codegen\XenaWS\XenaWS\axis2_svc_skel_WSDLInteropTestDoc
LitService.c(139) : error C2275: 'axis2_echoStructResponse_t' : illegal
use of this type as an expression
        c:\Download\Apachee Access
2\Dinesh\codegen\codegen\XenaWS\XenaWS\axis2_echoStructResponse.h(32) :
see declaration of 'axis2_echoStructResponse_t'
c:\Download\Apachee Access
2\Dinesh\codegen\codegen\XenaWS\XenaWS\axis2_svc_skel_WSDLInteropTestDoc
LitService.c(139) : error C2065: 'ret_val3' : undeclared identifier
c:\Download\Apachee Access
2\Dinesh\codegen\codegen\XenaWS\XenaWS\axis2_svc_skel_WSDLInteropTestDoc
LitService.c(140) : error C2065: 'echoStruct' : undeclared identifier
c:\Download\Apachee Access
2\Dinesh\codegen\codegen\XenaWS\XenaWS\axis2_svc_skel_WSDLInteropTestDoc
LitService.c(140) : error C2146: syntax error : missing ';' before
identifier 'input_val3_1'
c:\Download\Apachee Access
2\Dinesh\codegen\codegen\XenaWS\XenaWS\axis2_svc_skel_WSDLInteropTestDoc
LitService.c(140) : error C2144: syntax error : '<Unknown>' should be
preceded by '<Unknown>'
c:\Download\Apachee Access
2\Dinesh\codegen\codegen\XenaWS\XenaWS\axis2_svc_skel_WSDLInteropTestDoc
LitService.c(140) : error C2144: syntax error : '<Unknown>' should be
preceded by '<Unknown>'
c:\Download\Apachee Access
2\Dinesh\codegen\codegen\XenaWS\XenaWS\axis2_svc_skel_WSDLInteropTestDoc
LitService.c(140) : error C2143: syntax error : missing ';' before
'identifier'
c:\Download\Apachee Access
2\Dinesh\codegen\codegen\XenaWS\XenaWS\axis2_svc_skel_WSDLInteropTestDoc
LitService.c(140) : error C2065: 'input_val3_1' : undeclared identifier
c:\Download\Apachee Access
2\Dinesh\codegen\codegen\XenaWS\XenaWS\axis2_svc_skel_WSDLInteropTestDoc
LitService.c(142) : error C2275: 'axis2_echoStringResponse_t' : illegal
use of this type as an expression
        c:\Download\Apachee Access
2\Dinesh\codegen\codegen\XenaWS\XenaWS\axis2_echoStringResponse.h(30) :
see declaration of 'axis2_echoStringResponse_t'
c:\Download\Apachee Access
2\Dinesh\codegen\codegen\XenaWS\XenaWS\axis2_svc_skel_WSDLInteropTestDoc
LitService.c(142) : error C2065: 'ret_val4' : undeclared identifier
c:\Download\Apachee Access
2\Dinesh\codegen\codegen\XenaWS\XenaWS\axis2_svc_skel_WSDLInteropTestDoc
LitService.c(143) : error C2065: 'echoString' : undeclared identifier
c:\Download\Apachee Access
2\Dinesh\codegen\codegen\XenaWS\XenaWS\axis2_svc_skel_WSDLInteropTestDoc
LitService.c(143) : error C2146: syntax error : missing ';' before
identifier 'input_val4_1'
c:\Download\Apachee Access
2\Dinesh\codegen\codegen\XenaWS\XenaWS\axis2_svc_skel_WSDLInteropTestDoc
LitService.c(143) : error C2144: syntax error : '<Unknown>' should be
preceded by '<Unknown>'
c:\Download\Apachee Access
2\Dinesh\codegen\codegen\XenaWS\XenaWS\axis2_svc_skel_WSDLInteropTestDoc
LitService.c(143) : error C2144: syntax error : '<Unknown>' should be
preceded by '<Unknown>'
c:\Download\Apachee Access
2\Dinesh\codegen\codegen\XenaWS\XenaWS\axis2_svc_skel_WSDLInteropTestDoc
LitService.c(143) : error C2143: syntax error : missing ';' before
'identifier'
c:\Download\Apachee Access
2\Dinesh\codegen\codegen\XenaWS\XenaWS\axis2_svc_skel_WSDLInteropTestDoc
LitService.c(143) : error C2065: 'input_val4_1' : undeclared identifier
c:\Download\Apachee Access
2\Dinesh\codegen\codegen\XenaWS\XenaWS\axis2_svc_skel_WSDLInteropTestDoc
LitService.c(160) : warning C4047: '=' : 'int' differs in levels of
indirection from 'axiom_node_t *'
c:\Download\Apachee Access
2\Dinesh\codegen\codegen\XenaWS\XenaWS\axis2_svc_skel_WSDLInteropTestDoc
LitService.c(161) : warning C4013:
'axis2_skel_WSDLInteropTestDocLitService_echoVoid' undefined; assuming
extern returning int
c:\Download\Apachee Access
2\Dinesh\codegen\codegen\XenaWS\XenaWS\axis2_svc_skel_WSDLInteropTestDoc
LitService.c(162) : warning C4047: '=' : 'axis2_echoVoidResponse_t *'
differs in levels of indirection from 'int'
c:\Download\Apachee Access
2\Dinesh\codegen\codegen\XenaWS\XenaWS\axis2_svc_skel_WSDLInteropTestDoc
LitService.c(170) : warning C4133: '=' : incompatible types - from
'axis2_echoVoidResponse_t *' to 'axiom_node_t *'
c:\Download\Apachee Access
2\Dinesh\codegen\codegen\XenaWS\XenaWS\axis2_svc_skel_WSDLInteropTestDoc
LitService.c(183) : warning C4047: '=' : 'int' differs in levels of
indirection from 'axiom_node_t *'
c:\Download\Apachee Access
2\Dinesh\codegen\codegen\XenaWS\XenaWS\axis2_svc_skel_WSDLInteropTestDoc
LitService.c(184) : warning C4013:
'axis2_skel_WSDLInteropTestDocLitService_echoStringArray' undefined;
assuming extern returning int
c:\Download\Apachee Access
2\Dinesh\codegen\codegen\XenaWS\XenaWS\axis2_svc_skel_WSDLInteropTestDoc
LitService.c(186) : warning C4047: '==' : 'void *' differs in levels of
indirection from 'int'
c:\Download\Apachee Access
2\Dinesh\codegen\codegen\XenaWS\XenaWS\axis2_svc_skel_WSDLInteropTestDoc
LitService.c(193) : warning C4047: '=' : 'axiom_node_t *' differs in
levels of indirection from 'int'
c:\Download\Apachee Access
2\Dinesh\codegen\codegen\XenaWS\XenaWS\axis2_svc_skel_WSDLInteropTestDoc
LitService.c(206) : warning C4047: '=' : 'int' differs in levels of
indirection from 'axiom_node_t *'
c:\Download\Apachee Access
2\Dinesh\codegen\codegen\XenaWS\XenaWS\axis2_svc_skel_WSDLInteropTestDoc
LitService.c(207) : warning C4013:
'axis2_skel_WSDLInteropTestDocLitService_echoStruct' undefined; assuming
extern returning int
c:\Download\Apachee Access
2\Dinesh\codegen\codegen\XenaWS\XenaWS\axis2_svc_skel_WSDLInteropTestDoc
LitService.c(209) : warning C4047: '==' : 'void *' differs in levels of
indirection from 'int'
c:\Download\Apachee Access
2\Dinesh\codegen\codegen\XenaWS\XenaWS\axis2_svc_skel_WSDLInteropTestDoc
LitService.c(216) : warning C4047: '=' : 'axiom_node_t *' differs in
levels of indirection from 'int'
c:\Download\Apachee Access
2\Dinesh\codegen\codegen\XenaWS\XenaWS\axis2_svc_skel_WSDLInteropTestDoc
LitService.c(229) : warning C4047: '=' : 'int' differs in levels of
indirection from 'axiom_node_t *'
c:\Download\Apachee Access
2\Dinesh\codegen\codegen\XenaWS\XenaWS\axis2_svc_skel_WSDLInteropTestDoc
LitService.c(230) : warning C4013:
'axis2_skel_WSDLInteropTestDocLitService_echoString' undefined; assuming
extern returning int
c:\Download\Apachee Access
2\Dinesh\codegen\codegen\XenaWS\XenaWS\axis2_svc_skel_WSDLInteropTestDoc
LitService.c(232) : warning C4047: '==' : 'void *' differs in levels of
indirection from 'int'
c:\Download\Apachee Access
2\Dinesh\codegen\codegen\XenaWS\XenaWS\axis2_svc_skel_WSDLInteropTestDoc
LitService.c(239) : warning C4047: '=' : 'axiom_node_t *' differs in
levels of indirection from 'int'

Build log was saved at "file://c:\Download\Apachee Access
2\Dinesh\codegen\codegen\XenaWS\XenaWS\Debug\BuildLog.htm"
XenaWS - 62 error(s), 16 warning(s)


---------------------- Done ----------------------

    Build: 0 succeeded, 1 failed, 0 skipped



---------------------------------------------------------------------
To unsubscribe, e-mail: axis-c-dev-unsubscribe@ws.apache.org
For additional commands, e-mail: axis-c-dev-help@ws.apache.org


Mime
View raw message